Diagnosed failure

Parameters/TestRpc.TestCallWithChainCertAndChainCA/SSL_TCP: /data0/somelongdirectorytoavoidrpathissues/src/kudu/src/kudu/rpc/rpc-test.cc:270: Failure
Failed
Bad status: Runtime error: could not verify certificate chain (error with cert: subject=CN = localhost, ST = sadfjas, C = AS, emailAddress = sdflkdsajf, O = lskdfjlsad, OU = sldfkja, issuer=C = AS, ST = ASDfkjdhf, L = lskdjf, O = saldfja, OU = skdjf, CN = localhost, emailAddress = sadjflkadsj): : certificate has expired
Google Test trace:
/data0/somelongdirectorytoavoidrpathissues/src/kudu/src/kudu/rpc/rpc-test.cc:267: Connecting to 0.0.0.0:43105
I20260924 00:28:40.190308  4076 test_util.cc:175] -----------------------------------------------
I20260924 00:28:40.190563  4076 test_util.cc:176] Had fatal failures, leaving test files at /tmp/dist-test-taskoYFQzn/test-tmp/rpc-test.5.Parameters_TestRpc.TestCallWithChainCertAndChainCA_SSL_TCP.1790209718831120-4076-0

Full log

Note: This is test shard 6 of 8.
[==========] Running 21 tests from 2 test suites.
[----------] Global test environment set-up.
[----------] 20 tests from Parameters/TestRpc
[ RUN      ] Parameters/TestRpc.TestMessengerCreateDestroy/SSL_TCP
WARNING: Logging before InitGoogleLogging() is written to STDERR
I20260924 00:28:38.930303  4076 rpc-test.cc:169] started messenger TestCreateDestroy
[       OK ] Parameters/TestRpc.TestMessengerCreateDestroy/SSL_TCP (1178 ms)
[ RUN      ] Parameters/TestRpc.TestNegotiationDeadlock/SSL_TCP
I20260924 00:28:40.080379  4098 acceptor_pool.cc:254] collecting diagnostics on the listening RPC socket 0.0.0.0:36505 every 8 connection(s)
I20260924 00:28:40.082080  4099 acceptor_pool.cc:254] collecting diagnostics on the listening RPC socket 0.0.0.0:36505 every 8 connection(s)
[       OK ] Parameters/TestRpc.TestNegotiationDeadlock/SSL_TCP (73 ms)
[ RUN      ] Parameters/TestRpc.TestCallWithChainCertAndChainCA/SSL_TCP
I20260924 00:28:40.160663  4114 acceptor_pool.cc:254] collecting diagnostics on the listening RPC socket 0.0.0.0:43105 every 8 connection(s)
I20260924 00:28:40.163031  4115 acceptor_pool.cc:254] collecting diagnostics on the listening RPC socket 0.0.0.0:43105 every 8 connection(s)
/data0/somelongdirectorytoavoidrpathissues/src/kudu/src/kudu/rpc/rpc-test.cc:270: Failure
Failed
Bad status: Runtime error: could not verify certificate chain (error with cert: subject=CN = localhost, ST = sadfjas, C = AS, emailAddress = sdflkdsajf, O = lskdfjlsad, OU = sldfkja, issuer=C = AS, ST = ASDfkjdhf, L = lskdjf, O = saldfja, OU = skdjf, CN = localhost, emailAddress = sadjflkadsj): : certificate has expired
Google Test trace:
/data0/somelongdirectorytoavoidrpathissues/src/kudu/src/kudu/rpc/rpc-test.cc:267: Connecting to 0.0.0.0:43105
I20260924 00:28:40.190308  4076 test_util.cc:175] -----------------------------------------------
I20260924 00:28:40.190563  4076 test_util.cc:176] Had fatal failures, leaving test files at /tmp/dist-test-taskoYFQzn/test-tmp/rpc-test.5.Parameters_TestRpc.TestCallWithChainCertAndChainCA_SSL_TCP.1790209718831120-4076-0
[  FAILED  ] Parameters/TestRpc.TestCallWithChainCertAndChainCA/SSL_TCP, where GetParam() = (true, false) (54 ms)
[ RUN      ] Parameters/TestRpc.TestCallWithPasswordProtectedKey/SSL_TCP
I20260924 00:28:40.244920  4139 acceptor_pool.cc:254] collecting diagnostics on the listening RPC socket 0.0.0.0:35521 every 8 connection(s)
I20260924 00:28:40.245865  4140 acceptor_pool.cc:254] collecting diagnostics on the listening RPC socket 0.0.0.0:35521 every 8 connection(s)
[       OK ] Parameters/TestRpc.TestCallWithPasswordProtectedKey/SSL_TCP (105 ms)
[ RUN      ] Parameters/TestRpc.TestCallToBadServer/SSL_TCP
I20260924 00:28:40.332496  4076 rpc-test.cc:394] Status: Network error: Client connection negotiation failed: client connection to 0.0.0.0:0: connect: Connection refused (error 111)
I20260924 00:28:40.334051  4076 rpc-test.cc:394] Status: Network error: Client connection negotiation failed: client connection to 0.0.0.0:0: connect: Connection refused (error 111)
I20260924 00:28:40.335413  4076 rpc-test.cc:394] Status: Network error: Client connection negotiation failed: client connection to 0.0.0.0:0: connect: Connection refused (error 111)
I20260924 00:28:40.336742  4076 rpc-test.cc:394] Status: Network error: Client connection negotiation failed: client connection to 0.0.0.0:0: connect: Connection refused (error 111)
I20260924 00:28:40.338019  4076 rpc-test.cc:394] Status: Network error: Client connection negotiation failed: client connection to 0.0.0.0:0: connect: Connection refused (error 111)
[       OK ] Parameters/TestRpc.TestCallToBadServer/SSL_TCP (44 ms)
[ RUN      ] Parameters/TestRpc.TestWrongService/SSL_TCP
I20260924 00:28:40.370342  4174 acceptor_pool.cc:254] collecting diagnostics on the listening RPC socket 0.0.0.0:45325 every 8 connection(s)
I20260924 00:28:40.371188  4175 acceptor_pool.cc:254] collecting diagnostics on the listening RPC socket 0.0.0.0:45325 every 8 connection(s)
I20260924 00:28:40.413460  4172 messenger.cc:345] service WrongServiceName not registered on TestServer
[       OK ] Parameters/TestRpc.TestWrongService/SSL_TCP (81 ms)
[ RUN      ] Parameters/TestRpc.TestConnectionKeepalive/SSL_TCP
I20260924 00:28:40.448979  4197 acceptor_pool.cc:254] collecting diagnostics on the listening RPC socket 0.0.0.0:43993 every 8 connection(s)
I20260924 00:28:40.449767  4198 acceptor_pool.cc:254] collecting diagnostics on the listening RPC socket 0.0.0.0:43993 every 8 connection(s)
I20260924 00:28:40.453087  4076 rpc-test.cc:488] Connecting to 0.0.0.0:43993
[       OK ] Parameters/TestRpc.TestConnectionKeepalive/SSL_TCP (1071 ms)
[ RUN      ] Parameters/TestRpc.TestClientConnectionMetrics/SSL_TCP
I20260924 00:28:41.510123  4222 acceptor_pool.cc:254] collecting diagnostics on the listening RPC socket 0.0.0.0:34363 every 8 connection(s)
I20260924 00:28:41.510864  4223 acceptor_pool.cc:254] collecting diagnostics on the listening RPC socket 0.0.0.0:34363 every 8 connection(s)
I20260924 00:28:41.513989  4076 rpc-test.cc:569] Connecting to 0.0.0.0:34363
[       OK ] Parameters/TestRpc.TestClientConnectionMetrics/SSL_TCP (116505 ms)
[ RUN      ] Parameters/TestRpc.TestCredentialsPolicy/SSL_TCP
I20260924 00:30:38.024573  4256 acceptor_pool.cc:254] collecting diagnostics on the listening RPC socket 0.0.0.0:36351 every 8 connection(s)
I20260924 00:30:38.025372  4257 acceptor_pool.cc:254] collecting diagnostics on the listening RPC socket 0.0.0.0:36351 every 8 connection(s)
I20260924 00:30:38.028726  4076 rpc-test.cc:700] Connecting to 0.0.0.0:36351
[       OK ] Parameters/TestRpc.TestCredentialsPolicy/SSL_TCP (89 ms)
[ RUN      ] Parameters/TestRpc.TestCallLongerThanKeepalive/SSL_TCP
I20260924 00:30:38.108604  4281 acceptor_pool.cc:254] collecting diagnostics on the listening RPC socket 0.0.0.0:41947 every 8 connection(s)
I20260924 00:30:38.109366  4282 acceptor_pool.cc:254] collecting diagnostics on the listening RPC socket 0.0.0.0:41947 every 8 connection(s)
I20260924 00:30:38.151598  4285 rpc-test-base.h:222] got call: sleep_micros: 3000000 deferred: true
I20260924 00:30:41.156502  4285 rpcz_store.cc:275] Call kudu.rpc.GenericCalculatorService.Sleep from 127.0.0.1:60808 (request call id 0) took 3005 ms. Trace:
I20260924 00:30:41.156955  4285 rpcz_store.cc:276] 0924 00:30:38.151353 (+     0us) service_pool.cc:170] Inserting onto call queue
0924 00:30:38.151455 (+   102us) service_pool.cc:227] Handling call
0924 00:30:41.156316 (+3004861us) inbound_call.cc:173] Queueing success response
Metrics: {}
[       OK ] Parameters/TestRpc.TestCallLongerThanKeepalive/SSL_TCP (3081 ms)
[ RUN      ] Parameters/TestRpc.TestRpcSidecar/SSL_TCP
I20260924 00:30:41.206017  4307 acceptor_pool.cc:254] collecting diagnostics on the listening RPC socket 0.0.0.0:43605 every 8 connection(s)
I20260924 00:30:41.206836  4308 acceptor_pool.cc:254] collecting diagnostics on the listening RPC socket 0.0.0.0:43605 every 8 connection(s)
[       OK ] Parameters/TestRpc.TestRpcSidecar/SSL_TCP (550 ms)
[ RUN      ] Parameters/TestRpc.TestRpcSidecarLimits/SSL_TCP
I20260924 00:30:58.347656  4333 acceptor_pool.cc:254] collecting diagnostics on the listening RPC socket 0.0.0.0:38469 every 8 connection(s)
I20260924 00:30:58.348461  4334 acceptor_pool.cc:254] collecting diagnostics on the listening RPC socket 0.0.0.0:38469 every 8 connection(s)
W20260924 00:30:58.373679  4076 serialization.cc:72] Serialized kudu.rpc_test.PushStringsRequestPB (2147483654 bytes) is larger than the maximum configured RPC message size (52428800 bytes). Sending anyway, but peer may reject the data.
W20260924 00:30:58.386000  4331 connection.cc:535] server connection from 127.0.0.1:55540 recv error: Network error: RPC frame had a length of 2147483714, but we only support messages up to 52428800 bytes long.
W20260924 00:30:58.386293  4331 connection.cc:158] shutting down server connection from 127.0.0.1:55540 with pending inbound data: 4/2147483714 bytes received; last active 0 ns ago: status Network error: RPC frame had a length of 2147483714, but we only support messages up to 52428800 bytes long.
W20260924 00:30:58.387226  4346 connection.cc:698] client connection to 0.0.0.0:38469 send error: Network error: failed to write to TLS socket: Connection reset by peer
W20260924 00:30:58.388055  4346 connection.cc:196] Error closing socket: Network error: TlsSocket::Close: Success
[       OK ] Parameters/TestRpc.TestRpcSidecarLimits/SSL_TCP (17490 ms)
[ RUN      ] Parameters/TestRpc.TestCallTimeoutDoesntAffectNegotiation/SSL_TCP
I20260924 00:30:59.240099  4358 acceptor_pool.cc:254] collecting diagnostics on the listening RPC socket 0.0.0.0:41347 every 8 connection(s)
I20260924 00:30:59.240803  4359 acceptor_pool.cc:254] collecting diagnostics on the listening RPC socket 0.0.0.0:41347 every 8 connection(s)
W20260924 00:30:59.265901  4354 negotiation.cc:266] Injecting 500ms delay in negotiation
I20260924 00:30:59.321391  4076 rpc-test-base.h:595] status: Timed out: connection negotiation to 0.0.0.0:41347 for RPC Sleep timed out after 0.050s (ON_OUTBOUND_QUEUE), seconds elapsed: 0.0563788
[       OK ] Parameters/TestRpc.TestCallTimeoutDoesntAffectNegotiation/SSL_TCP (576 ms)
[ RUN      ] Parameters/TestRpc.TestRpcHandlerLatencyMetric/SSL_TCP
I20260924 00:30:59.806638  4384 acceptor_pool.cc:254] collecting diagnostics on the listening RPC socket 0.0.0.0:37395 every 8 connection(s)
I20260924 00:30:59.807399  4385 acceptor_pool.cc:254] collecting diagnostics on the listening RPC socket 0.0.0.0:37395 every 8 connection(s)
I20260924 00:30:59.891403  4076 rpc-test.cc:1236] Sleep() min lat: 21705
I20260924 00:30:59.891633  4076 rpc-test.cc:1237] Sleep() mean lat: 21705
I20260924 00:30:59.891840  4076 rpc-test.cc:1238] Sleep() max lat: 21705
I20260924 00:30:59.892043  4076 rpc-test.cc:1239] Sleep() #calls: 1
[       OK ] Parameters/TestRpc.TestRpcHandlerLatencyMetric/SSL_TCP (114 ms)
[ RUN      ] Parameters/TestRpc.TimedOutOnResponseMetricServiceQueue/SSL_TCP
I20260924 00:30:59.927413  4410 acceptor_pool.cc:254] collecting diagnostics on the listening RPC socket 0.0.0.0:37543 every 8 connection(s)
I20260924 00:30:59.928166  4411 acceptor_pool.cc:254] collecting diagnostics on the listening RPC socket 0.0.0.0:37543 every 8 connection(s)
W20260924 00:31:00.015930  4412 rpcz_store.cc:267] Call kudu.rpc_test.CalculatorService.Sleep from 127.0.0.1:55640 (request call id 2) took 20 ms (client timeout 20 ms). Trace:
W20260924 00:31:00.016276  4412 rpcz_store.cc:269] 0924 00:30:59.995129 (+     0us) service_pool.cc:170] Inserting onto call queue
0924 00:31:00.015648 (+ 20519us) service_pool.cc:214] Skipping call since client already timed out
0924 00:31:00.015761 (+   113us) inbound_call.cc:173] Queueing failure response
Metrics: {}
[       OK ] Parameters/TestRpc.TimedOutOnResponseMetricServiceQueue/SSL_TCP (120 ms)
[ RUN      ] Parameters/TestRpc.RpcPendingConnectionsMetric/SSL_TCP
I20260924 00:31:00.033347  4433 acceptor_pool.cc:254] collecting diagnostics on the listening RPC socket 0.0.0.0:37095 every 8 connection(s)
I20260924 00:31:00.034126  4434 acceptor_pool.cc:254] collecting diagnostics on the listening RPC socket 0.0.0.0:37095 every 8 connection(s)
W20260924 00:31:00.039139  4429 negotiation.cc:337] Failed RPC negotiation. Trace:
0924 00:31:00.037863 (+     0us) reactor.cc:625] Submitting negotiation task for server connection from 127.0.0.1:32780 (local address 127.0.0.1:37095)
0924 00:31:00.038222 (+   359us) server_negotiation.cc:206] Beginning negotiation
0924 00:31:00.038251 (+    29us) server_negotiation.cc:399] Waiting for connection header
0924 00:31:00.038599 (+   348us) negotiation.cc:327] Negotiation complete: Network error: Server connection negotiation failed: server connection from 127.0.0.1:32780: BlockingRecv error: recv got EOF from 127.0.0.1:32780 (error 108)
Metrics: {"server-negotiator.queue_time_us":87}
[       OK ] Parameters/TestRpc.RpcPendingConnectionsMetric/SSL_TCP (29 ms)
[ RUN      ] Parameters/TestRpc.TestRpcContextClientDeadline/SSL_TCP
I20260924 00:31:00.072453  4449 acceptor_pool.cc:254] collecting diagnostics on the listening RPC socket 0.0.0.0:38777 every 8 connection(s)
I20260924 00:31:00.073160  4450 acceptor_pool.cc:254] collecting diagnostics on the listening RPC socket 0.0.0.0:38777 every 8 connection(s)
[       OK ] Parameters/TestRpc.TestRpcContextClientDeadline/SSL_TCP (88 ms)
[ RUN      ] Parameters/TestRpc.TestApplicationFeatureFlagUnsupportedServer/SSL_TCP
I20260924 00:31:00.156787  4474 acceptor_pool.cc:254] collecting diagnostics on the listening RPC socket 0.0.0.0:42531 every 8 connection(s)
I20260924 00:31:00.157532  4475 acceptor_pool.cc:254] collecting diagnostics on the listening RPC socket 0.0.0.0:42531 every 8 connection(s)
[       OK ] Parameters/TestRpc.TestApplicationFeatureFlagUnsupportedServer/SSL_TCP (55 ms)
[ RUN      ] Parameters/TestRpc.TestCancellationAsync/SSL_TCP
I20260924 00:31:00.223040  4499 acceptor_pool.cc:254] collecting diagnostics on the listening RPC socket 0.0.0.0:37795 every 8 connection(s)
I20260924 00:31:00.223776  4500 acceptor_pool.cc:254] collecting diagnostics on the listening RPC socket 0.0.0.0:37795 every 8 connection(s)
I20260924 00:31:00.226863  4076 rpc-test.cc:1716] Connecting to 0.0.0.0:37795
I20260924 00:31:00.259228  4076 test_util.cc:268] Using random seed: -1228190330
I20260924 00:31:00.508172  4503 rpc-test-base.h:240] got call: sleep_micros: 500 pattern: 4294967295 num_repetitions: 2097152 sidecar_idx: 0
I20260924 00:31:00.698604  4503 rpc-test-base.h:240] got call: sleep_micros: 500 pattern: 4294967295 num_repetitions: 2097152 sidecar_idx: 0
I20260924 00:31:00.879516  4503 rpc-test-base.h:240] got call: sleep_micros: 500 pattern: 4294967295 num_repetitions: 2097152 sidecar_idx: 0
I20260924 00:31:01.050359  4502 rpc-test-base.h:240] got call: sleep_micros: 500 pattern: 4294967295 num_repetitions: 2097152 sidecar_idx: 0
I20260924 00:31:01.229166  4503 rpc-test-base.h:240] got call: sleep_micros: 500 pattern: 4294967295 num_repetitions: 2097152 sidecar_idx: 0
I20260924 00:31:01.419171  4502 rpc-test-base.h:240] got call: sleep_micros: 500 pattern: 4294967295 num_repetitions: 2097152 sidecar_idx: 0
I20260924 00:31:01.598734  4503 rpc-test-base.h:240] got call: sleep_micros: 500 pattern: 4294967295 num_repetitions: 2097152 sidecar_idx: 0
I20260924 00:31:01.783357  4502 rpc-test-base.h:240] got call: sleep_micros: 500 pattern: 4294967295 num_repetitions: 2097152 sidecar_idx: 0
W20260924 00:31:01.943862  4498 connection.cc:196] Error closing socket: Network error: TlsSocket::Close: Broken pipe
W20260924 00:31:01.978257  4498 connection.cc:441] server connection from 127.0.0.1:34502 torn down before Call kudu.rpc.GenericCalculatorService.SleepWithSidecar from 127.0.0.1:34502 (request call id 8) could send its response
[       OK ] Parameters/TestRpc.TestCancellationAsync/SSL_TCP (1789 ms)
[ RUN      ] Parameters/TestRpc.TestPerformanceBySocketType/SSL_TCP
I20260924 00:31:02.083565  4524 acceptor_pool.cc:254] collecting diagnostics on the listening RPC socket 0.0.0.0:39149 every 8 connection(s)
I20260924 00:31:02.084347  4525 acceptor_pool.cc:254] collecting diagnostics on the listening RPC socket 0.0.0.0:39149 every 8 connection(s)
I20260924 00:31:02.087441  4076 rpc-test.cc:1846] Connecting to 0.0.0.0:39149
I20260924 00:31:21.429749  4076 rpc-test.cc:1859] Sending 1024MB via ssl-enabled tcp socket: real 19.327s	user 16.499s	sys 10.966s
I20260924 00:31:40.479519  4076 rpc-test.cc:1859] Sending 1024MB via ssl-enabled tcp socket: real 19.049s	user 16.281s	sys 10.634s
I20260924 00:31:59.592451  4076 rpc-test.cc:1859] Sending 1024MB via ssl-enabled tcp socket: real 19.112s	user 16.469s	sys 10.648s
I20260924 00:32:18.754766  4076 rpc-test.cc:1859] Sending 1024MB via ssl-enabled tcp socket: real 19.162s	user 16.310s	sys 10.845s
I20260924 00:32:37.759353  4076 rpc-test.cc:1859] Sending 1024MB via ssl-enabled tcp socket: real 19.004s	user 16.189s	sys 10.738s
[       OK ] Parameters/TestRpc.TestPerformanceBySocketType/SSL_TCP (95790 ms)
[----------] 20 tests from Parameters/TestRpc (238893 ms total)

[----------] 1 test from Parameters/TestRpcSocketTxRxQueue
[ RUN      ] Parameters/TestRpcSocketTxRxQueue.OverCapacity/0
W20260924 00:32:38.213212  4559 negotiation.cc:337] Failed RPC negotiation. Trace:
0924 00:32:37.794285 (+     0us) reactor.cc:625] Submitting negotiation task for client connection to 0.0.0.0:45337 (local address 127.0.0.1:51058)
0924 00:32:37.794898 (+   613us) negotiation.cc:107] Waiting for socket to connect
0924 00:32:37.794927 (+    29us) client_negotiation.cc:174] Beginning negotiation
0924 00:32:37.795137 (+   210us) client_negotiation.cc:252] Sending NEGOTIATE NegotiatePB request
0924 00:32:38.212125 (+416988us) negotiation.cc:327] Negotiation complete: Network error: Client connection negotiation failed: client connection to 0.0.0.0:45337: BlockingRecv error: recv error from unknown peer: Transport endpoint is not connected (error 107)
Metrics: {"client-negotiator.queue_time_us":183}
W20260924 00:32:38.213266  4550 negotiation.cc:337] Failed RPC negotiation. Trace:
0924 00:32:37.787340 (+     0us) reactor.cc:625] Submitting negotiation task for client connection to 0.0.0.0:45337 (local address 127.0.0.1:51056)
0924 00:32:37.788014 (+   674us) negotiation.cc:107] Waiting for socket to connect
0924 00:32:37.788064 (+    50us) client_negotiation.cc:174] Beginning negotiation
0924 00:32:37.788658 (+   594us) client_negotiation.cc:252] Sending NEGOTIATE NegotiatePB request
0924 00:32:38.212062 (+423404us) negotiation.cc:327] Negotiation complete: Network error: Client connection negotiation failed: client connection to 0.0.0.0:45337: BlockingRecv error: recv error from unknown peer: Transport endpoint is not connected (error 107)
Metrics: {"client-negotiator.queue_time_us":125}
W20260924 00:32:38.213531  4577 negotiation.cc:337] Failed RPC negotiation. Trace:
0924 00:32:37.814102 (+     0us) reactor.cc:625] Submitting negotiation task for client connection to 0.0.0.0:45337 (local address 127.0.0.1:51084)
0924 00:32:37.814726 (+   624us) negotiation.cc:107] Waiting for socket to connect
0924 00:32:37.814756 (+    30us) client_negotiation.cc:174] Beginning negotiation
0924 00:32:37.815028 (+   272us) client_negotiation.cc:252] Sending NEGOTIATE NegotiatePB request
0924 00:32:38.212064 (+397036us) negotiation.cc:327] Negotiation complete: Network error: Client connection negotiation failed: client connection to 0.0.0.0:45337: BlockingRecv error: recv error from unknown peer: Transport endpoint is not connected (error 107)
Metrics: {"client-negotiator.queue_time_us":175}
W20260924 00:32:38.213610  4595 negotiation.cc:337] Failed RPC negotiation. Trace:
0924 00:32:37.838548 (+     0us) reactor.cc:625] Submitting negotiation task for client connection to 0.0.0.0:45337 (local address 127.0.0.1:51102)
0924 00:32:37.839121 (+   573us) negotiation.cc:107] Waiting for socket to connect
0924 00:32:37.839151 (+    30us) client_negotiation.cc:174] Beginning negotiation
0924 00:32:37.839374 (+   223us) client_negotiation.cc:252] Sending NEGOTIATE NegotiatePB request
0924 00:32:38.212589 (+373215us) negotiation.cc:327] Negotiation complete: Network error: Client connection negotiation failed: client connection to 0.0.0.0:45337: BlockingRecv error: recv error from unknown peer: Transport endpoint is not connected (error 107)
Metrics: {"client-negotiator.queue_time_us":154}
W20260924 00:32:38.214850  4568 negotiation.cc:337] Failed RPC negotiation. Trace:
0924 00:32:37.801974 (+     0us) reactor.cc:625] Submitting negotiation task for client connection to 0.0.0.0:45337 (local address 127.0.0.1:51072)
0924 00:32:37.802410 (+   436us) negotiation.cc:107] Waiting for socket to connect
0924 00:32:37.802495 (+    85us) client_negotiation.cc:174] Beginning negotiation
0924 00:32:37.802687 (+   192us) client_negotiation.cc:252] Sending NEGOTIATE NegotiatePB request
0924 00:32:38.212078 (+409391us) negotiation.cc:327] Negotiation complete: Network error: Client connection negotiation failed: client connection to 0.0.0.0:45337: BlockingRecv error: recv error from unknown peer: Transport endpoint is not connected (error 107)
Metrics: {"client-negotiator.queue_time_us":100}
W20260924 00:32:38.215081  4586 negotiation.cc:337] Failed RPC negotiation. Trace:
0924 00:32:37.825910 (+     0us) reactor.cc:625] Submitting negotiation task for client connection to 0.0.0.0:45337 (local address 127.0.0.1:51094)
0924 00:32:37.826524 (+   614us) negotiation.cc:107] Waiting for socket to connect
0924 00:32:37.826554 (+    30us) client_negotiation.cc:174] Beginning negotiation
0924 00:32:37.826742 (+   188us) client_negotiation.cc:252] Sending NEGOTIATE NegotiatePB request
0924 00:32:38.214086 (+387344us) negotiation.cc:327] Negotiation complete: Network error: Client connection negotiation failed: client connection to 0.0.0.0:45337: BlockingRecv error: recv error from unknown peer: Transport endpoint is not connected (error 107)
Metrics: {"client-negotiator.queue_time_us":157}
[       OK ] Parameters/TestRpcSocketTxRxQueue.OverCapacity/0 (1236 ms)
[----------] 1 test from Parameters/TestRpcSocketTxRxQueue (1236 ms total)

[----------] Global test environment tear-down
[==========] 21 tests from 2 test suites ran. (240130 ms total)
[  PASSED  ] 20 tests.
[  FAILED  ] 1 test, listed below:
[  FAILED  ] Parameters/TestRpc.TestCallWithChainCertAndChainCA/SSL_TCP, where GetParam() = (true, false)

 1 FAILED TEST