Diagnosed failure

Parameters/TestRpc.TestCallWithChainCertAndRootCA/SSL_UnixSocket: /data0/somelongdirectorytoavoidrpathissues/src/kudu/src/kudu/rpc/rpc-test.cc:303: Failure
Failed
Bad status: Runtime error: could not verify certificate chain (error with cert: subject=CN = localhost, ST = sadfjas, C = AS, emailAddress = sdflkdsajf, O = lskdfjlsad, OU = sldfkja, issuer=C = AS, ST = ASDfkjdhf, L = lskdjf, O = saldfja, OU = skdjf, CN = localhost, emailAddress = sadjflkadsj): : certificate has expired
Google Test trace:
/data0/somelongdirectorytoavoidrpathissues/src/kudu/src/kudu/rpc/rpc-test.cc:300: Connecting to unix:/tmp/dist-test-taskMbuUhA/test-tmp/rpc-test-dbe4a6cd42d442d5aef5fe49cee41267.sock
I20260926 22:05:17.271214 12103 test_util.cc:175] -----------------------------------------------
I20260926 22:05:17.271437 12103 test_util.cc:176] Had fatal failures, leaving test files at /tmp/dist-test-taskMbuUhA/test-tmp/rpc-test.2.Parameters_TestRpc.TestCallWithChainCertAndRootCA_SSL_UnixSocket.1790460313663734-12103-0

Full log

Note: This is test shard 3 of 8.
[==========] Running 21 tests from 2 test suites.
[----------] Global test environment set-up.
[----------] 1 test from TestRpc
[ RUN      ] TestRpc.TestNegotiationTimeout
WARNING: Logging before InitGoogleLogging() is written to STDERR
I20260926 22:05:13.850947 12103 rpc-test-base.h:595] status: Timed out: connection negotiation to 0.0.0.0:38115 for RPC Sleep timed out after 0.100s (ON_OUTBOUND_QUEUE), seconds elapsed: 0.101136
W20260926 22:05:16.981230 12113 negotiation.cc:337] Failed RPC negotiation. Trace:
0926 22:05:13.750794 (+     0us) reactor.cc:625] Submitting negotiation task for client connection to 0.0.0.0:38115 (local address 127.0.0.1:38116)
0926 22:05:13.751709 (+   915us) negotiation.cc:107] Waiting for socket to connect
0926 22:05:13.751762 (+    53us) client_negotiation.cc:174] Beginning negotiation
0926 22:05:13.765249 (+ 13487us) client_negotiation.cc:252] Sending NEGOTIATE NegotiatePB request
0926 22:05:16.980051 (+3214802us) negotiation.cc:327] Negotiation complete: Timed out: Client connection negotiation failed: client connection to 0.0.0.0:38115: received 0 of 4 requested bytes
Metrics: {"client-negotiator.queue_time_us":239}
[       OK ] TestRpc.TestNegotiationTimeout (3268 ms)
[----------] 1 test from TestRpc (3269 ms total)

[----------] 20 tests from Parameters/TestRpc
[ RUN      ] Parameters/TestRpc.TestAcceptorPoolStartStop/SSL_UnixSocket
I20260926 22:05:17.021492 12129 acceptor_pool.cc:254] collecting diagnostics on the listening RPC socket unix:/tmp/dist-test-taskMbuUhA/test-tmp/rpc-test-ec8697719e7c487daac4317c0efffc6b.sock every 8 connection(s)
I20260926 22:05:17.023173 12130 acceptor_pool.cc:254] collecting diagnostics on the listening RPC socket unix:/tmp/dist-test-taskMbuUhA/test-tmp/rpc-test-ec8697719e7c487daac4317c0efffc6b.sock every 8 connection(s)
I20260926 22:05:17.060875 12140 acceptor_pool.cc:254] collecting diagnostics on the listening RPC socket unix:/tmp/dist-test-taskMbuUhA/test-tmp/rpc-test-ec8697719e7c487daac4317c0efffc6b.sock every 8 connection(s)
I20260926 22:05:17.062305 12141 acceptor_pool.cc:254] collecting diagnostics on the listening RPC socket unix:/tmp/dist-test-taskMbuUhA/test-tmp/rpc-test-ec8697719e7c487daac4317c0efffc6b.sock every 8 connection(s)
I20260926 22:05:17.079063 12151 acceptor_pool.cc:254] collecting diagnostics on the listening RPC socket unix:/tmp/dist-test-taskMbuUhA/test-tmp/rpc-test-ec8697719e7c487daac4317c0efffc6b.sock every 8 connection(s)
I20260926 22:05:17.079799 12152 acceptor_pool.cc:254] collecting diagnostics on the listening RPC socket unix:/tmp/dist-test-taskMbuUhA/test-tmp/rpc-test-ec8697719e7c487daac4317c0efffc6b.sock every 8 connection(s)
I20260926 22:05:17.112370 12162 acceptor_pool.cc:254] collecting diagnostics on the listening RPC socket unix:/tmp/dist-test-taskMbuUhA/test-tmp/rpc-test-ec8697719e7c487daac4317c0efffc6b.sock every 8 connection(s)
I20260926 22:05:17.113103 12163 acceptor_pool.cc:254] collecting diagnostics on the listening RPC socket unix:/tmp/dist-test-taskMbuUhA/test-tmp/rpc-test-ec8697719e7c487daac4317c0efffc6b.sock every 8 connection(s)
I20260926 22:05:17.133297 12173 acceptor_pool.cc:254] collecting diagnostics on the listening RPC socket unix:/tmp/dist-test-taskMbuUhA/test-tmp/rpc-test-ec8697719e7c487daac4317c0efffc6b.sock every 8 connection(s)
I20260926 22:05:17.134011 12174 acceptor_pool.cc:254] collecting diagnostics on the listening RPC socket unix:/tmp/dist-test-taskMbuUhA/test-tmp/rpc-test-ec8697719e7c487daac4317c0efffc6b.sock every 8 connection(s)
[       OK ] Parameters/TestRpc.TestAcceptorPoolStartStop/SSL_UnixSocket (152 ms)
[ RUN      ] Parameters/TestRpc.TestCall/SSL_UnixSocket
I20260926 22:05:17.166623 12186 acceptor_pool.cc:254] collecting diagnostics on the listening RPC socket unix:/tmp/dist-test-taskMbuUhA/test-tmp/rpc-test-2021b99813d547c0bd16047e4700b0cf.sock every 8 connection(s)
I20260926 22:05:17.168785 12187 acceptor_pool.cc:254] collecting diagnostics on the listening RPC socket unix:/tmp/dist-test-taskMbuUhA/test-tmp/rpc-test-2021b99813d547c0bd16047e4700b0cf.sock every 8 connection(s)
I20260926 22:05:17.174443 12103 rpc-test.cc:234] Connecting to unix:/tmp/dist-test-taskMbuUhA/test-tmp/rpc-test-2021b99813d547c0bd16047e4700b0cf.sock
W20260926 22:05:17.228597 12183 connection.cc:196] Error closing socket: Network error: TlsSocket::Close: Broken pipe
[       OK ] Parameters/TestRpc.TestCall/SSL_UnixSocket (95 ms)
[ RUN      ] Parameters/TestRpc.TestCallWithChainCertAndRootCA/SSL_UnixSocket
I20260926 22:05:17.249788 12211 acceptor_pool.cc:254] collecting diagnostics on the listening RPC socket unix:/tmp/dist-test-taskMbuUhA/test-tmp/rpc-test-dbe4a6cd42d442d5aef5fe49cee41267.sock every 8 connection(s)
I20260926 22:05:17.250638 12212 acceptor_pool.cc:254] collecting diagnostics on the listening RPC socket unix:/tmp/dist-test-taskMbuUhA/test-tmp/rpc-test-dbe4a6cd42d442d5aef5fe49cee41267.sock every 8 connection(s)
/data0/somelongdirectorytoavoidrpathissues/src/kudu/src/kudu/rpc/rpc-test.cc:303: Failure
Failed
Bad status: Runtime error: could not verify certificate chain (error with cert: subject=CN = localhost, ST = sadfjas, C = AS, emailAddress = sdflkdsajf, O = lskdfjlsad, OU = sldfkja, issuer=C = AS, ST = ASDfkjdhf, L = lskdjf, O = saldfja, OU = skdjf, CN = localhost, emailAddress = sadjflkadsj): : certificate has expired
Google Test trace:
/data0/somelongdirectorytoavoidrpathissues/src/kudu/src/kudu/rpc/rpc-test.cc:300: Connecting to unix:/tmp/dist-test-taskMbuUhA/test-tmp/rpc-test-dbe4a6cd42d442d5aef5fe49cee41267.sock
I20260926 22:05:17.271214 12103 test_util.cc:175] -----------------------------------------------
I20260926 22:05:17.271437 12103 test_util.cc:176] Had fatal failures, leaving test files at /tmp/dist-test-taskMbuUhA/test-tmp/rpc-test.2.Parameters_TestRpc.TestCallWithChainCertAndRootCA_SSL_UnixSocket.1790460313663734-12103-0
[  FAILED  ] Parameters/TestRpc.TestCallWithChainCertAndRootCA/SSL_UnixSocket, where GetParam() = (true, true) (37 ms)
[ RUN      ] Parameters/TestRpc.TestCallWithBadPasswordProtectedKey/SSL_UnixSocket
[       OK ] Parameters/TestRpc.TestCallWithBadPasswordProtectedKey/SSL_UnixSocket (31 ms)
[ RUN      ] Parameters/TestRpc.TestInvalidMethodCall/SSL_UnixSocket
I20260926 22:05:17.325273 12248 acceptor_pool.cc:254] collecting diagnostics on the listening RPC socket unix:/tmp/dist-test-taskMbuUhA/test-tmp/rpc-test-2e001dd3f9c144548fd79247017af488.sock every 8 connection(s)
I20260926 22:05:17.326117 12249 acceptor_pool.cc:254] collecting diagnostics on the listening RPC socket unix:/tmp/dist-test-taskMbuUhA/test-tmp/rpc-test-2e001dd3f9c144548fd79247017af488.sock every 8 connection(s)
I20260926 22:05:17.329665 12103 rpc-test.cc:406] Connecting to unix:/tmp/dist-test-taskMbuUhA/test-tmp/rpc-test-2e001dd3f9c144548fd79247017af488.sock
[       OK ] Parameters/TestRpc.TestInvalidMethodCall/SSL_UnixSocket (74 ms)
[ RUN      ] Parameters/TestRpc.TestHighFDs/SSL_UnixSocket
I20260926 22:05:17.595996 12273 acceptor_pool.cc:254] collecting diagnostics on the listening RPC socket unix:/tmp/dist-test-taskMbuUhA/test-tmp/rpc-test-5e99d7252a994cbd851bf1613f55be2b.sock every 8 connection(s)
I20260926 22:05:17.596843 12274 acceptor_pool.cc:254] collecting diagnostics on the listening RPC socket unix:/tmp/dist-test-taskMbuUhA/test-tmp/rpc-test-5e99d7252a994cbd851bf1613f55be2b.sock every 8 connection(s)
W20260926 22:05:17.627521 12270 connection.cc:196] Error closing socket: Network error: TlsSocket::Close: Broken pipe
[       OK ] Parameters/TestRpc.TestHighFDs/SSL_UnixSocket (262 ms)
[ RUN      ] Parameters/TestRpc.TestConnectionAlwaysKeepalive/SSL_UnixSocket
I20260926 22:05:17.660115 12296 acceptor_pool.cc:254] collecting diagnostics on the listening RPC socket unix:/tmp/dist-test-taskMbuUhA/test-tmp/rpc-test-d676df0aa8504caab9f07b5b989a29e4.sock every 8 connection(s)
I20260926 22:05:17.660939 12297 acceptor_pool.cc:254] collecting diagnostics on the listening RPC socket unix:/tmp/dist-test-taskMbuUhA/test-tmp/rpc-test-d676df0aa8504caab9f07b5b989a29e4.sock every 8 connection(s)
I20260926 22:05:17.664091 12103 rpc-test.cc:532] Connecting to unix:/tmp/dist-test-taskMbuUhA/test-tmp/rpc-test-d676df0aa8504caab9f07b5b989a29e4.sock
W20260926 22:05:20.706465 12295 connection.cc:196] Error closing socket: Network error: TlsSocket::Close: Broken pipe
[       OK ] Parameters/TestRpc.TestConnectionAlwaysKeepalive/SSL_UnixSocket (3070 ms)
[ RUN      ] Parameters/TestRpc.TestReopenOutboundConnections/SSL_UnixSocket
I20260926 22:05:20.744772 12319 acceptor_pool.cc:254] collecting diagnostics on the listening RPC socket unix:/tmp/dist-test-taskMbuUhA/test-tmp/rpc-test-18b33b7769e74cbb8f7c8988034b8337.sock every 8 connection(s)
I20260926 22:05:20.745383 12320 acceptor_pool.cc:254] collecting diagnostics on the listening RPC socket unix:/tmp/dist-test-taskMbuUhA/test-tmp/rpc-test-18b33b7769e74cbb8f7c8988034b8337.sock every 8 connection(s)
I20260926 22:05:20.748437 12103 rpc-test.cc:658] Connecting to unix:/tmp/dist-test-taskMbuUhA/test-tmp/rpc-test-18b33b7769e74cbb8f7c8988034b8337.sock
W20260926 22:05:20.773881 12318 connection.cc:196] Error closing socket: Network error: TlsSocket::Close: Broken pipe
W20260926 22:05:20.783759 12318 connection.cc:196] Error closing socket: Network error: TlsSocket::Close: Broken pipe
W20260926 22:05:20.793468 12318 connection.cc:196] Error closing socket: Network error: TlsSocket::Close: Broken pipe
W20260926 22:05:20.803788 12318 connection.cc:196] Error closing socket: Network error: TlsSocket::Close: Broken pipe
W20260926 22:05:20.814054 12318 connection.cc:196] Error closing socket: Network error: TlsSocket::Close: Broken pipe
W20260926 22:05:20.824625 12318 connection.cc:196] Error closing socket: Network error: TlsSocket::Close: Broken pipe
W20260926 22:05:20.834759 12318 connection.cc:196] Error closing socket: Network error: TlsSocket::Close: Broken pipe
W20260926 22:05:20.844985 12318 connection.cc:196] Error closing socket: Network error: TlsSocket::Close: Broken pipe
W20260926 22:05:20.855993 12318 connection.cc:196] Error closing socket: Network error: TlsSocket::Close: Broken pipe
W20260926 22:05:20.866158 12318 connection.cc:196] Error closing socket: Network error: TlsSocket::Close: Broken pipe
W20260926 22:05:20.876822 12318 connection.cc:196] Error closing socket: Network error: TlsSocket::Close: Broken pipe
W20260926 22:05:20.887151 12318 connection.cc:196] Error closing socket: Network error: TlsSocket::Close: Broken pipe
W20260926 22:05:20.897588 12318 connection.cc:196] Error closing socket: Network error: TlsSocket::Close: Broken pipe
W20260926 22:05:20.907694 12318 connection.cc:196] Error closing socket: Network error: TlsSocket::Close: Broken pipe
W20260926 22:05:20.907872 12319 acceptor_pool.cc:285] unable to collect diagnostics on RPC socket unix:/tmp/dist-test-taskMbuUhA/test-tmp/rpc-test-18b33b7769e74cbb8f7c8988034b8337.sock: Not implemented: netlink diagnostics is currently supported only on IPv4 TCP sockets
W20260926 22:05:20.918705 12318 connection.cc:196] Error closing socket: Network error: TlsSocket::Close: Broken pipe
W20260926 22:05:20.929518 12318 connection.cc:196] Error closing socket: Network error: TlsSocket::Close: Broken pipe
W20260926 22:05:20.941752 12318 connection.cc:196] Error closing socket: Network error: TlsSocket::Close: Broken pipe
W20260926 22:05:20.952458 12318 connection.cc:196] Error closing socket: Network error: TlsSocket::Close: Broken pipe
W20260926 22:05:20.963644 12318 connection.cc:196] Error closing socket: Network error: TlsSocket::Close: Broken pipe
W20260926 22:05:20.974334 12318 connection.cc:196] Error closing socket: Network error: TlsSocket::Close: Broken pipe
W20260926 22:05:20.985365 12318 connection.cc:196] Error closing socket: Network error: TlsSocket::Close: Broken pipe
W20260926 22:05:20.996316 12318 connection.cc:196] Error closing socket: Network error: TlsSocket::Close: Broken pipe
W20260926 22:05:21.006263 12318 connection.cc:196] Error closing socket: Network error: TlsSocket::Close: Broken pipe
W20260926 22:05:21.017175 12318 connection.cc:196] Error closing socket: Network error: TlsSocket::Close: Broken pipe
W20260926 22:05:21.027333 12318 connection.cc:196] Error closing socket: Network error: TlsSocket::Close: Broken pipe
W20260926 22:05:21.037195 12318 connection.cc:196] Error closing socket: Network error: TlsSocket::Close: Broken pipe
W20260926 22:05:21.046926 12318 connection.cc:196] Error closing socket: Network error: TlsSocket::Close: Broken pipe
W20260926 22:05:21.056290 12318 connection.cc:196] Error closing socket: Network error: TlsSocket::Close: Broken pipe
W20260926 22:05:21.065387 12318 connection.cc:196] Error closing socket: Network error: TlsSocket::Close: Broken pipe
W20260926 22:05:21.074560 12318 connection.cc:196] Error closing socket: Network error: TlsSocket::Close: Broken pipe
W20260926 22:05:21.084144 12318 connection.cc:196] Error closing socket: Network error: TlsSocket::Close: Broken pipe
W20260926 22:05:21.095774 12318 connection.cc:196] Error closing socket: Network error: TlsSocket::Close: Broken pipe
[       OK ] Parameters/TestRpc.TestReopenOutboundConnections/SSL_UnixSocket (389 ms)
[ RUN      ] Parameters/TestRpc.TestConnectionNetworkPlane/SSL_UnixSocket
I20260926 22:05:21.119886 12342 acceptor_pool.cc:254] collecting diagnostics on the listening RPC socket unix:/tmp/dist-test-taskMbuUhA/test-tmp/rpc-test-7f79d7e2cb384563883307d36404b4e9.sock every 8 connection(s)
I20260926 22:05:21.120628 12343 acceptor_pool.cc:254] collecting diagnostics on the listening RPC socket unix:/tmp/dist-test-taskMbuUhA/test-tmp/rpc-test-7f79d7e2cb384563883307d36404b4e9.sock every 8 connection(s)
I20260926 22:05:21.124023 12103 rpc-test.cc:772] Connecting to unix:/tmp/dist-test-taskMbuUhA/test-tmp/rpc-test-7f79d7e2cb384563883307d36404b4e9.sock
W20260926 22:05:21.177086 12341 connection.cc:196] Error closing socket: Network error: TlsSocket::Close: Broken pipe
[       OK ] Parameters/TestRpc.TestConnectionNetworkPlane/SSL_UnixSocket (81 ms)
[ RUN      ] Parameters/TestRpc.TestTCPKeepalive/SSL_UnixSocket
I20260926 22:05:21.206954 12367 acceptor_pool.cc:254] collecting diagnostics on the listening RPC socket unix:/tmp/dist-test-taskMbuUhA/test-tmp/rpc-test-da5273a0b7254461bb8d11d41eb21310.sock every 8 connection(s)
I20260926 22:05:21.207695 12368 acceptor_pool.cc:254] collecting diagnostics on the listening RPC socket unix:/tmp/dist-test-taskMbuUhA/test-tmp/rpc-test-da5273a0b7254461bb8d11d41eb21310.sock every 8 connection(s)
I20260926 22:05:21.255059 12371 rpc-test-base.h:222] got call: sleep_micros: 8000000 deferred: true
I20260926 22:05:29.259516 12371 rpcz_store.cc:275] Call kudu.rpc.GenericCalculatorService.Sleep from unix:<unnamed> (request call id 0) took 8004 ms. Trace:
I20260926 22:05:29.259922 12371 rpcz_store.cc:276] 0926 22:05:21.254894 (+     0us) service_pool.cc:170] Inserting onto call queue
0926 22:05:21.255004 (+   110us) service_pool.cc:227] Handling call
0926 22:05:29.259302 (+8004298us) inbound_call.cc:173] Queueing success response
Metrics: {}
W20260926 22:05:29.266362 12364 connection.cc:196] Error closing socket: Network error: TlsSocket::Close: Broken pipe
[       OK ] Parameters/TestRpc.TestTCPKeepalive/SSL_UnixSocket (8090 ms)
[ RUN      ] Parameters/TestRpc.TestMaxSmallSidecars/SSL_UnixSocket
I20260926 22:05:29.296725 12393 acceptor_pool.cc:254] collecting diagnostics on the listening RPC socket unix:/tmp/dist-test-taskMbuUhA/test-tmp/rpc-test-6249130e27ef435f814bce5b79e9362e.sock every 8 connection(s)
I20260926 22:05:29.297595 12394 acceptor_pool.cc:254] collecting diagnostics on the listening RPC socket unix:/tmp/dist-test-taskMbuUhA/test-tmp/rpc-test-6249130e27ef435f814bce5b79e9362e.sock every 8 connection(s)
[       OK ] Parameters/TestRpc.TestMaxSmallSidecars/SSL_UnixSocket (203 ms)
[ RUN      ] Parameters/TestRpc.TestCallTimeout/SSL_UnixSocket
I20260926 22:05:29.493003 12418 acceptor_pool.cc:254] collecting diagnostics on the listening RPC socket unix:/tmp/dist-test-taskMbuUhA/test-tmp/rpc-test-ce495a88c1e44dc6adecbe7d76aa1549.sock every 8 connection(s)
I20260926 22:05:29.493734 12419 acceptor_pool.cc:254] collecting diagnostics on the listening RPC socket unix:/tmp/dist-test-taskMbuUhA/test-tmp/rpc-test-ce495a88c1e44dc6adecbe7d76aa1549.sock every 8 connection(s)
I20260926 22:05:29.518826 12103 rpc-test-base.h:595] status: Timed out: connection negotiation to unix:/tmp/dist-test-taskMbuUhA/test-tmp/rpc-test-ce495a88c1e44dc6adecbe7d76aa1549.sock for RPC Sleep timed out after 0.000s (ON_OUTBOUND_QUEUE), seconds elapsed: 0.00241849
I20260926 22:05:29.529065 12422 rpc-test-base.h:222] got call: sleep_micros: 700000
I20260926 22:05:29.720541 12103 rpc-test-base.h:595] status: Timed out: Sleep RPC to unix:/tmp/dist-test-taskMbuUhA/test-tmp/rpc-test-ce495a88c1e44dc6adecbe7d76aa1549.sock timed out after 0.200s (SENT), seconds elapsed: 0.20131
I20260926 22:05:29.722002 12421 rpc-test-base.h:222] got call: sleep_micros: 2000000
W20260926 22:05:30.229803 12422 rpcz_store.cc:267] Call kudu.rpc.GenericCalculatorService.Sleep from unix:<unnamed> (request call id 1) took 701 ms (client timeout 200 ms). Trace:
W20260926 22:05:30.230122 12422 rpcz_store.cc:269] 0926 22:05:29.528700 (+     0us) service_pool.cc:170] Inserting onto call queue
0926 22:05:29.528903 (+   203us) service_pool.cc:227] Handling call
0926 22:05:30.229749 (+700846us) inbound_call.cc:173] Queueing success response
Metrics: {}
I20260926 22:05:31.221556 12103 rpc-test-base.h:595] status: Timed out: Sleep RPC to unix:/tmp/dist-test-taskMbuUhA/test-tmp/rpc-test-ce495a88c1e44dc6adecbe7d76aa1549.sock timed out after 1.500s (SENT), seconds elapsed: 1.50065
W20260926 22:05:31.722504 12421 rpcz_store.cc:267] Call kudu.rpc.GenericCalculatorService.Sleep from unix:<unnamed> (request call id 2) took 2000 ms (client timeout 1500 ms). Trace:
W20260926 22:05:31.722883 12421 rpcz_store.cc:269] 0926 22:05:29.721794 (+     0us) service_pool.cc:170] Inserting onto call queue
0926 22:05:29.721941 (+   147us) service_pool.cc:227] Handling call
0926 22:05:31.722449 (+2000508us) inbound_call.cc:173] Queueing success response
Metrics: {}
W20260926 22:05:31.723479 12415 connection.cc:441] server connection from unix:<unnamed> torn down before Call kudu.rpc.GenericCalculatorService.Sleep from unix:<unnamed> (request call id 2) could send its response
[       OK ] Parameters/TestRpc.TestCallTimeout/SSL_UnixSocket (2252 ms)
[ RUN      ] Parameters/TestRpc.TestServerShutsDown/SSL_UnixSocket
I20260926 22:05:31.730861 12103 rpc-test.cc:1125] Connecting to 0.0.0.0:44157
W20260926 22:05:31.740657 12435 negotiation.cc:337] Failed RPC negotiation. Trace:
0926 22:05:31.739094 (+     0us) reactor.cc:625] Submitting negotiation task for client connection to 0.0.0.0:44157 (local address 127.0.0.1:57364)
0926 22:05:31.739621 (+   527us) negotiation.cc:107] Waiting for socket to connect
0926 22:05:31.739715 (+    94us) client_negotiation.cc:174] Beginning negotiation
0926 22:05:31.739933 (+   218us) client_negotiation.cc:252] Sending NEGOTIATE NegotiatePB request
0926 22:05:31.740152 (+   219us) negotiation.cc:327] Negotiation complete: Network error: Client connection negotiation failed: client connection to 0.0.0.0:44157: BlockingWrite error: write error: Broken pipe (error 32)
Metrics: {"client-negotiator.queue_time_us":132}
[       OK ] Parameters/TestRpc.TestServerShutsDown/SSL_UnixSocket (14 ms)
[ RUN      ] Parameters/TestRpc.TimedOutOnResponseMetric/SSL_UnixSocket
I20260926 22:05:31.760447 12452 acceptor_pool.cc:254] collecting diagnostics on the listening RPC socket unix:/tmp/dist-test-taskMbuUhA/test-tmp/rpc-test-9078f82de463425cb7e4be760d7d0edc.sock every 8 connection(s)
I20260926 22:05:31.761127 12453 acceptor_pool.cc:254] collecting diagnostics on the listening RPC socket unix:/tmp/dist-test-taskMbuUhA/test-tmp/rpc-test-9078f82de463425cb7e4be760d7d0edc.sock every 8 connection(s)
W20260926 22:05:31.998517 12456 rpcz_store.cc:267] Call kudu.rpc_test.CalculatorService.Sleep from unix:<unnamed> (request call id 3) took 50 ms (client timeout 25 ms). Trace:
W20260926 22:05:31.998878 12456 rpcz_store.cc:269] 0926 22:05:31.947940 (+     0us) service_pool.cc:170] Inserting onto call queue
0926 22:05:31.948050 (+   110us) service_pool.cc:227] Handling call
0926 22:05:31.998440 (+ 50390us) inbound_call.cc:173] Queueing success response
Related trace 'test_child':
Metrics: {"test_sleep_us":50000,"child_traces":[["test_child",{"related_trace_metric":1}]]}
W20260926 22:05:32.058605 12456 rpcz_store.cc:267] Call kudu.rpc_test.CalculatorService.Sleep from unix:<unnamed> (request call id 4) took 50 ms (client timeout 50 ms). Trace:
W20260926 22:05:32.058949 12456 rpcz_store.cc:269] 0926 22:05:32.008039 (+     0us) service_pool.cc:170] Inserting onto call queue
0926 22:05:32.008165 (+   126us) service_pool.cc:227] Handling call
0926 22:05:32.058543 (+ 50378us) inbound_call.cc:173] Queueing success response
Related trace 'test_child':
Metrics: {"test_sleep_us":50000,"child_traces":[["test_child",{"related_trace_metric":1}]]}
[       OK ] Parameters/TestRpc.TimedOutOnResponseMetric/SSL_UnixSocket (324 ms)
[ RUN      ] Parameters/TestRpc.AcceptorDispatchingTimesMetric/SSL_UnixSocket
I20260926 22:05:32.079780 12477 acceptor_pool.cc:254] collecting diagnostics on the listening RPC socket 0.0.0.0:36495 every 8 connection(s)
I20260926 22:05:32.080432 12478 acceptor_pool.cc:254] collecting diagnostics on the listening RPC socket 0.0.0.0:36495 every 8 connection(s)
W20260926 22:05:32.086184 12473 negotiation.cc:337] Failed RPC negotiation. Trace:
0926 22:05:32.084182 (+     0us) reactor.cc:625] Submitting negotiation task for server connection from 127.0.0.1:53498 (local address 127.0.0.1:36495)
0926 22:05:32.084788 (+   606us) server_negotiation.cc:206] Beginning negotiation
0926 22:05:32.084823 (+    35us) server_negotiation.cc:399] Waiting for connection header
0926 22:05:32.085249 (+   426us) negotiation.cc:327] Negotiation complete: Network error: Server connection negotiation failed: server connection from 127.0.0.1:53498: BlockingRecv error: recv got EOF from 127.0.0.1:53498 (error 108)
Metrics: {"server-negotiator.queue_time_us":116}
[       OK ] Parameters/TestRpc.AcceptorDispatchingTimesMetric/SSL_UnixSocket (21 ms)
[ RUN      ] Parameters/TestRpc.TestRpcCallbackDestroysMessenger/SSL_UnixSocket
[       OK ] Parameters/TestRpc.TestRpcCallbackDestroysMessenger/SSL_UnixSocket (36 ms)
[ RUN      ] Parameters/TestRpc.TestApplicationFeatureFlag/SSL_UnixSocket
I20260926 22:05:32.149585 12502 acceptor_pool.cc:254] collecting diagnostics on the listening RPC socket unix:/tmp/dist-test-taskMbuUhA/test-tmp/rpc-test-a69c6639615e44cb947fc17f20f29099.sock every 8 connection(s)
I20260926 22:05:32.150301 12503 acceptor_pool.cc:254] collecting diagnostics on the listening RPC socket unix:/tmp/dist-test-taskMbuUhA/test-tmp/rpc-test-a69c6639615e44cb947fc17f20f29099.sock every 8 connection(s)
W20260926 22:05:32.181516 12499 messenger.cc:357] Unable to handle RPC call: Not implemented: call requires unsupported application feature flags: 99
W20260926 22:05:32.184517 12499 connection.cc:196] Error closing socket: Network error: TlsSocket::Close: Broken pipe
[       OK ] Parameters/TestRpc.TestApplicationFeatureFlag/SSL_UnixSocket (64 ms)
[ RUN      ] Parameters/TestRpc.TestCancellation/SSL_UnixSocket
I20260926 22:05:32.213090 12527 acceptor_pool.cc:254] collecting diagnostics on the listening RPC socket unix:/tmp/dist-test-taskMbuUhA/test-tmp/rpc-test-a37372ccdd9d4a2289c8e17764f8852e.sock every 8 connection(s)
I20260926 22:05:32.213811 12528 acceptor_pool.cc:254] collecting diagnostics on the listening RPC socket unix:/tmp/dist-test-taskMbuUhA/test-tmp/rpc-test-a37372ccdd9d4a2289c8e17764f8852e.sock every 8 connection(s)
I20260926 22:05:32.217330 12103 rpc-test.cc:1648] Connecting to unix:/tmp/dist-test-taskMbuUhA/test-tmp/rpc-test-a37372ccdd9d4a2289c8e17764f8852e.sock
I20260926 22:05:32.316597 12103 rpc-test-base.h:595] status: Aborted: Sleep RPC to unix:/tmp/dist-test-taskMbuUhA/test-tmp/rpc-test-a37372ccdd9d4a2289c8e17764f8852e.sock is cancelled in state READY, seconds elapsed: 0.000424327
I20260926 22:05:32.504129 12103 rpc-test-base.h:595] status: Aborted: Sleep RPC to unix:/tmp/dist-test-taskMbuUhA/test-tmp/rpc-test-a37372ccdd9d4a2289c8e17764f8852e.sock is cancelled in state SENT, seconds elapsed: 0.000879776
I20260926 22:05:32.504354 12530 rpc-test-base.h:222] got call: sleep_micros: 510000
I20260926 22:05:32.675217 12103 rpc-test-base.h:595] status: Aborted: Sleep RPC to unix:/tmp/dist-test-taskMbuUhA/test-tmp/rpc-test-a37372ccdd9d4a2289c8e17764f8852e.sock is cancelled in state SENT, seconds elapsed: 0.000905151
I20260926 22:05:32.675478 12529 rpc-test-base.h:222] got call: sleep_micros: 510000
I20260926 22:05:32.864277 12103 rpc-test-base.h:595] status: Aborted: Sleep RPC to unix:/tmp/dist-test-taskMbuUhA/test-tmp/rpc-test-a37372ccdd9d4a2289c8e17764f8852e.sock is cancelled in state SENT, seconds elapsed: 0.000916273
W20260926 22:05:32.874981 12531 rpcz_store.cc:267] Call kudu.rpc.GenericCalculatorService.Sleep from unix:<unnamed> (request call id 11) took 10 ms (client timeout 10 ms). Trace:
W20260926 22:05:32.875255 12531 rpcz_store.cc:269] 0926 22:05:32.864273 (+     0us) service_pool.cc:170] Inserting onto call queue
0926 22:05:32.874763 (+ 10490us) service_pool.cc:214] Skipping call since client already timed out
0926 22:05:32.874844 (+    81us) inbound_call.cc:173] Queueing failure response
Metrics: {}
I20260926 22:05:32.875913 12531 rpc-test-base.h:222] got call: sleep_micros: 1500000
W20260926 22:05:33.014952 12530 rpcz_store.cc:267] Call kudu.rpc.GenericCalculatorService.Sleep from unix:<unnamed> (request call id 3) took 510 ms (client timeout 10 ms). Trace:
W20260926 22:05:33.015275 12530 rpcz_store.cc:269] 0926 22:05:32.504154 (+     0us) service_pool.cc:170] Inserting onto call queue
0926 22:05:32.504298 (+   144us) service_pool.cc:227] Handling call
0926 22:05:33.014898 (+510600us) inbound_call.cc:173] Queueing success response
Metrics: {}
W20260926 22:05:33.186102 12529 rpcz_store.cc:267] Call kudu.rpc.GenericCalculatorService.Sleep from unix:<unnamed> (request call id 7) took 510 ms (client timeout 10 ms). Trace:
W20260926 22:05:33.186489 12529 rpcz_store.cc:269] 0926 22:05:32.675259 (+     0us) service_pool.cc:170] Inserting onto call queue
0926 22:05:32.675419 (+   160us) service_pool.cc:227] Handling call
0926 22:05:33.186046 (+510627us) inbound_call.cc:173] Queueing success response
Metrics: {}
I20260926 22:05:33.866411 12103 rpc-test-base.h:595] status: Timed out: Sleep RPC to unix:/tmp/dist-test-taskMbuUhA/test-tmp/rpc-test-a37372ccdd9d4a2289c8e17764f8852e.sock timed out after 1.000s (SENT), seconds elapsed: 1.00164
I20260926 22:05:33.868426 12529 rpc-test-base.h:222] got call: sleep_micros: 1500000
W20260926 22:05:34.376528 12531 rpcz_store.cc:267] Call kudu.rpc.GenericCalculatorService.Sleep from unix:<unnamed> (request call id 12) took 1511 ms (client timeout 1000 ms). Trace:
W20260926 22:05:34.376904 12531 rpcz_store.cc:269] 0926 22:05:32.865339 (+     0us) service_pool.cc:170] Inserting onto call queue
0926 22:05:32.875866 (+ 10527us) service_pool.cc:227] Handling call
0926 22:05:34.376393 (+1500527us) inbound_call.cc:173] Queueing success response
Metrics: {}
I20260926 22:05:34.868604 12103 rpc-test-base.h:595] status: Timed out: Sleep RPC to unix:/tmp/dist-test-taskMbuUhA/test-tmp/rpc-test-a37372ccdd9d4a2289c8e17764f8852e.sock timed out after 1.000s (SENT), seconds elapsed: 1.0017
W20260926 22:05:34.870096 12524 messenger.cc:357] Unable to handle RPC call: Not implemented: call requires unsupported application feature flags: 99, 1
W20260926 22:05:34.871601 12524 messenger.cc:357] Unable to handle RPC call: Not implemented: call requires unsupported application feature flags: 99, 1
W20260926 22:05:35.085644 12524 connection.cc:196] Error closing socket: Network error: TlsSocket::Close: Broken pipe
W20260926 22:05:35.369083 12529 rpcz_store.cc:267] Call kudu.rpc.GenericCalculatorService.Sleep from unix:<unnamed> (request call id 13) took 1501 ms (client timeout 1000 ms). Trace:
W20260926 22:05:35.369434 12529 rpcz_store.cc:269] 0926 22:05:33.868114 (+     0us) service_pool.cc:170] Inserting onto call queue
0926 22:05:33.868308 (+   194us) service_pool.cc:227] Handling call
0926 22:05:35.369029 (+1500721us) inbound_call.cc:173] Queueing success response
Metrics: {}
W20260926 22:05:35.370036 12524 connection.cc:441] server connection from unix:<unnamed> torn down before Call kudu.rpc.GenericCalculatorService.Sleep from unix:<unnamed> (request call id 13) could send its response
[       OK ] Parameters/TestRpc.TestCancellation/SSL_UnixSocket (3188 ms)
[ RUN      ] Parameters/TestRpc.TestCancellationMultiThreads/SSL_UnixSocket
I20260926 22:05:35.414641 12553 acceptor_pool.cc:254] collecting diagnostics on the listening RPC socket unix:/tmp/dist-test-taskMbuUhA/test-tmp/rpc-test-eb87879639ae4deaa93b2acc2d596db5.sock every 8 connection(s)
I20260926 22:05:35.415647 12554 acceptor_pool.cc:254] collecting diagnostics on the listening RPC socket unix:/tmp/dist-test-taskMbuUhA/test-tmp/rpc-test-eb87879639ae4deaa93b2acc2d596db5.sock every 8 connection(s)
I20260926 22:05:35.418704 12103 rpc-test.cc:1808] Connecting to unix:/tmp/dist-test-taskMbuUhA/test-tmp/rpc-test-eb87879639ae4deaa93b2acc2d596db5.sock
I20260926 22:05:35.572824 12567 test_util.cc:268] Using random seed: 139020017
I20260926 22:05:35.574283 12568 test_util.cc:268] Using random seed: 139021551
I20260926 22:05:35.575722 12569 test_util.cc:268] Using random seed: 139022916
I20260926 22:05:35.579281 12570 test_util.cc:268] Using random seed: 139026516
I20260926 22:05:35.581763 12571 test_util.cc:268] Using random seed: 139028875
I20260926 22:05:35.583143 12572 test_util.cc:268] Using random seed: 139030276
I20260926 22:05:35.584605 12573 test_util.cc:268] Using random seed: 139031747
I20260926 22:05:35.585955 12574 test_util.cc:268] Using random seed: 139033132
I20260926 22:05:35.587431 12575 test_util.cc:268] Using random seed: 139034554
I20260926 22:05:35.588768 12576 test_util.cc:268] Using random seed: 139035943
I20260926 22:05:35.590155 12577 test_util.cc:268] Using random seed: 139037301
I20260926 22:05:35.592343 12578 test_util.cc:268] Using random seed: 139039422
I20260926 22:05:35.594085 12579 test_util.cc:268] Using random seed: 139041205
I20260926 22:05:35.596181 12580 test_util.cc:268] Using random seed: 139043302
I20260926 22:05:35.599946 12581 test_util.cc:268] Using random seed: 139047095
I20260926 22:05:35.601775 12582 test_util.cc:268] Using random seed: 139048894
I20260926 22:05:35.608110 12583 test_util.cc:268] Using random seed: 139055279
I20260926 22:05:35.609762 12584 test_util.cc:268] Using random seed: 139056900
I20260926 22:05:35.611485 12585 test_util.cc:268] Using random seed: 139058561
I20260926 22:05:35.613330 12586 test_util.cc:268] Using random seed: 139060404
I20260926 22:05:35.614889 12587 test_util.cc:268] Using random seed: 139061990
I20260926 22:05:35.616612 12588 test_util.cc:268] Using random seed: 139063703
I20260926 22:05:35.618677 12589 test_util.cc:268] Using random seed: 139065774
I20260926 22:05:35.620813 12590 test_util.cc:268] Using random seed: 139067942
I20260926 22:05:35.623687 12591 test_util.cc:268] Using random seed: 139070772
I20260926 22:05:35.625396 12592 test_util.cc:268] Using random seed: 139072483
I20260926 22:05:35.627339 12593 test_util.cc:268] Using random seed: 139074427
I20260926 22:05:35.629271 12594 test_util.cc:268] Using random seed: 139076364
I20260926 22:05:35.632012 12595 test_util.cc:268] Using random seed: 139079113
I20260926 22:05:35.633613 12596 test_util.cc:268] Using random seed: 139080745
W20260926 22:05:55.410177 12550 connection.cc:196] Error closing socket: Network error: TlsSocket::Close: Broken pipe
[       OK ] Parameters/TestRpc.TestCancellationMultiThreads/SSL_UnixSocket (20050 ms)
[ RUN      ] Parameters/TestRpc.TestCallId/SSL_UnixSocket
I20260926 22:05:55.476403 12610 acceptor_pool.cc:254] collecting diagnostics on the listening RPC socket unix:/tmp/dist-test-taskMbuUhA/test-tmp/rpc-test-2e5a1f93b01e4be3bc97ff294d105f17.sock every 8 connection(s)
I20260926 22:05:55.477383 12611 acceptor_pool.cc:254] collecting diagnostics on the listening RPC socket unix:/tmp/dist-test-taskMbuUhA/test-tmp/rpc-test-2e5a1f93b01e4be3bc97ff294d105f17.sock every 8 connection(s)
[       OK ] Parameters/TestRpc.TestCallId/SSL_UnixSocket (109 ms)
[----------] 20 tests from Parameters/TestRpc (38553 ms total)

[----------] Global test environment tear-down
[==========] 21 tests from 2 test suites ran. (41823 ms total)
[  PASSED  ] 20 tests.
[  FAILED  ] 1 test, listed below:
[  FAILED  ] Parameters/TestRpc.TestCallWithChainCertAndRootCA/SSL_UnixSocket, where GetParam() = (true, true)

 1 FAILED TEST
I20260926 22:05:55.556005 12103 logging.cc:424] LogThrottler /data0/somelongdirectorytoavoidrpathissues/src/kudu/src/kudu/rpc/acceptor_pool.cc:285: suppressed but not reported on 3 messages since previous log ~34 seconds ago