Diagnosed failure

Parameters/TestRpc.TestCallWithChainCertAndChainCA/SSL_TCP: /data0/somelongdirectorytoavoidrpathissues/src/kudu/src/kudu/rpc/rpc-test.cc:270: Failure
Failed
Bad status: Runtime error: could not verify certificate chain (error with cert: subject=CN = localhost, ST = sadfjas, C = AS, emailAddress = sdflkdsajf, O = lskdfjlsad, OU = sldfkja, issuer=C = AS, ST = ASDfkjdhf, L = lskdjf, O = saldfja, OU = skdjf, CN = localhost, emailAddress = sadjflkadsj): : certificate has expired
Google Test trace:
/data0/somelongdirectorytoavoidrpathissues/src/kudu/src/kudu/rpc/rpc-test.cc:267: Connecting to 0.0.0.0:32885
I20260925 19:00:31.998695  1237 test_util.cc:175] -----------------------------------------------
I20260925 19:00:31.998764  1237 test_util.cc:176] Had fatal failures, leaving test files at /tmp/dist-test-task0ruonm/test-tmp/rpc-test.5.Parameters_TestRpc.TestCallWithChainCertAndChainCA_SSL_TCP.1790362831933111-1237-0

Full log

Note: This is test shard 6 of 8.
[==========] Running 21 tests from 2 test suites.
[----------] Global test environment set-up.
[----------] 20 tests from Parameters/TestRpc
[ RUN      ] Parameters/TestRpc.TestMessengerCreateDestroy/SSL_TCP
WARNING: Logging before InitGoogleLogging() is written to STDERR
I20260925 19:00:31.963302  1237 rpc-test.cc:169] started messenger TestCreateDestroy
[       OK ] Parameters/TestRpc.TestMessengerCreateDestroy/SSL_TCP (28 ms)
[ RUN      ] Parameters/TestRpc.TestNegotiationDeadlock/SSL_TCP
I20260925 19:00:31.971006  1257 acceptor_pool.cc:254] collecting diagnostics on the listening RPC socket 0.0.0.0:46443 every 8 connection(s)
I20260925 19:00:31.971031  1258 acceptor_pool.cc:254] collecting diagnostics on the listening RPC socket 0.0.0.0:46443 every 8 connection(s)
[       OK ] Parameters/TestRpc.TestNegotiationDeadlock/SSL_TCP (14 ms)
[ RUN      ] Parameters/TestRpc.TestCallWithChainCertAndChainCA/SSL_TCP
I20260925 19:00:31.994490  1274 acceptor_pool.cc:254] collecting diagnostics on the listening RPC socket 0.0.0.0:32885 every 8 connection(s)
I20260925 19:00:31.994508  1273 acceptor_pool.cc:254] collecting diagnostics on the listening RPC socket 0.0.0.0:32885 every 8 connection(s)
/data0/somelongdirectorytoavoidrpathissues/src/kudu/src/kudu/rpc/rpc-test.cc:270: Failure
Failed
Bad status: Runtime error: could not verify certificate chain (error with cert: subject=CN = localhost, ST = sadfjas, C = AS, emailAddress = sdflkdsajf, O = lskdfjlsad, OU = sldfkja, issuer=C = AS, ST = ASDfkjdhf, L = lskdjf, O = saldfja, OU = skdjf, CN = localhost, emailAddress = sadjflkadsj): : certificate has expired
Google Test trace:
/data0/somelongdirectorytoavoidrpathissues/src/kudu/src/kudu/rpc/rpc-test.cc:267: Connecting to 0.0.0.0:32885
I20260925 19:00:31.998695  1237 test_util.cc:175] -----------------------------------------------
I20260925 19:00:31.998764  1237 test_util.cc:176] Had fatal failures, leaving test files at /tmp/dist-test-task0ruonm/test-tmp/rpc-test.5.Parameters_TestRpc.TestCallWithChainCertAndChainCA_SSL_TCP.1790362831933111-1237-0
[  FAILED  ] Parameters/TestRpc.TestCallWithChainCertAndChainCA/SSL_TCP, where GetParam() = (true, false) (19 ms)
[ RUN      ] Parameters/TestRpc.TestCallWithPasswordProtectedKey/SSL_TCP
I20260925 19:00:32.013564  1298 acceptor_pool.cc:254] collecting diagnostics on the listening RPC socket 0.0.0.0:34831 every 8 connection(s)
I20260925 19:00:32.013605  1299 acceptor_pool.cc:254] collecting diagnostics on the listening RPC socket 0.0.0.0:34831 every 8 connection(s)
[       OK ] Parameters/TestRpc.TestCallWithPasswordProtectedKey/SSL_TCP (29 ms)
[ RUN      ] Parameters/TestRpc.TestCallToBadServer/SSL_TCP
I20260925 19:00:32.037510  1237 rpc-test.cc:394] Status: Network error: Client connection negotiation failed: client connection to 0.0.0.0:0: connect: Connection refused (error 111)
I20260925 19:00:32.038040  1237 rpc-test.cc:394] Status: Network error: Client connection negotiation failed: client connection to 0.0.0.0:0: connect: Connection refused (error 111)
I20260925 19:00:32.038405  1237 rpc-test.cc:394] Status: Network error: Client connection negotiation failed: client connection to 0.0.0.0:0: connect: Connection refused (error 111)
I20260925 19:00:32.038697  1237 rpc-test.cc:394] Status: Network error: Client connection negotiation failed: client connection to 0.0.0.0:0: connect: Connection refused (error 111)
I20260925 19:00:32.038993  1237 rpc-test.cc:394] Status: Network error: Client connection negotiation failed: client connection to 0.0.0.0:0: connect: Connection refused (error 111)
[       OK ] Parameters/TestRpc.TestCallToBadServer/SSL_TCP (11 ms)
[ RUN      ] Parameters/TestRpc.TestWrongService/SSL_TCP
I20260925 19:00:32.054392  1333 acceptor_pool.cc:254] collecting diagnostics on the listening RPC socket 0.0.0.0:36337 every 8 connection(s)
I20260925 19:00:32.054451  1334 acceptor_pool.cc:254] collecting diagnostics on the listening RPC socket 0.0.0.0:36337 every 8 connection(s)
I20260925 19:00:32.066480  1331 messenger.cc:345] service WrongServiceName not registered on TestServer
[       OK ] Parameters/TestRpc.TestWrongService/SSL_TCP (28 ms)
[ RUN      ] Parameters/TestRpc.TestConnectionKeepalive/SSL_TCP
I20260925 19:00:32.077442  1356 acceptor_pool.cc:254] collecting diagnostics on the listening RPC socket 0.0.0.0:33679 every 8 connection(s)
I20260925 19:00:32.077491  1357 acceptor_pool.cc:254] collecting diagnostics on the listening RPC socket 0.0.0.0:33679 every 8 connection(s)
I20260925 19:00:32.077646  1237 rpc-test.cc:488] Connecting to 0.0.0.0:33679
[       OK ] Parameters/TestRpc.TestConnectionKeepalive/SSL_TCP (1029 ms)
[ RUN      ] Parameters/TestRpc.TestClientConnectionMetrics/SSL_TCP
I20260925 19:00:33.109222  1381 acceptor_pool.cc:254] collecting diagnostics on the listening RPC socket 0.0.0.0:34449 every 8 connection(s)
I20260925 19:00:33.109385  1382 acceptor_pool.cc:254] collecting diagnostics on the listening RPC socket 0.0.0.0:34449 every 8 connection(s)
I20260925 19:00:33.109424  1237 rpc-test.cc:569] Connecting to 0.0.0.0:34449
[       OK ] Parameters/TestRpc.TestClientConnectionMetrics/SSL_TCP (8875 ms)
[ RUN      ] Parameters/TestRpc.TestCredentialsPolicy/SSL_TCP
I20260925 19:00:41.990660  1404 acceptor_pool.cc:254] collecting diagnostics on the listening RPC socket 0.0.0.0:33865 every 8 connection(s)
I20260925 19:00:41.990698  1405 acceptor_pool.cc:254] collecting diagnostics on the listening RPC socket 0.0.0.0:33865 every 8 connection(s)
I20260925 19:00:41.990877  1237 rpc-test.cc:700] Connecting to 0.0.0.0:33865
[       OK ] Parameters/TestRpc.TestCredentialsPolicy/SSL_TCP (46 ms)
[ RUN      ] Parameters/TestRpc.TestCallLongerThanKeepalive/SSL_TCP
I20260925 19:00:42.025943  1430 acceptor_pool.cc:254] collecting diagnostics on the listening RPC socket 0.0.0.0:39941 every 8 connection(s)
I20260925 19:00:42.026062  1429 acceptor_pool.cc:254] collecting diagnostics on the listening RPC socket 0.0.0.0:39941 every 8 connection(s)
I20260925 19:00:42.037422  1431 rpc-test-base.h:222] got call: sleep_micros: 3000000 deferred: true
I20260925 19:00:45.038101  1431 rpcz_store.cc:275] Call kudu.rpc.GenericCalculatorService.Sleep from 127.0.0.1:52440 (request call id 0) took 3000 ms. Trace:
I20260925 19:00:45.038206  1431 rpcz_store.cc:276] 0925 19:00:42.037355 (+     0us) service_pool.cc:170] Inserting onto call queue
0925 19:00:42.037399 (+    44us) service_pool.cc:227] Handling call
0925 19:00:45.038086 (+3000687us) inbound_call.cc:173] Queueing success response
Metrics: {}
[       OK ] Parameters/TestRpc.TestCallLongerThanKeepalive/SSL_TCP (3019 ms)
[ RUN      ] Parameters/TestRpc.TestRpcSidecar/SSL_TCP
I20260925 19:00:45.056262  1455 acceptor_pool.cc:254] collecting diagnostics on the listening RPC socket 0.0.0.0:40159 every 8 connection(s)
I20260925 19:00:45.056242  1454 acceptor_pool.cc:254] collecting diagnostics on the listening RPC socket 0.0.0.0:40159 every 8 connection(s)
[       OK ] Parameters/TestRpc.TestRpcSidecar/SSL_TCP (57 ms)
[ RUN      ] Parameters/TestRpc.TestRpcSidecarLimits/SSL_TCP
I20260925 19:00:46.684842  1479 acceptor_pool.cc:254] collecting diagnostics on the listening RPC socket 0.0.0.0:46807 every 8 connection(s)
I20260925 19:00:46.684870  1480 acceptor_pool.cc:254] collecting diagnostics on the listening RPC socket 0.0.0.0:46807 every 8 connection(s)
W20260925 19:00:46.698777  1237 serialization.cc:72] Serialized kudu.rpc_test.PushStringsRequestPB (2147483654 bytes) is larger than the maximum configured RPC message size (52428800 bytes). Sending anyway, but peer may reject the data.
W20260925 19:00:46.702020  1478 connection.cc:535] server connection from 127.0.0.1:43028 recv error: Network error: RPC frame had a length of 2147483714, but we only support messages up to 52428800 bytes long.
W20260925 19:00:46.702070  1478 connection.cc:158] shutting down server connection from 127.0.0.1:43028 with pending inbound data: 4/2147483714 bytes received; last active 0 ns ago: status Network error: RPC frame had a length of 2147483714, but we only support messages up to 52428800 bytes long.
W20260925 19:00:46.702267  1492 connection.cc:196] Error closing socket: Network error: TlsSocket::Close: Connection reset by peer
I20260925 19:00:46.712080  1504 acceptor_pool.cc:254] collecting diagnostics on the listening RPC socket 0.0.0.0:44481 every 8 connection(s)
I20260925 19:00:46.712100  1505 acceptor_pool.cc:254] collecting diagnostics on the listening RPC socket 0.0.0.0:44481 every 8 connection(s)
W20260925 19:00:50.384876  1501 connection.cc:577] server connection from 127.0.0.1:42472: received bad data: 'Corruption: Invalid packet: message had a length of 2147483710, but we only support messages up to 2147483647 bytes
'
[       OK ] Parameters/TestRpc.TestRpcSidecarLimits/SSL_TCP (5288 ms)
[ RUN      ] Parameters/TestRpc.TestCallTimeoutDoesntAffectNegotiation/SSL_TCP
I20260925 19:00:50.398960  1529 acceptor_pool.cc:254] collecting diagnostics on the listening RPC socket 0.0.0.0:36795 every 8 connection(s)
I20260925 19:00:50.399062  1530 acceptor_pool.cc:254] collecting diagnostics on the listening RPC socket 0.0.0.0:36795 every 8 connection(s)
W20260925 19:00:50.430034  1525 negotiation.cc:266] Injecting 500ms delay in negotiation
I20260925 19:00:50.480237  1237 rpc-test-base.h:595] status: Timed out: connection negotiation to 0.0.0.0:36795 for RPC Sleep timed out after 0.050s (ON_OUTBOUND_QUEUE), seconds elapsed: 0.0505775
[       OK ] Parameters/TestRpc.TestCallTimeoutDoesntAffectNegotiation/SSL_TCP (548 ms)
[ RUN      ] Parameters/TestRpc.TestRpcHandlerLatencyMetric/SSL_TCP
I20260925 19:00:50.950299  1554 acceptor_pool.cc:254] collecting diagnostics on the listening RPC socket 0.0.0.0:46259 every 8 connection(s)
I20260925 19:00:50.950309  1555 acceptor_pool.cc:254] collecting diagnostics on the listening RPC socket 0.0.0.0:46259 every 8 connection(s)
I20260925 19:00:50.981312  1237 rpc-test.cc:1236] Sleep() min lat: 20272
I20260925 19:00:50.981377  1237 rpc-test.cc:1237] Sleep() mean lat: 20272
I20260925 19:00:50.981402  1237 rpc-test.cc:1238] Sleep() max lat: 20272
I20260925 19:00:50.981415  1237 rpc-test.cc:1239] Sleep() #calls: 1
[       OK ] Parameters/TestRpc.TestRpcHandlerLatencyMetric/SSL_TCP (47 ms)
[ RUN      ] Parameters/TestRpc.TimedOutOnResponseMetricServiceQueue/SSL_TCP
I20260925 19:00:51.001175  1580 acceptor_pool.cc:254] collecting diagnostics on the listening RPC socket 0.0.0.0:33477 every 8 connection(s)
I20260925 19:00:51.001201  1581 acceptor_pool.cc:254] collecting diagnostics on the listening RPC socket 0.0.0.0:33477 every 8 connection(s)
W20260925 19:00:51.055554  1582 rpcz_store.cc:267] Call kudu.rpc_test.CalculatorService.Sleep from 127.0.0.1:54408 (request call id 2) took 20 ms (client timeout 20 ms). Trace:
W20260925 19:00:51.055730  1582 rpcz_store.cc:269] 0925 19:00:51.035272 (+     0us) service_pool.cc:170] Inserting onto call queue
0925 19:00:51.055516 (+ 20244us) service_pool.cc:214] Skipping call since client already timed out
0925 19:00:51.055527 (+    11us) inbound_call.cc:173] Queueing failure response
Metrics: {}
[       OK ] Parameters/TestRpc.TimedOutOnResponseMetricServiceQueue/SSL_TCP (74 ms)
[ RUN      ] Parameters/TestRpc.RpcPendingConnectionsMetric/SSL_TCP
I20260925 19:00:51.059011  1603 acceptor_pool.cc:254] collecting diagnostics on the listening RPC socket 0.0.0.0:43511 every 8 connection(s)
I20260925 19:00:51.059072  1604 acceptor_pool.cc:254] collecting diagnostics on the listening RPC socket 0.0.0.0:43511 every 8 connection(s)
W20260925 19:00:51.059684  1599 negotiation.cc:337] Failed RPC negotiation. Trace:
0925 19:00:51.059512 (+     0us) reactor.cc:625] Submitting negotiation task for server connection from 127.0.0.1:39860 (local address 127.0.0.1:43511)
0925 19:00:51.059556 (+    44us) server_negotiation.cc:206] Beginning negotiation
0925 19:00:51.059557 (+     1us) server_negotiation.cc:399] Waiting for connection header
0925 19:00:51.059632 (+    75us) negotiation.cc:327] Negotiation complete: Network error: Server connection negotiation failed: server connection from 127.0.0.1:39860: BlockingRecv error: recv got EOF from 127.0.0.1:39860 (error 108)
Metrics: {"server-negotiator.queue_time_us":13}
[       OK ] Parameters/TestRpc.RpcPendingConnectionsMetric/SSL_TCP (13 ms)
[ RUN      ] Parameters/TestRpc.TestRpcContextClientDeadline/SSL_TCP
I20260925 19:00:51.079020  1619 acceptor_pool.cc:254] collecting diagnostics on the listening RPC socket 0.0.0.0:34169 every 8 connection(s)
I20260925 19:00:51.079056  1620 acceptor_pool.cc:254] collecting diagnostics on the listening RPC socket 0.0.0.0:34169 every 8 connection(s)
[       OK ] Parameters/TestRpc.TestRpcContextClientDeadline/SSL_TCP (60 ms)
[ RUN      ] Parameters/TestRpc.TestApplicationFeatureFlagUnsupportedServer/SSL_TCP
I20260925 19:00:51.145183  1644 acceptor_pool.cc:254] collecting diagnostics on the listening RPC socket 0.0.0.0:43231 every 8 connection(s)
I20260925 19:00:51.145222  1645 acceptor_pool.cc:254] collecting diagnostics on the listening RPC socket 0.0.0.0:43231 every 8 connection(s)
[       OK ] Parameters/TestRpc.TestApplicationFeatureFlagUnsupportedServer/SSL_TCP (23 ms)
[ RUN      ] Parameters/TestRpc.TestCancellationAsync/SSL_TCP
I20260925 19:00:51.161238  1669 acceptor_pool.cc:254] collecting diagnostics on the listening RPC socket 0.0.0.0:35137 every 8 connection(s)
I20260925 19:00:51.161286  1670 acceptor_pool.cc:254] collecting diagnostics on the listening RPC socket 0.0.0.0:35137 every 8 connection(s)
I20260925 19:00:51.161425  1237 rpc-test.cc:1716] Connecting to 0.0.0.0:35137
I20260925 19:00:51.197396  1237 test_util.cc:268] Using random seed: 1438892497
I20260925 19:00:51.212220  1673 rpc-test-base.h:240] got call: sleep_micros: 500 pattern: 4294967295 num_repetitions: 2097152 sidecar_idx: 0
I20260925 19:00:51.224186  1673 rpc-test-base.h:240] got call: sleep_micros: 500 pattern: 4294967295 num_repetitions: 2097152 sidecar_idx: 0
I20260925 19:00:51.236243  1673 rpc-test-base.h:240] got call: sleep_micros: 500 pattern: 4294967295 num_repetitions: 2097152 sidecar_idx: 0
I20260925 19:00:51.249346  1673 rpc-test-base.h:240] got call: sleep_micros: 500 pattern: 4294967295 num_repetitions: 2097152 sidecar_idx: 0
I20260925 19:00:51.262337  1673 rpc-test-base.h:240] got call: sleep_micros: 500 pattern: 4294967295 num_repetitions: 2097152 sidecar_idx: 0
I20260925 19:00:51.275908  1673 rpc-test-base.h:240] got call: sleep_micros: 500 pattern: 4294967295 num_repetitions: 2097152 sidecar_idx: 0
I20260925 19:00:51.289397  1673 rpc-test-base.h:240] got call: sleep_micros: 500 pattern: 4294967295 num_repetitions: 2097152 sidecar_idx: 0
I20260925 19:00:51.302980  1673 rpc-test-base.h:240] got call: sleep_micros: 500 pattern: 4294967295 num_repetitions: 2097152 sidecar_idx: 0
W20260925 19:00:51.306252  1668 connection.cc:441] server connection from 127.0.0.1:56596 torn down before Call kudu.rpc.GenericCalculatorService.SleepWithSidecar from 127.0.0.1:56596 (request call id 9) could send its response
[       OK ] Parameters/TestRpc.TestCancellationAsync/SSL_TCP (152 ms)
[ RUN      ] Parameters/TestRpc.TestPerformanceBySocketType/SSL_TCP
I20260925 19:00:51.332201  1694 acceptor_pool.cc:254] collecting diagnostics on the listening RPC socket 0.0.0.0:40293 every 8 connection(s)
I20260925 19:00:51.332229  1695 acceptor_pool.cc:254] collecting diagnostics on the listening RPC socket 0.0.0.0:40293 every 8 connection(s)
I20260925 19:00:51.332381  1237 rpc-test.cc:1846] Connecting to 0.0.0.0:40293
I20260925 19:00:52.979487  1237 rpc-test.cc:1859] Sending 1024MB via ssl-enabled tcp socket: real 1.638s	user 1.453s	sys 1.435s
I20260925 19:00:54.599581  1237 rpc-test.cc:1859] Sending 1024MB via ssl-enabled tcp socket: real 1.620s	user 1.471s	sys 1.429s
I20260925 19:00:56.169129  1237 rpc-test.cc:1859] Sending 1024MB via ssl-enabled tcp socket: real 1.569s	user 1.461s	sys 1.354s
I20260925 19:00:57.742611  1237 rpc-test.cc:1859] Sending 1024MB via ssl-enabled tcp socket: real 1.573s	user 1.437s	sys 1.376s
I20260925 19:00:59.386688  1237 rpc-test.cc:1859] Sending 1024MB via ssl-enabled tcp socket: real 1.644s	user 1.418s	sys 1.508s
[       OK ] Parameters/TestRpc.TestPerformanceBySocketType/SSL_TCP (8083 ms)
[----------] 20 tests from Parameters/TestRpc (27455 ms total)

[----------] 1 test from Parameters/TestRpcSocketTxRxQueue
[ RUN      ] Parameters/TestRpcSocketTxRxQueue.OverCapacity/0
W20260925 19:00:59.666774  1738 negotiation.cc:337] Failed RPC negotiation. Trace:
0925 19:00:59.406025 (+     0us) reactor.cc:625] Submitting negotiation task for client connection to 0.0.0.0:33165 (local address 127.0.0.1:46162)
0925 19:00:59.406117 (+    92us) negotiation.cc:107] Waiting for socket to connect
0925 19:00:59.406126 (+     9us) client_negotiation.cc:174] Beginning negotiation
0925 19:00:59.406169 (+    43us) client_negotiation.cc:252] Sending NEGOTIATE NegotiatePB request
0925 19:00:59.666667 (+260498us) negotiation.cc:327] Negotiation complete: Network error: Client connection negotiation failed: client connection to 0.0.0.0:33165: BlockingRecv error: recv error from unknown peer: Transport endpoint is not connected (error 107)
Metrics: {"client-negotiator.queue_time_us":60}
W20260925 19:00:59.666778  1729 negotiation.cc:337] Failed RPC negotiation. Trace:
0925 19:00:59.405110 (+     0us) reactor.cc:625] Submitting negotiation task for client connection to 0.0.0.0:33165 (local address 127.0.0.1:46148)
0925 19:00:59.405176 (+    66us) negotiation.cc:107] Waiting for socket to connect
0925 19:00:59.405186 (+    10us) client_negotiation.cc:174] Beginning negotiation
0925 19:00:59.405248 (+    62us) client_negotiation.cc:252] Sending NEGOTIATE NegotiatePB request
0925 19:00:59.666631 (+261383us) negotiation.cc:327] Negotiation complete: Network error: Client connection negotiation failed: client connection to 0.0.0.0:33165: BlockingRecv error: recv error from unknown peer: Transport endpoint is not connected (error 107)
Metrics: {"client-negotiator.queue_time_us":41}
W20260925 19:00:59.666782  1720 negotiation.cc:337] Failed RPC negotiation. Trace:
0925 19:00:59.404121 (+     0us) reactor.cc:625] Submitting negotiation task for client connection to 0.0.0.0:33165 (local address 127.0.0.1:46138)
0925 19:00:59.404181 (+    60us) negotiation.cc:107] Waiting for socket to connect
0925 19:00:59.404190 (+     9us) client_negotiation.cc:174] Beginning negotiation
0925 19:00:59.404234 (+    44us) client_negotiation.cc:252] Sending NEGOTIATE NegotiatePB request
0925 19:00:59.666666 (+262432us) negotiation.cc:327] Negotiation complete: Network error: Client connection negotiation failed: client connection to 0.0.0.0:33165: BlockingRecv error: recv error from unknown peer: Transport endpoint is not connected (error 107)
Metrics: {"client-negotiator.queue_time_us":36}
W20260925 19:00:59.667091  1756 negotiation.cc:337] Failed RPC negotiation. Trace:
0925 19:00:59.407979 (+     0us) reactor.cc:625] Submitting negotiation task for client connection to 0.0.0.0:33165 (local address 127.0.0.1:46166)
0925 19:00:59.408032 (+    53us) negotiation.cc:107] Waiting for socket to connect
0925 19:00:59.408041 (+     9us) client_negotiation.cc:174] Beginning negotiation
0925 19:00:59.408099 (+    58us) client_negotiation.cc:252] Sending NEGOTIATE NegotiatePB request
0925 19:00:59.667051 (+258952us) negotiation.cc:327] Negotiation complete: Network error: Client connection negotiation failed: client connection to 0.0.0.0:33165: BlockingRecv error: recv error from unknown peer: Transport endpoint is not connected (error 107)
Metrics: {"client-negotiator.queue_time_us":32}
W20260925 19:00:59.666786  1711 negotiation.cc:337] Failed RPC negotiation. Trace:
0925 19:00:59.403078 (+     0us) reactor.cc:625] Submitting negotiation task for client connection to 0.0.0.0:33165 (local address 127.0.0.1:46134)
0925 19:00:59.403137 (+    59us) negotiation.cc:107] Waiting for socket to connect
0925 19:00:59.403148 (+    11us) client_negotiation.cc:174] Beginning negotiation
0925 19:00:59.403206 (+    58us) client_negotiation.cc:252] Sending NEGOTIATE NegotiatePB request
0925 19:00:59.666630 (+263424us) negotiation.cc:327] Negotiation complete: Network error: Client connection negotiation failed: client connection to 0.0.0.0:33165: BlockingRecv error: recv error from unknown peer: Transport endpoint is not connected (error 107)
Metrics: {"client-negotiator.queue_time_us":32}
W20260925 19:00:59.667244  1747 negotiation.cc:337] Failed RPC negotiation. Trace:
0925 19:00:59.406944 (+     0us) reactor.cc:625] Submitting negotiation task for client connection to 0.0.0.0:33165 (local address 127.0.0.1:46164)
0925 19:00:59.406999 (+    55us) negotiation.cc:107] Waiting for socket to connect
0925 19:00:59.407008 (+     9us) client_negotiation.cc:174] Beginning negotiation
0925 19:00:59.407073 (+    65us) client_negotiation.cc:252] Sending NEGOTIATE NegotiatePB request
0925 19:00:59.667202 (+260129us) negotiation.cc:327] Negotiation complete: Network error: Client connection negotiation failed: client connection to 0.0.0.0:33165: BlockingRecv error: recv error from unknown peer: Transport endpoint is not connected (error 107)
Metrics: {"client-negotiator.queue_time_us":36}
[       OK ] Parameters/TestRpcSocketTxRxQueue.OverCapacity/0 (1037 ms)
[----------] 1 test from Parameters/TestRpcSocketTxRxQueue (1037 ms total)

[----------] Global test environment tear-down
[==========] 21 tests from 2 test suites ran. (28492 ms total)
[  PASSED  ] 20 tests.
[  FAILED  ] 1 test, listed below:
[  FAILED  ] Parameters/TestRpc.TestCallWithChainCertAndChainCA/SSL_TCP, where GetParam() = (true, false)

 1 FAILED TEST