Diagnosed failure

Parameters/TestRpc.TestCallWithChainCertAndChainCA/SSL_UnixSocket: /data0/somelongdirectorytoavoidrpathissues/src/kudu/src/kudu/rpc/rpc-test.cc:270: Failure
Failed
Bad status: Runtime error: could not verify certificate chain (error with cert: subject=CN = localhost, ST = sadfjas, C = AS, emailAddress = sdflkdsajf, O = lskdfjlsad, OU = sldfkja, issuer=C = AS, ST = ASDfkjdhf, L = lskdjf, O = saldfja, OU = skdjf, CN = localhost, emailAddress = sadjflkadsj): : certificate has expired
Google Test trace:
/data0/somelongdirectorytoavoidrpathissues/src/kudu/src/kudu/rpc/rpc-test.cc:267: Connecting to unix:/tmp/dist-test-task99uLen/test-tmp/rpc-test-d2d741bb815b4dae8abdea0f67583f14.sock
I20260927 23:33:32.227358   883 test_util.cc:175] -----------------------------------------------
I20260927 23:33:32.227528   883 test_util.cc:176] Had fatal failures, leaving test files at /tmp/dist-test-task99uLen/test-tmp/rpc-test.6.Parameters_TestRpc.TestCallWithChainCertAndChainCA_SSL_UnixSocket.1790552010982098-883-0

Full log

Note: This is test shard 7 of 8.
[==========] Running 21 tests from 2 test suites.
[----------] Global test environment set-up.
[----------] 20 tests from Parameters/TestRpc
[ RUN      ] Parameters/TestRpc.TestMessengerCreateDestroy/SSL_UnixSocket
WARNING: Logging before InitGoogleLogging() is written to STDERR
I20260927 23:33:31.070946   883 rpc-test.cc:169] started messenger TestCreateDestroy
[       OK ] Parameters/TestRpc.TestMessengerCreateDestroy/SSL_UnixSocket (1065 ms)
[ RUN      ] Parameters/TestRpc.TestNegotiationDeadlock/SSL_UnixSocket
I20260927 23:33:32.129236   905 acceptor_pool.cc:254] collecting diagnostics on the listening RPC socket unix:/tmp/dist-test-task99uLen/test-tmp/rpc-test-c4e70ef919e746dc99df1ed11974cee0.sock every 8 connection(s)
I20260927 23:33:32.130597   906 acceptor_pool.cc:254] collecting diagnostics on the listening RPC socket unix:/tmp/dist-test-task99uLen/test-tmp/rpc-test-c4e70ef919e746dc99df1ed11974cee0.sock every 8 connection(s)
[       OK ] Parameters/TestRpc.TestNegotiationDeadlock/SSL_UnixSocket (79 ms)
[ RUN      ] Parameters/TestRpc.TestCallWithChainCertAndChainCA/SSL_UnixSocket
I20260927 23:33:32.200428   921 acceptor_pool.cc:254] collecting diagnostics on the listening RPC socket unix:/tmp/dist-test-task99uLen/test-tmp/rpc-test-d2d741bb815b4dae8abdea0f67583f14.sock every 8 connection(s)
I20260927 23:33:32.202345   922 acceptor_pool.cc:254] collecting diagnostics on the listening RPC socket unix:/tmp/dist-test-task99uLen/test-tmp/rpc-test-d2d741bb815b4dae8abdea0f67583f14.sock every 8 connection(s)
/data0/somelongdirectorytoavoidrpathissues/src/kudu/src/kudu/rpc/rpc-test.cc:270: Failure
Failed
Bad status: Runtime error: could not verify certificate chain (error with cert: subject=CN = localhost, ST = sadfjas, C = AS, emailAddress = sdflkdsajf, O = lskdfjlsad, OU = sldfkja, issuer=C = AS, ST = ASDfkjdhf, L = lskdjf, O = saldfja, OU = skdjf, CN = localhost, emailAddress = sadjflkadsj): : certificate has expired
Google Test trace:
/data0/somelongdirectorytoavoidrpathissues/src/kudu/src/kudu/rpc/rpc-test.cc:267: Connecting to unix:/tmp/dist-test-task99uLen/test-tmp/rpc-test-d2d741bb815b4dae8abdea0f67583f14.sock
I20260927 23:33:32.227358   883 test_util.cc:175] -----------------------------------------------
I20260927 23:33:32.227528   883 test_util.cc:176] Had fatal failures, leaving test files at /tmp/dist-test-task99uLen/test-tmp/rpc-test.6.Parameters_TestRpc.TestCallWithChainCertAndChainCA_SSL_UnixSocket.1790552010982098-883-0
[  FAILED  ] Parameters/TestRpc.TestCallWithChainCertAndChainCA/SSL_UnixSocket, where GetParam() = (true, true) (48 ms)
[ RUN      ] Parameters/TestRpc.TestCallWithPasswordProtectedKey/SSL_UnixSocket
I20260927 23:33:32.247726   946 acceptor_pool.cc:254] collecting diagnostics on the listening RPC socket unix:/tmp/dist-test-task99uLen/test-tmp/rpc-test-3544e5089584444c957525efa167187f.sock every 8 connection(s)
I20260927 23:33:32.248417   947 acceptor_pool.cc:254] collecting diagnostics on the listening RPC socket unix:/tmp/dist-test-task99uLen/test-tmp/rpc-test-3544e5089584444c957525efa167187f.sock every 8 connection(s)
[       OK ] Parameters/TestRpc.TestCallWithPasswordProtectedKey/SSL_UnixSocket (65 ms)
[ RUN      ] Parameters/TestRpc.TestCallToBadServer/SSL_UnixSocket
I20260927 23:33:32.309087   883 rpc-test.cc:394] Status: Network error: Client connection negotiation failed: client connection to 0.0.0.0:0: connect: Connection refused (error 111)
I20260927 23:33:32.310248   883 rpc-test.cc:394] Status: Network error: Client connection negotiation failed: client connection to 0.0.0.0:0: connect: Connection refused (error 111)
I20260927 23:33:32.311504   883 rpc-test.cc:394] Status: Network error: Client connection negotiation failed: client connection to 0.0.0.0:0: connect: Connection refused (error 111)
I20260927 23:33:32.312639   883 rpc-test.cc:394] Status: Network error: Client connection negotiation failed: client connection to 0.0.0.0:0: connect: Connection refused (error 111)
I20260927 23:33:32.313748   883 rpc-test.cc:394] Status: Network error: Client connection negotiation failed: client connection to 0.0.0.0:0: connect: Connection refused (error 111)
[       OK ] Parameters/TestRpc.TestCallToBadServer/SSL_UnixSocket (23 ms)
[ RUN      ] Parameters/TestRpc.TestWrongService/SSL_UnixSocket
I20260927 23:33:32.336642   981 acceptor_pool.cc:254] collecting diagnostics on the listening RPC socket unix:/tmp/dist-test-task99uLen/test-tmp/rpc-test-306b1dd64dd6415aab66cfac1707da5c.sock every 8 connection(s)
I20260927 23:33:32.337385   982 acceptor_pool.cc:254] collecting diagnostics on the listening RPC socket unix:/tmp/dist-test-task99uLen/test-tmp/rpc-test-306b1dd64dd6415aab66cfac1707da5c.sock every 8 connection(s)
I20260927 23:33:32.363951   978 messenger.cc:345] service WrongServiceName not registered on TestServer
W20260927 23:33:32.366828   978 connection.cc:196] Error closing socket: Network error: TlsSocket::Close: Broken pipe
[       OK ] Parameters/TestRpc.TestWrongService/SSL_UnixSocket (54 ms)
[ RUN      ] Parameters/TestRpc.TestConnectionKeepalive/SSL_UnixSocket
I20260927 23:33:32.395726  1004 acceptor_pool.cc:254] collecting diagnostics on the listening RPC socket unix:/tmp/dist-test-task99uLen/test-tmp/rpc-test-c594f295807c49e5b973d00014b7f10d.sock every 8 connection(s)
I20260927 23:33:32.396423  1005 acceptor_pool.cc:254] collecting diagnostics on the listening RPC socket unix:/tmp/dist-test-task99uLen/test-tmp/rpc-test-c594f295807c49e5b973d00014b7f10d.sock every 8 connection(s)
I20260927 23:33:32.399320   883 rpc-test.cc:488] Connecting to unix:/tmp/dist-test-task99uLen/test-tmp/rpc-test-c594f295807c49e5b973d00014b7f10d.sock
W20260927 23:33:32.874369  1017 connection.cc:196] Error closing socket: Network error: TlsSocket::Close: Broken pipe
[       OK ] Parameters/TestRpc.TestConnectionKeepalive/SSL_UnixSocket (1076 ms)
[ RUN      ] Parameters/TestRpc.TestClientConnectionMetrics/SSL_UnixSocket
I20260927 23:33:33.478731  1029 acceptor_pool.cc:254] collecting diagnostics on the listening RPC socket unix:/tmp/dist-test-task99uLen/test-tmp/rpc-test-f509dbb26d734b4886b0cbbc4e979d20.sock every 8 connection(s)
I20260927 23:33:33.479444  1030 acceptor_pool.cc:254] collecting diagnostics on the listening RPC socket unix:/tmp/dist-test-task99uLen/test-tmp/rpc-test-f509dbb26d734b4886b0cbbc4e979d20.sock every 8 connection(s)
I20260927 23:33:33.482393   883 rpc-test.cc:569] Connecting to unix:/tmp/dist-test-task99uLen/test-tmp/rpc-test-f509dbb26d734b4886b0cbbc4e979d20.sock
W20260927 23:35:41.726938  1026 connection.cc:196] Error closing socket: Network error: TlsSocket::Close: Broken pipe
[       OK ] Parameters/TestRpc.TestClientConnectionMetrics/SSL_UnixSocket (128286 ms)
[ RUN      ] Parameters/TestRpc.TestCredentialsPolicy/SSL_UnixSocket
I20260927 23:35:41.766815  1065 acceptor_pool.cc:254] collecting diagnostics on the listening RPC socket unix:/tmp/dist-test-task99uLen/test-tmp/rpc-test-f8f2171f178a4ac2b98a8db888c75d50.sock every 8 connection(s)
I20260927 23:35:41.767634  1066 acceptor_pool.cc:254] collecting diagnostics on the listening RPC socket unix:/tmp/dist-test-task99uLen/test-tmp/rpc-test-f8f2171f178a4ac2b98a8db888c75d50.sock every 8 connection(s)
I20260927 23:35:41.770720   883 rpc-test.cc:700] Connecting to unix:/tmp/dist-test-task99uLen/test-tmp/rpc-test-f8f2171f178a4ac2b98a8db888c75d50.sock
W20260927 23:35:41.809042  1064 connection.cc:196] Error closing socket: Network error: TlsSocket::Close: Broken pipe
W20260927 23:35:41.822139  1064 connection.cc:196] Error closing socket: Network error: TlsSocket::Close: Broken pipe
[       OK ] Parameters/TestRpc.TestCredentialsPolicy/SSL_UnixSocket (94 ms)
[ RUN      ] Parameters/TestRpc.TestCallLongerThanKeepalive/SSL_UnixSocket
I20260927 23:35:41.849999  1090 acceptor_pool.cc:254] collecting diagnostics on the listening RPC socket unix:/tmp/dist-test-task99uLen/test-tmp/rpc-test-cc60a0e42c054521a26da71de2d07f0e.sock every 8 connection(s)
I20260927 23:35:41.850664  1091 acceptor_pool.cc:254] collecting diagnostics on the listening RPC socket unix:/tmp/dist-test-task99uLen/test-tmp/rpc-test-cc60a0e42c054521a26da71de2d07f0e.sock every 8 connection(s)
I20260927 23:35:41.885689  1094 rpc-test-base.h:222] got call: sleep_micros: 3000000 deferred: true
I20260927 23:35:44.889895  1094 rpcz_store.cc:275] Call kudu.rpc.GenericCalculatorService.Sleep from unix:<unnamed> (request call id 0) took 3004 ms. Trace:
I20260927 23:35:44.890179  1094 rpcz_store.cc:276] 0927 23:35:41.885537 (+     0us) service_pool.cc:170] Inserting onto call queue
0927 23:35:41.885633 (+    96us) service_pool.cc:227] Handling call
0927 23:35:44.889837 (+3004204us) inbound_call.cc:173] Queueing success response
Metrics: {}
[       OK ] Parameters/TestRpc.TestCallLongerThanKeepalive/SSL_UnixSocket (3070 ms)
[ RUN      ] Parameters/TestRpc.TestRpcSidecar/SSL_UnixSocket
I20260927 23:35:44.943162  1115 acceptor_pool.cc:254] collecting diagnostics on the listening RPC socket unix:/tmp/dist-test-task99uLen/test-tmp/rpc-test-18031808bacc42b8a101044d6cd77b60.sock every 8 connection(s)
I20260927 23:35:44.943841  1116 acceptor_pool.cc:254] collecting diagnostics on the listening RPC socket unix:/tmp/dist-test-task99uLen/test-tmp/rpc-test-18031808bacc42b8a101044d6cd77b60.sock every 8 connection(s)
W20260927 23:35:45.448693  1112 connection.cc:196] Error closing socket: Network error: TlsSocket::Close: Broken pipe
[       OK ] Parameters/TestRpc.TestRpcSidecar/SSL_UnixSocket (554 ms)
[ RUN      ] Parameters/TestRpc.TestRpcSidecarLimits/SSL_UnixSocket
I20260927 23:36:01.390636  1141 acceptor_pool.cc:254] collecting diagnostics on the listening RPC socket unix:/tmp/dist-test-task99uLen/test-tmp/rpc-test-8f696b710bde44e0a69fc7bc887bb894.sock every 8 connection(s)
I20260927 23:36:01.391404  1142 acceptor_pool.cc:254] collecting diagnostics on the listening RPC socket unix:/tmp/dist-test-task99uLen/test-tmp/rpc-test-8f696b710bde44e0a69fc7bc887bb894.sock every 8 connection(s)
W20260927 23:36:01.602231   883 serialization.cc:72] Serialized kudu.rpc_test.PushStringsRequestPB (2147483654 bytes) is larger than the maximum configured RPC message size (52428800 bytes). Sending anyway, but peer may reject the data.
W20260927 23:36:01.613411  1138 connection.cc:535] server connection from unix:<unnamed> recv error: Network error: RPC frame had a length of 2147483714, but we only support messages up to 52428800 bytes long.
W20260927 23:36:01.613855  1138 connection.cc:158] shutting down server connection from unix:<unnamed> with pending inbound data: 4/2147483714 bytes received; last active 0 ns ago: status Network error: RPC frame had a length of 2147483714, but we only support messages up to 52428800 bytes long.
W20260927 23:36:01.614884  1154 connection.cc:698] client connection to unix:/tmp/dist-test-task99uLen/test-tmp/rpc-test-8f696b710bde44e0a69fc7bc887bb894.sock send error: Network error: failed to write to TLS socket: Broken pipe
W20260927 23:36:01.615550  1154 connection.cc:196] Error closing socket: Network error: TlsSocket::Close: Success
[       OK ] Parameters/TestRpc.TestRpcSidecarLimits/SSL_UnixSocket (16731 ms)
[ RUN      ] Parameters/TestRpc.TestCallTimeoutDoesntAffectNegotiation/SSL_UnixSocket
I20260927 23:36:02.204883  1167 acceptor_pool.cc:254] collecting diagnostics on the listening RPC socket unix:/tmp/dist-test-task99uLen/test-tmp/rpc-test-fded6d4a56bc4674bd9ced23433cb9f1.sock every 8 connection(s)
I20260927 23:36:02.205699  1168 acceptor_pool.cc:254] collecting diagnostics on the listening RPC socket unix:/tmp/dist-test-task99uLen/test-tmp/rpc-test-fded6d4a56bc4674bd9ced23433cb9f1.sock every 8 connection(s)
W20260927 23:36:02.239907  1163 negotiation.cc:266] Injecting 500ms delay in negotiation
I20260927 23:36:02.290366   883 rpc-test-base.h:595] status: Timed out: connection negotiation to unix:/tmp/dist-test-task99uLen/test-tmp/rpc-test-fded6d4a56bc4674bd9ced23433cb9f1.sock for RPC Sleep timed out after 0.050s (ON_OUTBOUND_QUEUE), seconds elapsed: 0.0515212
W20260927 23:36:02.755210  1164 connection.cc:196] Error closing socket: Network error: TlsSocket::Close: Broken pipe
[       OK ] Parameters/TestRpc.TestCallTimeoutDoesntAffectNegotiation/SSL_UnixSocket (574 ms)
[ RUN      ] Parameters/TestRpc.TestRpcHandlerLatencyMetric/SSL_UnixSocket
I20260927 23:36:02.789408  1192 acceptor_pool.cc:254] collecting diagnostics on the listening RPC socket unix:/tmp/dist-test-task99uLen/test-tmp/rpc-test-78021bbba8d0423e9fcd5d55bc8aa52b.sock every 8 connection(s)
I20260927 23:36:02.790035  1193 acceptor_pool.cc:254] collecting diagnostics on the listening RPC socket unix:/tmp/dist-test-task99uLen/test-tmp/rpc-test-78021bbba8d0423e9fcd5d55bc8aa52b.sock every 8 connection(s)
I20260927 23:36:02.859413   883 rpc-test.cc:1236] Sleep() min lat: 21522
I20260927 23:36:02.859606   883 rpc-test.cc:1237] Sleep() mean lat: 21522
I20260927 23:36:02.859771   883 rpc-test.cc:1238] Sleep() max lat: 21522
I20260927 23:36:02.859926   883 rpc-test.cc:1239] Sleep() #calls: 1
[       OK ] Parameters/TestRpc.TestRpcHandlerLatencyMetric/SSL_UnixSocket (107 ms)
[ RUN      ] Parameters/TestRpc.TimedOutOnResponseMetricServiceQueue/SSL_UnixSocket
I20260927 23:36:02.907276  1218 acceptor_pool.cc:254] collecting diagnostics on the listening RPC socket unix:/tmp/dist-test-task99uLen/test-tmp/rpc-test-b6292a506a904f989c616dc278542396.sock every 8 connection(s)
I20260927 23:36:02.907963  1219 acceptor_pool.cc:254] collecting diagnostics on the listening RPC socket unix:/tmp/dist-test-task99uLen/test-tmp/rpc-test-b6292a506a904f989c616dc278542396.sock every 8 connection(s)
W20260927 23:36:02.985891  1220 rpcz_store.cc:267] Call kudu.rpc_test.CalculatorService.Sleep from unix:<unnamed> (request call id 2) took 20 ms (client timeout 20 ms). Trace:
W20260927 23:36:02.986243  1220 rpcz_store.cc:269] 0927 23:36:02.965318 (+     0us) service_pool.cc:170] Inserting onto call queue
0927 23:36:02.985707 (+ 20389us) service_pool.cc:214] Skipping call since client already timed out
0927 23:36:02.985824 (+   117us) inbound_call.cc:173] Queueing failure response
Metrics: {}
W20260927 23:36:02.988413  1215 connection.cc:196] Error closing socket: Network error: TlsSocket::Close: Broken pipe
[       OK ] Parameters/TestRpc.TimedOutOnResponseMetricServiceQueue/SSL_UnixSocket (125 ms)
[ RUN      ] Parameters/TestRpc.RpcPendingConnectionsMetric/SSL_UnixSocket
I20260927 23:36:03.001930  1241 acceptor_pool.cc:254] collecting diagnostics on the listening RPC socket 0.0.0.0:36255 every 8 connection(s)
I20260927 23:36:03.002555  1242 acceptor_pool.cc:254] collecting diagnostics on the listening RPC socket 0.0.0.0:36255 every 8 connection(s)
W20260927 23:36:03.016062  1237 negotiation.cc:337] Failed RPC negotiation. Trace:
0927 23:36:03.014477 (+     0us) reactor.cc:625] Submitting negotiation task for server connection from 127.0.0.1:42810 (local address 127.0.0.1:36255)
0927 23:36:03.015033 (+   556us) server_negotiation.cc:206] Beginning negotiation
0927 23:36:03.015059 (+    26us) server_negotiation.cc:399] Waiting for connection header
0927 23:36:03.015405 (+   346us) negotiation.cc:327] Negotiation complete: Network error: Server connection negotiation failed: server connection from 127.0.0.1:42810: BlockingRecv error: recv got EOF from 127.0.0.1:42810 (error 108)
Metrics: {"server-negotiator.queue_time_us":124}
[       OK ] Parameters/TestRpc.RpcPendingConnectionsMetric/SSL_UnixSocket (36 ms)
[ RUN      ] Parameters/TestRpc.TestRpcContextClientDeadline/SSL_UnixSocket
I20260927 23:36:03.055250  1257 acceptor_pool.cc:254] collecting diagnostics on the listening RPC socket unix:/tmp/dist-test-task99uLen/test-tmp/rpc-test-725c8e1768e94f14b672616361358092.sock every 8 connection(s)
I20260927 23:36:03.055924  1258 acceptor_pool.cc:254] collecting diagnostics on the listening RPC socket unix:/tmp/dist-test-task99uLen/test-tmp/rpc-test-725c8e1768e94f14b672616361358092.sock every 8 connection(s)
W20260927 23:36:03.113256  1254 connection.cc:196] Error closing socket: Network error: TlsSocket::Close: Broken pipe
[       OK ] Parameters/TestRpc.TestRpcContextClientDeadline/SSL_UnixSocket (89 ms)
[ RUN      ] Parameters/TestRpc.TestApplicationFeatureFlagUnsupportedServer/SSL_UnixSocket
I20260927 23:36:03.136173  1282 acceptor_pool.cc:254] collecting diagnostics on the listening RPC socket unix:/tmp/dist-test-task99uLen/test-tmp/rpc-test-47a2e41c6d7f4719bbbdbcff0fb1558e.sock every 8 connection(s)
I20260927 23:36:03.136814  1283 acceptor_pool.cc:254] collecting diagnostics on the listening RPC socket unix:/tmp/dist-test-task99uLen/test-tmp/rpc-test-47a2e41c6d7f4719bbbdbcff0fb1558e.sock every 8 connection(s)
[       OK ] Parameters/TestRpc.TestApplicationFeatureFlagUnsupportedServer/SSL_UnixSocket (54 ms)
[ RUN      ] Parameters/TestRpc.TestCancellationAsync/SSL_UnixSocket
I20260927 23:36:03.193053  1307 acceptor_pool.cc:254] collecting diagnostics on the listening RPC socket unix:/tmp/dist-test-task99uLen/test-tmp/rpc-test-a535cc5f92d6496fa9cfac59a028dd6e.sock every 8 connection(s)
I20260927 23:36:03.193733  1308 acceptor_pool.cc:254] collecting diagnostics on the listening RPC socket unix:/tmp/dist-test-task99uLen/test-tmp/rpc-test-a535cc5f92d6496fa9cfac59a028dd6e.sock every 8 connection(s)
I20260927 23:36:03.196749   883 rpc-test.cc:1716] Connecting to unix:/tmp/dist-test-task99uLen/test-tmp/rpc-test-a535cc5f92d6496fa9cfac59a028dd6e.sock
I20260927 23:36:03.224790   883 test_util.cc:268] Using random seed: 1772358847
I20260927 23:36:03.437583  1311 rpc-test-base.h:240] got call: sleep_micros: 500 pattern: 4294967295 num_repetitions: 2097152 sidecar_idx: 0
I20260927 23:36:03.655565  1311 rpc-test-base.h:240] got call: sleep_micros: 500 pattern: 4294967295 num_repetitions: 2097152 sidecar_idx: 0
I20260927 23:36:03.869942  1310 rpc-test-base.h:240] got call: sleep_micros: 500 pattern: 4294967295 num_repetitions: 2097152 sidecar_idx: 0
I20260927 23:36:04.077358  1310 rpc-test-base.h:240] got call: sleep_micros: 500 pattern: 4294967295 num_repetitions: 2097152 sidecar_idx: 0
I20260927 23:36:04.258554  1311 rpc-test-base.h:240] got call: sleep_micros: 500 pattern: 4294967295 num_repetitions: 2097152 sidecar_idx: 0
I20260927 23:36:04.445503  1310 rpc-test-base.h:240] got call: sleep_micros: 500 pattern: 4294967295 num_repetitions: 2097152 sidecar_idx: 0
I20260927 23:36:04.662750  1310 rpc-test-base.h:240] got call: sleep_micros: 500 pattern: 4294967295 num_repetitions: 2097152 sidecar_idx: 0
I20260927 23:36:04.861099  1311 rpc-test-base.h:240] got call: sleep_micros: 500 pattern: 4294967295 num_repetitions: 2097152 sidecar_idx: 0
I20260927 23:36:05.037987  1310 rpc-test-base.h:240] got call: sleep_micros: 500 pattern: 4294967295 num_repetitions: 2097152 sidecar_idx: 0
W20260927 23:36:05.062388  1304 connection.cc:196] Error closing socket: Network error: TlsSocket::Close: Broken pipe
W20260927 23:36:05.092231  1304 connection.cc:441] server connection from unix:<unnamed> torn down before Call kudu.rpc.GenericCalculatorService.SleepWithSidecar from unix:<unnamed> (request call id 8) could send its response
W20260927 23:36:05.176528  1304 connection.cc:441] server connection from unix:<unnamed> torn down before Call kudu.rpc.GenericCalculatorService.SleepWithSidecar from unix:<unnamed> (request call id 9) could send its response
[       OK ] Parameters/TestRpc.TestCancellationAsync/SSL_UnixSocket (2012 ms)
[ RUN      ] Parameters/TestRpc.TestPerformanceBySocketType/SSL_UnixSocket
I20260927 23:36:05.278847  1332 acceptor_pool.cc:254] collecting diagnostics on the listening RPC socket unix:/tmp/dist-test-task99uLen/test-tmp/rpc-test-e5dffcf812174c789e4a1362f15dc077.sock every 8 connection(s)
I20260927 23:36:05.279541  1333 acceptor_pool.cc:254] collecting diagnostics on the listening RPC socket unix:/tmp/dist-test-task99uLen/test-tmp/rpc-test-e5dffcf812174c789e4a1362f15dc077.sock every 8 connection(s)
I20260927 23:36:05.282495   883 rpc-test.cc:1846] Connecting to unix:/tmp/dist-test-task99uLen/test-tmp/rpc-test-e5dffcf812174c789e4a1362f15dc077.sock
I20260927 23:36:25.860858   883 rpc-test.cc:1859] Sending 1024MB via ssl-enabled unix socket: real 20.544s	user 18.761s	sys 12.078s
I20260927 23:36:46.321542   883 rpc-test.cc:1859] Sending 1024MB via ssl-enabled unix socket: real 20.460s	user 18.183s	sys 12.391s
I20260927 23:37:06.621173   883 rpc-test.cc:1859] Sending 1024MB via ssl-enabled unix socket: real 20.299s	user 18.455s	sys 11.778s
I20260927 23:37:26.916997   883 rpc-test.cc:1859] Sending 1024MB via ssl-enabled unix socket: real 20.295s	user 18.391s	sys 11.767s
I20260927 23:37:47.149832   883 rpc-test.cc:1859] Sending 1024MB via ssl-enabled unix socket: real 20.232s	user 18.261s	sys 11.816s
W20260927 23:37:47.154932  1329 connection.cc:196] Error closing socket: Network error: TlsSocket::Close: Broken pipe
[       OK ] Parameters/TestRpc.TestPerformanceBySocketType/SSL_UnixSocket (101980 ms)
[----------] 20 tests from Parameters/TestRpc (256132 ms total)

[----------] 1 test from Parameters/TestRpcSocketTxRxQueue
[ RUN      ] Parameters/TestRpcSocketTxRxQueue.AcceptorRxQueueSizeMetric/0
I20260927 23:37:47.179800  1367 acceptor_pool.cc:254] collecting diagnostics on the listening RPC socket 0.0.0.0:43789 every 1 connection(s)
I20260927 23:37:47.180686  1368 acceptor_pool.cc:254] collecting diagnostics on the listening RPC socket 0.0.0.0:43789 every 1 connection(s)
W20260927 23:37:47.186200  1363 negotiation.cc:337] Failed RPC negotiation. Trace:
0927 23:37:47.184802 (+     0us) reactor.cc:625] Submitting negotiation task for server connection from 127.0.0.1:47166 (local address 127.0.0.1:43789)
0927 23:37:47.185282 (+   480us) server_negotiation.cc:206] Beginning negotiation
0927 23:37:47.185306 (+    24us) server_negotiation.cc:399] Waiting for connection header
0927 23:37:47.185541 (+   235us) negotiation.cc:327] Negotiation complete: Network error: Server connection negotiation failed: server connection from 127.0.0.1:47166: BlockingRecv error: recv got EOF from 127.0.0.1:47166 (error 108)
Metrics: {"server-negotiator.queue_time_us":132}
[       OK ] Parameters/TestRpcSocketTxRxQueue.AcceptorRxQueueSizeMetric/0 (27 ms)
[----------] 1 test from Parameters/TestRpcSocketTxRxQueue (27 ms total)

[----------] Global test environment tear-down
[==========] 21 tests from 2 test suites ran. (256160 ms total)
[  PASSED  ] 20 tests.
[  FAILED  ] 1 test, listed below:
[  FAILED  ] Parameters/TestRpc.TestCallWithChainCertAndChainCA/SSL_UnixSocket, where GetParam() = (true, true)

 1 FAILED TEST