Diagnosed failure
Parameters/TestRpc.TestCallWithChainCertAndChainCA/SSL_UnixSocket: /data0/somelongdirectorytoavoidrpathissues/src/kudu/src/kudu/rpc/rpc-test.cc:270: Failure
Failed
Bad status: Runtime error: could not verify certificate chain (error with cert: subject=CN = localhost, ST = sadfjas, C = AS, emailAddress = sdflkdsajf, O = lskdfjlsad, OU = sldfkja, issuer=C = AS, ST = ASDfkjdhf, L = lskdjf, O = saldfja, OU = skdjf, CN = localhost, emailAddress = sadjflkadsj): : certificate has expired
Google Test trace:
/data0/somelongdirectorytoavoidrpathissues/src/kudu/src/kudu/rpc/rpc-test.cc:267: Connecting to unix:/tmp/dist-test-taskyYIs_6/test-tmp/rpc-test-f2d3141ca61447b7991ede7725c7bf5b.sock
I20260923 14:34:20.446719 30174 test_util.cc:175] -----------------------------------------------
I20260923 14:34:20.446884 30174 test_util.cc:176] Had fatal failures, leaving test files at /tmp/dist-test-taskyYIs_6/test-tmp/rpc-test.6.Parameters_TestRpc.TestCallWithChainCertAndChainCA_SSL_UnixSocket.1790174059100398-30174-0
Full log
Note: This is test shard 7 of 8.
[==========] Running 21 tests from 2 test suites.
[----------] Global test environment set-up.
[----------] 20 tests from Parameters/TestRpc
[ RUN ] Parameters/TestRpc.TestMessengerCreateDestroy/SSL_UnixSocket
WARNING: Logging before InitGoogleLogging() is written to STDERR
I20260923 14:34:19.245426 30174 rpc-test.cc:169] started messenger TestCreateDestroy
[ OK ] Parameters/TestRpc.TestMessengerCreateDestroy/SSL_UnixSocket (1161 ms)
[ RUN ] Parameters/TestRpc.TestNegotiationDeadlock/SSL_UnixSocket
I20260923 14:34:20.337137 30197 acceptor_pool.cc:254] collecting diagnostics on the listening RPC socket unix:/tmp/dist-test-taskyYIs_6/test-tmp/rpc-test-7759a5b6f1954e2b81717883ccaa7d88.sock every 8 connection(s)
I20260923 14:34:20.338497 30198 acceptor_pool.cc:254] collecting diagnostics on the listening RPC socket unix:/tmp/dist-test-taskyYIs_6/test-tmp/rpc-test-7759a5b6f1954e2b81717883ccaa7d88.sock every 8 connection(s)
[ OK ] Parameters/TestRpc.TestNegotiationDeadlock/SSL_UnixSocket (79 ms)
[ RUN ] Parameters/TestRpc.TestCallWithChainCertAndChainCA/SSL_UnixSocket
I20260923 14:34:20.420204 30213 acceptor_pool.cc:254] collecting diagnostics on the listening RPC socket unix:/tmp/dist-test-taskyYIs_6/test-tmp/rpc-test-f2d3141ca61447b7991ede7725c7bf5b.sock every 8 connection(s)
I20260923 14:34:20.422176 30214 acceptor_pool.cc:254] collecting diagnostics on the listening RPC socket unix:/tmp/dist-test-taskyYIs_6/test-tmp/rpc-test-f2d3141ca61447b7991ede7725c7bf5b.sock every 8 connection(s)
/data0/somelongdirectorytoavoidrpathissues/src/kudu/src/kudu/rpc/rpc-test.cc:270: Failure
Failed
Bad status: Runtime error: could not verify certificate chain (error with cert: subject=CN = localhost, ST = sadfjas, C = AS, emailAddress = sdflkdsajf, O = lskdfjlsad, OU = sldfkja, issuer=C = AS, ST = ASDfkjdhf, L = lskdjf, O = saldfja, OU = skdjf, CN = localhost, emailAddress = sadjflkadsj): : certificate has expired
Google Test trace:
/data0/somelongdirectorytoavoidrpathissues/src/kudu/src/kudu/rpc/rpc-test.cc:267: Connecting to unix:/tmp/dist-test-taskyYIs_6/test-tmp/rpc-test-f2d3141ca61447b7991ede7725c7bf5b.sock
I20260923 14:34:20.446719 30174 test_util.cc:175] -----------------------------------------------
I20260923 14:34:20.446884 30174 test_util.cc:176] Had fatal failures, leaving test files at /tmp/dist-test-taskyYIs_6/test-tmp/rpc-test.6.Parameters_TestRpc.TestCallWithChainCertAndChainCA_SSL_UnixSocket.1790174059100398-30174-0
[ FAILED ] Parameters/TestRpc.TestCallWithChainCertAndChainCA/SSL_UnixSocket, where GetParam() = (true, true) (55 ms)
[ RUN ] Parameters/TestRpc.TestCallWithPasswordProtectedKey/SSL_UnixSocket
I20260923 14:34:20.508204 30238 acceptor_pool.cc:254] collecting diagnostics on the listening RPC socket unix:/tmp/dist-test-taskyYIs_6/test-tmp/rpc-test-7d2cf6e40fa646fda908bdd7e80efb9f.sock every 8 connection(s)
I20260923 14:34:20.508893 30239 acceptor_pool.cc:254] collecting diagnostics on the listening RPC socket unix:/tmp/dist-test-taskyYIs_6/test-tmp/rpc-test-7d2cf6e40fa646fda908bdd7e80efb9f.sock every 8 connection(s)
W20260923 14:34:20.547619 30235 connection.cc:196] Error closing socket: Network error: TlsSocket::Close: Broken pipe
[ OK ] Parameters/TestRpc.TestCallWithPasswordProtectedKey/SSL_UnixSocket (106 ms)
[ RUN ] Parameters/TestRpc.TestCallToBadServer/SSL_UnixSocket
I20260923 14:34:20.580466 30174 rpc-test.cc:394] Status: Network error: Client connection negotiation failed: client connection to 0.0.0.0:0: connect: Connection refused (error 111)
I20260923 14:34:20.581684 30174 rpc-test.cc:394] Status: Network error: Client connection negotiation failed: client connection to 0.0.0.0:0: connect: Connection refused (error 111)
I20260923 14:34:20.582837 30174 rpc-test.cc:394] Status: Network error: Client connection negotiation failed: client connection to 0.0.0.0:0: connect: Connection refused (error 111)
I20260923 14:34:20.584025 30174 rpc-test.cc:394] Status: Network error: Client connection negotiation failed: client connection to 0.0.0.0:0: connect: Connection refused (error 111)
I20260923 14:34:20.585165 30174 rpc-test.cc:394] Status: Network error: Client connection negotiation failed: client connection to 0.0.0.0:0: connect: Connection refused (error 111)
[ OK ] Parameters/TestRpc.TestCallToBadServer/SSL_UnixSocket (34 ms)
[ RUN ] Parameters/TestRpc.TestWrongService/SSL_UnixSocket
I20260923 14:34:20.609508 30273 acceptor_pool.cc:254] collecting diagnostics on the listening RPC socket unix:/tmp/dist-test-taskyYIs_6/test-tmp/rpc-test-2f6ef70db8c9479b85ebaa4fea736139.sock every 8 connection(s)
I20260923 14:34:20.610285 30274 acceptor_pool.cc:254] collecting diagnostics on the listening RPC socket unix:/tmp/dist-test-taskyYIs_6/test-tmp/rpc-test-2f6ef70db8c9479b85ebaa4fea736139.sock every 8 connection(s)
I20260923 14:34:20.657253 30270 messenger.cc:345] service WrongServiceName not registered on TestServer
W20260923 14:34:20.660161 30270 connection.cc:196] Error closing socket: Network error: TlsSocket::Close: Broken pipe
[ OK ] Parameters/TestRpc.TestWrongService/SSL_UnixSocket (76 ms)
[ RUN ] Parameters/TestRpc.TestConnectionKeepalive/SSL_UnixSocket
I20260923 14:34:20.687798 30297 acceptor_pool.cc:254] collecting diagnostics on the listening RPC socket unix:/tmp/dist-test-taskyYIs_6/test-tmp/rpc-test-4d0691a72aa546f8b114d4318ea9c649.sock every 8 connection(s)
I20260923 14:34:20.688469 30298 acceptor_pool.cc:254] collecting diagnostics on the listening RPC socket unix:/tmp/dist-test-taskyYIs_6/test-tmp/rpc-test-4d0691a72aa546f8b114d4318ea9c649.sock every 8 connection(s)
I20260923 14:34:20.691423 30174 rpc-test.cc:488] Connecting to unix:/tmp/dist-test-taskyYIs_6/test-tmp/rpc-test-4d0691a72aa546f8b114d4318ea9c649.sock
W20260923 14:34:21.167697 30310 connection.cc:196] Error closing socket: Network error: TlsSocket::Close: Broken pipe
[ OK ] Parameters/TestRpc.TestConnectionKeepalive/SSL_UnixSocket (1065 ms)
[ RUN ] Parameters/TestRpc.TestClientConnectionMetrics/SSL_UnixSocket
I20260923 14:34:21.746146 30322 acceptor_pool.cc:254] collecting diagnostics on the listening RPC socket unix:/tmp/dist-test-taskyYIs_6/test-tmp/rpc-test-3ca45d90661a49c8b77a10d0f08b625d.sock every 8 connection(s)
I20260923 14:34:21.746822 30323 acceptor_pool.cc:254] collecting diagnostics on the listening RPC socket unix:/tmp/dist-test-taskyYIs_6/test-tmp/rpc-test-3ca45d90661a49c8b77a10d0f08b625d.sock every 8 connection(s)
I20260923 14:34:21.749801 30174 rpc-test.cc:569] Connecting to unix:/tmp/dist-test-taskyYIs_6/test-tmp/rpc-test-3ca45d90661a49c8b77a10d0f08b625d.sock
W20260923 14:36:26.177510 30319 connection.cc:196] Error closing socket: Network error: TlsSocket::Close: Broken pipe
[ OK ] Parameters/TestRpc.TestClientConnectionMetrics/SSL_UnixSocket (124454 ms)
[ RUN ] Parameters/TestRpc.TestCredentialsPolicy/SSL_UnixSocket
I20260923 14:36:26.200876 30357 acceptor_pool.cc:254] collecting diagnostics on the listening RPC socket unix:/tmp/dist-test-taskyYIs_6/test-tmp/rpc-test-07641aceb28d424f912bfad7848c5b00.sock every 8 connection(s)
I20260923 14:36:26.201704 30358 acceptor_pool.cc:254] collecting diagnostics on the listening RPC socket unix:/tmp/dist-test-taskyYIs_6/test-tmp/rpc-test-07641aceb28d424f912bfad7848c5b00.sock every 8 connection(s)
I20260923 14:36:26.204660 30174 rpc-test.cc:700] Connecting to unix:/tmp/dist-test-taskyYIs_6/test-tmp/rpc-test-07641aceb28d424f912bfad7848c5b00.sock
W20260923 14:36:26.232367 30356 connection.cc:196] Error closing socket: Network error: TlsSocket::Close: Broken pipe
W20260923 14:36:26.244828 30356 connection.cc:196] Error closing socket: Network error: TlsSocket::Close: Broken pipe
[ OK ] Parameters/TestRpc.TestCredentialsPolicy/SSL_UnixSocket (66 ms)
[ RUN ] Parameters/TestRpc.TestCallLongerThanKeepalive/SSL_UnixSocket
I20260923 14:36:26.272962 30382 acceptor_pool.cc:254] collecting diagnostics on the listening RPC socket unix:/tmp/dist-test-taskyYIs_6/test-tmp/rpc-test-f2cef8b78f4a4bd8b8214443bb18f4fb.sock every 8 connection(s)
I20260923 14:36:26.273653 30383 acceptor_pool.cc:254] collecting diagnostics on the listening RPC socket unix:/tmp/dist-test-taskyYIs_6/test-tmp/rpc-test-f2cef8b78f4a4bd8b8214443bb18f4fb.sock every 8 connection(s)
I20260923 14:36:26.300226 30386 rpc-test-base.h:222] got call: sleep_micros: 3000000 deferred: true
I20260923 14:36:29.304318 30386 rpcz_store.cc:275] Call kudu.rpc.GenericCalculatorService.Sleep from unix:<unnamed> (request call id 0) took 3004 ms. Trace:
I20260923 14:36:29.304682 30386 rpcz_store.cc:276] 0923 14:36:26.300073 (+ 0us) service_pool.cc:170] Inserting onto call queue
0923 14:36:26.300174 (+ 101us) service_pool.cc:227] Handling call
0923 14:36:29.304251 (+3004077us) inbound_call.cc:173] Queueing success response
Metrics: {}
W20260923 14:36:29.308431 30379 connection.cc:196] Error closing socket: Network error: TlsSocket::Close: Broken pipe
[ OK ] Parameters/TestRpc.TestCallLongerThanKeepalive/SSL_UnixSocket (3062 ms)
[ RUN ] Parameters/TestRpc.TestRpcSidecar/SSL_UnixSocket
I20260923 14:36:29.350265 30407 acceptor_pool.cc:254] collecting diagnostics on the listening RPC socket unix:/tmp/dist-test-taskyYIs_6/test-tmp/rpc-test-cb4d2438450a4b088722b0212eaacebc.sock every 8 connection(s)
I20260923 14:36:29.350957 30408 acceptor_pool.cc:254] collecting diagnostics on the listening RPC socket unix:/tmp/dist-test-taskyYIs_6/test-tmp/rpc-test-cb4d2438450a4b088722b0212eaacebc.sock every 8 connection(s)
W20260923 14:36:29.836066 30404 connection.cc:196] Error closing socket: Network error: TlsSocket::Close: Broken pipe
[ OK ] Parameters/TestRpc.TestRpcSidecar/SSL_UnixSocket (528 ms)
[ RUN ] Parameters/TestRpc.TestRpcSidecarLimits/SSL_UnixSocket
I20260923 14:36:46.357311 30434 acceptor_pool.cc:254] collecting diagnostics on the listening RPC socket unix:/tmp/dist-test-taskyYIs_6/test-tmp/rpc-test-95545e13c061498ea88dbd099cede3b3.sock every 8 connection(s)
I20260923 14:36:46.358155 30435 acceptor_pool.cc:254] collecting diagnostics on the listening RPC socket unix:/tmp/dist-test-taskyYIs_6/test-tmp/rpc-test-95545e13c061498ea88dbd099cede3b3.sock every 8 connection(s)
W20260923 14:36:46.373064 30174 serialization.cc:72] Serialized kudu.rpc_test.PushStringsRequestPB (2147483654 bytes) is larger than the maximum configured RPC message size (52428800 bytes). Sending anyway, but peer may reject the data.
W20260923 14:36:46.383353 30431 connection.cc:535] server connection from unix:<unnamed> recv error: Network error: RPC frame had a length of 2147483714, but we only support messages up to 52428800 bytes long.
W20260923 14:36:46.383716 30431 connection.cc:158] shutting down server connection from unix:<unnamed> with pending inbound data: 4/2147483714 bytes received; last active 0 ns ago: status Network error: RPC frame had a length of 2147483714, but we only support messages up to 52428800 bytes long.
W20260923 14:36:46.384622 30447 connection.cc:698] client connection to unix:/tmp/dist-test-taskyYIs_6/test-tmp/rpc-test-95545e13c061498ea88dbd099cede3b3.sock send error: Network error: failed to write to TLS socket: Broken pipe
W20260923 14:36:46.385103 30447 connection.cc:196] Error closing socket: Network error: TlsSocket::Close: Success
[ OK ] Parameters/TestRpc.TestRpcSidecarLimits/SSL_UnixSocket (17217 ms)
[ RUN ] Parameters/TestRpc.TestCallTimeoutDoesntAffectNegotiation/SSL_UnixSocket
I20260923 14:36:47.075251 30459 acceptor_pool.cc:254] collecting diagnostics on the listening RPC socket unix:/tmp/dist-test-taskyYIs_6/test-tmp/rpc-test-7d98451213a34ba99e99e581d56ba26d.sock every 8 connection(s)
I20260923 14:36:47.075917 30460 acceptor_pool.cc:254] collecting diagnostics on the listening RPC socket unix:/tmp/dist-test-taskyYIs_6/test-tmp/rpc-test-7d98451213a34ba99e99e581d56ba26d.sock every 8 connection(s)
W20260923 14:36:47.093258 30455 negotiation.cc:266] Injecting 500ms delay in negotiation
I20260923 14:36:47.143860 30174 rpc-test-base.h:595] status: Timed out: connection negotiation to unix:/tmp/dist-test-taskyYIs_6/test-tmp/rpc-test-7d98451213a34ba99e99e581d56ba26d.sock for RPC Sleep timed out after 0.050s (ON_OUTBOUND_QUEUE), seconds elapsed: 0.0514051
W20260923 14:36:47.604712 30456 connection.cc:196] Error closing socket: Network error: TlsSocket::Close: Broken pipe
[ OK ] Parameters/TestRpc.TestCallTimeoutDoesntAffectNegotiation/SSL_UnixSocket (548 ms)
[ RUN ] Parameters/TestRpc.TestRpcHandlerLatencyMetric/SSL_UnixSocket
I20260923 14:36:47.652172 30484 acceptor_pool.cc:254] collecting diagnostics on the listening RPC socket unix:/tmp/dist-test-taskyYIs_6/test-tmp/rpc-test-6663adf2e2d0403296facfd4ef2ac01a.sock every 8 connection(s)
I20260923 14:36:47.652848 30485 acceptor_pool.cc:254] collecting diagnostics on the listening RPC socket unix:/tmp/dist-test-taskyYIs_6/test-tmp/rpc-test-6663adf2e2d0403296facfd4ef2ac01a.sock every 8 connection(s)
I20260923 14:36:47.702904 30174 rpc-test.cc:1236] Sleep() min lat: 21429
I20260923 14:36:47.703073 30174 rpc-test.cc:1237] Sleep() mean lat: 21429
I20260923 14:36:47.703226 30174 rpc-test.cc:1238] Sleep() max lat: 21429
I20260923 14:36:47.703359 30174 rpc-test.cc:1239] Sleep() #calls: 1
[ OK ] Parameters/TestRpc.TestRpcHandlerLatencyMetric/SSL_UnixSocket (100 ms)
[ RUN ] Parameters/TestRpc.TimedOutOnResponseMetricServiceQueue/SSL_UnixSocket
I20260923 14:36:47.730727 30510 acceptor_pool.cc:254] collecting diagnostics on the listening RPC socket unix:/tmp/dist-test-taskyYIs_6/test-tmp/rpc-test-9c511638715a41e1a94dbf49a81012bc.sock every 8 connection(s)
I20260923 14:36:47.731431 30511 acceptor_pool.cc:254] collecting diagnostics on the listening RPC socket unix:/tmp/dist-test-taskyYIs_6/test-tmp/rpc-test-9c511638715a41e1a94dbf49a81012bc.sock every 8 connection(s)
W20260923 14:36:47.806689 30512 rpcz_store.cc:267] Call kudu.rpc_test.CalculatorService.Sleep from unix:<unnamed> (request call id 2) took 20 ms (client timeout 20 ms). Trace:
W20260923 14:36:47.806985 30512 rpcz_store.cc:269] 0923 14:36:47.786333 (+ 0us) service_pool.cc:170] Inserting onto call queue
0923 14:36:47.806569 (+ 20236us) service_pool.cc:214] Skipping call since client already timed out
0923 14:36:47.806644 (+ 75us) inbound_call.cc:173] Queueing failure response
Metrics: {}
[ OK ] Parameters/TestRpc.TimedOutOnResponseMetricServiceQueue/SSL_UnixSocket (103 ms)
[ RUN ] Parameters/TestRpc.RpcPendingConnectionsMetric/SSL_UnixSocket
I20260923 14:36:47.822206 30533 acceptor_pool.cc:254] collecting diagnostics on the listening RPC socket 0.0.0.0:40145 every 8 connection(s)
I20260923 14:36:47.822856 30534 acceptor_pool.cc:254] collecting diagnostics on the listening RPC socket 0.0.0.0:40145 every 8 connection(s)
W20260923 14:36:47.827323 30529 negotiation.cc:337] Failed RPC negotiation. Trace:
0923 14:36:47.826258 (+ 0us) reactor.cc:625] Submitting negotiation task for server connection from 127.0.0.1:47634 (local address 127.0.0.1:40145)
0923 14:36:47.826611 (+ 353us) server_negotiation.cc:206] Beginning negotiation
0923 14:36:47.826628 (+ 17us) server_negotiation.cc:399] Waiting for connection header
0923 14:36:47.826828 (+ 200us) negotiation.cc:327] Negotiation complete: Network error: Server connection negotiation failed: server connection from 127.0.0.1:47634: BlockingRecv error: recv got EOF from 127.0.0.1:47634 (error 108)
Metrics: {"server-negotiator.queue_time_us":80}
[ OK ] Parameters/TestRpc.RpcPendingConnectionsMetric/SSL_UnixSocket (26 ms)
[ RUN ] Parameters/TestRpc.TestRpcContextClientDeadline/SSL_UnixSocket
I20260923 14:36:47.858975 30549 acceptor_pool.cc:254] collecting diagnostics on the listening RPC socket unix:/tmp/dist-test-taskyYIs_6/test-tmp/rpc-test-33f2c9d15e6b4a5e8997716ae8f02bd2.sock every 8 connection(s)
I20260923 14:36:47.859625 30550 acceptor_pool.cc:254] collecting diagnostics on the listening RPC socket unix:/tmp/dist-test-taskyYIs_6/test-tmp/rpc-test-33f2c9d15e6b4a5e8997716ae8f02bd2.sock every 8 connection(s)
W20260923 14:36:47.909572 30546 connection.cc:196] Error closing socket: Network error: TlsSocket::Close: Broken pipe
[ OK ] Parameters/TestRpc.TestRpcContextClientDeadline/SSL_UnixSocket (73 ms)
[ RUN ] Parameters/TestRpc.TestApplicationFeatureFlagUnsupportedServer/SSL_UnixSocket
I20260923 14:36:47.931761 30574 acceptor_pool.cc:254] collecting diagnostics on the listening RPC socket unix:/tmp/dist-test-taskyYIs_6/test-tmp/rpc-test-dd356340f668450d9b8597e5389e417a.sock every 8 connection(s)
I20260923 14:36:47.932439 30575 acceptor_pool.cc:254] collecting diagnostics on the listening RPC socket unix:/tmp/dist-test-taskyYIs_6/test-tmp/rpc-test-dd356340f668450d9b8597e5389e417a.sock every 8 connection(s)
W20260923 14:36:47.981797 30571 connection.cc:196] Error closing socket: Network error: TlsSocket::Close: Broken pipe
[ OK ] Parameters/TestRpc.TestApplicationFeatureFlagUnsupportedServer/SSL_UnixSocket (72 ms)
[ RUN ] Parameters/TestRpc.TestCancellationAsync/SSL_UnixSocket
I20260923 14:36:48.002468 30599 acceptor_pool.cc:254] collecting diagnostics on the listening RPC socket unix:/tmp/dist-test-taskyYIs_6/test-tmp/rpc-test-3465e50e4e79491d81b080bd488fbd96.sock every 8 connection(s)
I20260923 14:36:48.003113 30600 acceptor_pool.cc:254] collecting diagnostics on the listening RPC socket unix:/tmp/dist-test-taskyYIs_6/test-tmp/rpc-test-3465e50e4e79491d81b080bd488fbd96.sock every 8 connection(s)
I20260923 14:36:48.006038 30174 rpc-test.cc:1716] Connecting to unix:/tmp/dist-test-taskyYIs_6/test-tmp/rpc-test-3465e50e4e79491d81b080bd488fbd96.sock
I20260923 14:36:48.034565 30174 test_util.cc:268] Using random seed: 1774290674
I20260923 14:36:48.253901 30603 rpc-test-base.h:240] got call: sleep_micros: 500 pattern: 4294967295 num_repetitions: 2097152 sidecar_idx: 0
I20260923 14:36:48.435703 30602 rpc-test-base.h:240] got call: sleep_micros: 500 pattern: 4294967295 num_repetitions: 2097152 sidecar_idx: 0
I20260923 14:36:48.649348 30602 rpc-test-base.h:240] got call: sleep_micros: 500 pattern: 4294967295 num_repetitions: 2097152 sidecar_idx: 0
I20260923 14:36:48.822978 30603 rpc-test-base.h:240] got call: sleep_micros: 500 pattern: 4294967295 num_repetitions: 2097152 sidecar_idx: 0
I20260923 14:36:49.029153 30602 rpc-test-base.h:240] got call: sleep_micros: 500 pattern: 4294967295 num_repetitions: 2097152 sidecar_idx: 0
I20260923 14:36:49.227787 30602 rpc-test-base.h:240] got call: sleep_micros: 500 pattern: 4294967295 num_repetitions: 2097152 sidecar_idx: 0
I20260923 14:36:49.408620 30603 rpc-test-base.h:240] got call: sleep_micros: 500 pattern: 4294967295 num_repetitions: 2097152 sidecar_idx: 0
I20260923 14:36:49.642504 30603 rpc-test-base.h:240] got call: sleep_micros: 500 pattern: 4294967295 num_repetitions: 2097152 sidecar_idx: 0
W20260923 14:36:49.713634 30612 outbound_call.cc:322] RPC callback for RPC call kudu.rpc.GenericCalculatorService.SleepWithSidecar -> {remote=unix:/tmp/dist-test-taskyYIs_6/test-tmp/rpc-test-3465e50e4e79491d81b080bd488fbd96.sock, user_credentials={real_user=slave}} blocked reactor thread for 73255.5us
I20260923 14:36:49.902760 30602 rpc-test-base.h:240] got call: sleep_micros: 500 pattern: 4294967295 num_repetitions: 2097152 sidecar_idx: 0
W20260923 14:36:49.925988 30596 connection.cc:196] Error closing socket: Network error: TlsSocket::Close: Broken pipe
W20260923 14:36:50.046160 30596 connection.cc:441] server connection from unix:<unnamed> torn down before Call kudu.rpc.GenericCalculatorService.SleepWithSidecar from unix:<unnamed> (request call id 9) could send its response
[ OK ] Parameters/TestRpc.TestCancellationAsync/SSL_UnixSocket (2070 ms)
[ RUN ] Parameters/TestRpc.TestPerformanceBySocketType/SSL_UnixSocket
I20260923 14:36:50.135677 30625 acceptor_pool.cc:254] collecting diagnostics on the listening RPC socket unix:/tmp/dist-test-taskyYIs_6/test-tmp/rpc-test-941f739dc93e494ab90b9347efd54c40.sock every 8 connection(s)
I20260923 14:36:50.136466 30626 acceptor_pool.cc:254] collecting diagnostics on the listening RPC socket unix:/tmp/dist-test-taskyYIs_6/test-tmp/rpc-test-941f739dc93e494ab90b9347efd54c40.sock every 8 connection(s)
I20260923 14:36:50.139374 30174 rpc-test.cc:1846] Connecting to unix:/tmp/dist-test-taskyYIs_6/test-tmp/rpc-test-941f739dc93e494ab90b9347efd54c40.sock
I20260923 14:37:10.378813 30174 rpc-test.cc:1859] Sending 1024MB via ssl-enabled unix socket: real 20.228s user 18.383s sys 11.822s
I20260923 14:37:30.214272 30174 rpc-test.cc:1859] Sending 1024MB via ssl-enabled unix socket: real 19.835s user 17.578s sys 11.758s
I20260923 14:37:50.176991 30174 rpc-test.cc:1859] Sending 1024MB via ssl-enabled unix socket: real 19.962s user 17.880s sys 11.754s
I20260923 14:38:09.911432 30174 rpc-test.cc:1859] Sending 1024MB via ssl-enabled unix socket: real 19.734s user 17.343s sys 11.826s
I20260923 14:38:29.739789 30174 rpc-test.cc:1859] Sending 1024MB via ssl-enabled unix socket: real 19.828s user 17.660s sys 11.728s
W20260923 14:38:29.744239 30622 connection.cc:196] Error closing socket: Network error: TlsSocket::Close: Broken pipe
[ OK ] Parameters/TestRpc.TestPerformanceBySocketType/SSL_UnixSocket (99698 ms)
[----------] 20 tests from Parameters/TestRpc (250605 ms total)
[----------] 1 test from Parameters/TestRpcSocketTxRxQueue
[ RUN ] Parameters/TestRpcSocketTxRxQueue.AcceptorRxQueueSizeMetric/0
I20260923 14:38:29.769649 30660 acceptor_pool.cc:254] collecting diagnostics on the listening RPC socket 0.0.0.0:34989 every 1 connection(s)
I20260923 14:38:29.770336 30661 acceptor_pool.cc:254] collecting diagnostics on the listening RPC socket 0.0.0.0:34989 every 1 connection(s)
W20260923 14:38:29.775588 30656 negotiation.cc:337] Failed RPC negotiation. Trace:
0923 14:38:29.774061 (+ 0us) reactor.cc:625] Submitting negotiation task for server connection from 127.0.0.1:52082 (local address 127.0.0.1:34989)
0923 14:38:29.774517 (+ 456us) server_negotiation.cc:206] Beginning negotiation
0923 14:38:29.774539 (+ 22us) server_negotiation.cc:399] Waiting for connection header
0923 14:38:29.774789 (+ 250us) negotiation.cc:327] Negotiation complete: Network error: Server connection negotiation failed: server connection from 127.0.0.1:52082: BlockingRecv error: recv got EOF from 127.0.0.1:52082 (error 108)
Metrics: {"server-negotiator.queue_time_us":105}
[ OK ] Parameters/TestRpcSocketTxRxQueue.AcceptorRxQueueSizeMetric/0 (27 ms)
[----------] 1 test from Parameters/TestRpcSocketTxRxQueue (27 ms total)
[----------] Global test environment tear-down
[==========] 21 tests from 2 test suites ran. (250633 ms total)
[ PASSED ] 20 tests.
[ FAILED ] 1 test, listed below:
[ FAILED ] Parameters/TestRpc.TestCallWithChainCertAndChainCA/SSL_UnixSocket, where GetParam() = (true, true)
1 FAILED TEST