Diagnosed failure

Parameters/TestRpc.TestCallWithChainCertAndChainCA/SSL_TCP: /data0/somelongdirectorytoavoidrpathissues/src/kudu/src/kudu/rpc/rpc-test.cc:270: Failure
Failed
Bad status: Runtime error: could not verify certificate chain (error with cert: subject=CN = localhost, ST = sadfjas, C = AS, emailAddress = sdflkdsajf, O = lskdfjlsad, OU = sldfkja, issuer=C = AS, ST = ASDfkjdhf, L = lskdjf, O = saldfja, OU = skdjf, CN = localhost, emailAddress = sadjflkadsj): : certificate has expired
Google Test trace:
/data0/somelongdirectorytoavoidrpathissues/src/kudu/src/kudu/rpc/rpc-test.cc:267: Connecting to 0.0.0.0:45605
I20260928 14:53:34.691020  4129 test_util.cc:175] -----------------------------------------------
I20260928 14:53:34.691071  4129 test_util.cc:176] Had fatal failures, leaving test files at /tmp/dist-test-taskRR0THw/test-tmp/rpc-test.5.Parameters_TestRpc.TestCallWithChainCertAndChainCA_SSL_TCP.1790607214633366-4129-0

Full log

Note: This is test shard 6 of 8.
[==========] Running 21 tests from 2 test suites.
[----------] Global test environment set-up.
[----------] 20 tests from Parameters/TestRpc
[ RUN      ] Parameters/TestRpc.TestMessengerCreateDestroy/SSL_TCP
WARNING: Logging before InitGoogleLogging() is written to STDERR
I20260928 14:53:34.649241  4129 rpc-test.cc:169] started messenger TestCreateDestroy
[       OK ] Parameters/TestRpc.TestMessengerCreateDestroy/SSL_TCP (14 ms)
[ RUN      ] Parameters/TestRpc.TestNegotiationDeadlock/SSL_TCP
I20260928 14:53:34.666260  4149 acceptor_pool.cc:254] collecting diagnostics on the listening RPC socket 0.0.0.0:40699 every 8 connection(s)
I20260928 14:53:34.666260  4150 acceptor_pool.cc:254] collecting diagnostics on the listening RPC socket 0.0.0.0:40699 every 8 connection(s)
[       OK ] Parameters/TestRpc.TestNegotiationDeadlock/SSL_TCP (23 ms)
[ RUN      ] Parameters/TestRpc.TestCallWithChainCertAndChainCA/SSL_TCP
I20260928 14:53:34.687224  4165 acceptor_pool.cc:254] collecting diagnostics on the listening RPC socket 0.0.0.0:45605 every 8 connection(s)
I20260928 14:53:34.687224  4166 acceptor_pool.cc:254] collecting diagnostics on the listening RPC socket 0.0.0.0:45605 every 8 connection(s)
/data0/somelongdirectorytoavoidrpathissues/src/kudu/src/kudu/rpc/rpc-test.cc:270: Failure
Failed
Bad status: Runtime error: could not verify certificate chain (error with cert: subject=CN = localhost, ST = sadfjas, C = AS, emailAddress = sdflkdsajf, O = lskdfjlsad, OU = sldfkja, issuer=C = AS, ST = ASDfkjdhf, L = lskdjf, O = saldfja, OU = skdjf, CN = localhost, emailAddress = sadjflkadsj): : certificate has expired
Google Test trace:
/data0/somelongdirectorytoavoidrpathissues/src/kudu/src/kudu/rpc/rpc-test.cc:267: Connecting to 0.0.0.0:45605
I20260928 14:53:34.691020  4129 test_util.cc:175] -----------------------------------------------
I20260928 14:53:34.691071  4129 test_util.cc:176] Had fatal failures, leaving test files at /tmp/dist-test-taskRR0THw/test-tmp/rpc-test.5.Parameters_TestRpc.TestCallWithChainCertAndChainCA_SSL_TCP.1790607214633366-4129-0
[  FAILED  ] Parameters/TestRpc.TestCallWithChainCertAndChainCA/SSL_TCP, where GetParam() = (true, false) (17 ms)
[ RUN      ] Parameters/TestRpc.TestCallWithPasswordProtectedKey/SSL_TCP
I20260928 14:53:34.709414  4191 acceptor_pool.cc:254] collecting diagnostics on the listening RPC socket 0.0.0.0:42525 every 8 connection(s)
I20260928 14:53:34.709414  4192 acceptor_pool.cc:254] collecting diagnostics on the listening RPC socket 0.0.0.0:42525 every 8 connection(s)
[       OK ] Parameters/TestRpc.TestCallWithPasswordProtectedKey/SSL_TCP (32 ms)
[ RUN      ] Parameters/TestRpc.TestCallToBadServer/SSL_TCP
I20260928 14:53:34.732766  4129 rpc-test.cc:394] Status: Network error: Client connection negotiation failed: client connection to 0.0.0.0:0: connect: Connection refused (error 111)
I20260928 14:53:34.733063  4129 rpc-test.cc:394] Status: Network error: Client connection negotiation failed: client connection to 0.0.0.0:0: connect: Connection refused (error 111)
I20260928 14:53:34.733282  4129 rpc-test.cc:394] Status: Network error: Client connection negotiation failed: client connection to 0.0.0.0:0: connect: Connection refused (error 111)
I20260928 14:53:34.733474  4129 rpc-test.cc:394] Status: Network error: Client connection negotiation failed: client connection to 0.0.0.0:0: connect: Connection refused (error 111)
I20260928 14:53:34.733661  4129 rpc-test.cc:394] Status: Network error: Client connection negotiation failed: client connection to 0.0.0.0:0: connect: Connection refused (error 111)
[       OK ] Parameters/TestRpc.TestCallToBadServer/SSL_TCP (10 ms)
[ RUN      ] Parameters/TestRpc.TestWrongService/SSL_TCP
I20260928 14:53:34.745318  4226 acceptor_pool.cc:254] collecting diagnostics on the listening RPC socket 0.0.0.0:41127 every 8 connection(s)
I20260928 14:53:34.745365  4227 acceptor_pool.cc:254] collecting diagnostics on the listening RPC socket 0.0.0.0:41127 every 8 connection(s)
I20260928 14:53:34.764005  4224 messenger.cc:345] service WrongServiceName not registered on TestServer
[       OK ] Parameters/TestRpc.TestWrongService/SSL_TCP (31 ms)
[ RUN      ] Parameters/TestRpc.TestConnectionKeepalive/SSL_TCP
I20260928 14:53:34.789785  4249 acceptor_pool.cc:254] collecting diagnostics on the listening RPC socket 0.0.0.0:46599 every 8 connection(s)
I20260928 14:53:34.789829  4250 acceptor_pool.cc:254] collecting diagnostics on the listening RPC socket 0.0.0.0:46599 every 8 connection(s)
I20260928 14:53:34.790104  4129 rpc-test.cc:488] Connecting to 0.0.0.0:46599
[       OK ] Parameters/TestRpc.TestConnectionKeepalive/SSL_TCP (1044 ms)
[ RUN      ] Parameters/TestRpc.TestClientConnectionMetrics/SSL_TCP
I20260928 14:53:35.819347  4275 acceptor_pool.cc:254] collecting diagnostics on the listening RPC socket 0.0.0.0:38459 every 8 connection(s)
I20260928 14:53:35.819389  4276 acceptor_pool.cc:254] collecting diagnostics on the listening RPC socket 0.0.0.0:38459 every 8 connection(s)
I20260928 14:53:35.819521  4129 rpc-test.cc:569] Connecting to 0.0.0.0:38459
[       OK ] Parameters/TestRpc.TestClientConnectionMetrics/SSL_TCP (8260 ms)
[ RUN      ] Parameters/TestRpc.TestCredentialsPolicy/SSL_TCP
I20260928 14:53:44.105276  4298 acceptor_pool.cc:254] collecting diagnostics on the listening RPC socket 0.0.0.0:35515 every 8 connection(s)
I20260928 14:53:44.105315  4299 acceptor_pool.cc:254] collecting diagnostics on the listening RPC socket 0.0.0.0:35515 every 8 connection(s)
I20260928 14:53:44.105474  4129 rpc-test.cc:700] Connecting to 0.0.0.0:35515
[       OK ] Parameters/TestRpc.TestCredentialsPolicy/SSL_TCP (61 ms)
[ RUN      ] Parameters/TestRpc.TestCallLongerThanKeepalive/SSL_TCP
I20260928 14:53:44.144606  4323 acceptor_pool.cc:254] collecting diagnostics on the listening RPC socket 0.0.0.0:37457 every 8 connection(s)
I20260928 14:53:44.144654  4324 acceptor_pool.cc:254] collecting diagnostics on the listening RPC socket 0.0.0.0:37457 every 8 connection(s)
I20260928 14:53:44.151208  4327 rpc-test-base.h:222] got call: sleep_micros: 3000000 deferred: true
I20260928 14:53:47.151927  4327 rpcz_store.cc:275] Call kudu.rpc.GenericCalculatorService.Sleep from 127.0.0.1:38968 (request call id 0) took 3000 ms. Trace:
I20260928 14:53:47.152030  4327 rpcz_store.cc:276] 0928 14:53:44.151157 (+     0us) service_pool.cc:170] Inserting onto call queue
0928 14:53:44.151189 (+    32us) service_pool.cc:227] Handling call
0928 14:53:47.151910 (+3000721us) inbound_call.cc:173] Queueing success response
Metrics: {}
[       OK ] Parameters/TestRpc.TestCallLongerThanKeepalive/SSL_TCP (3021 ms)
[ RUN      ] Parameters/TestRpc.TestRpcSidecar/SSL_TCP
I20260928 14:53:47.174940  4349 acceptor_pool.cc:254] collecting diagnostics on the listening RPC socket 0.0.0.0:34147 every 8 connection(s)
I20260928 14:53:47.174978  4350 acceptor_pool.cc:254] collecting diagnostics on the listening RPC socket 0.0.0.0:34147 every 8 connection(s)
[       OK ] Parameters/TestRpc.TestRpcSidecar/SSL_TCP (67 ms)
[ RUN      ] Parameters/TestRpc.TestRpcSidecarLimits/SSL_TCP
I20260928 14:53:48.879858  4374 acceptor_pool.cc:254] collecting diagnostics on the listening RPC socket 0.0.0.0:42033 every 8 connection(s)
I20260928 14:53:48.879884  4375 acceptor_pool.cc:254] collecting diagnostics on the listening RPC socket 0.0.0.0:42033 every 8 connection(s)
W20260928 14:53:48.903388  4129 serialization.cc:72] Serialized kudu.rpc_test.PushStringsRequestPB (2147483654 bytes) is larger than the maximum configured RPC message size (52428800 bytes). Sending anyway, but peer may reject the data.
W20260928 14:53:48.906549  4372 connection.cc:535] server connection from 127.0.0.1:46070 recv error: Network error: RPC frame had a length of 2147483714, but we only support messages up to 52428800 bytes long.
W20260928 14:53:48.906648  4372 connection.cc:158] shutting down server connection from 127.0.0.1:46070 with pending inbound data: 4/2147483714 bytes received; last active 0 ns ago: status Network error: RPC frame had a length of 2147483714, but we only support messages up to 52428800 bytes long.
W20260928 14:53:48.906944  4387 connection.cc:196] Error closing socket: Network error: TlsSocket::Close: Connection reset by peer
I20260928 14:53:48.928251  4401 acceptor_pool.cc:254] collecting diagnostics on the listening RPC socket 0.0.0.0:42895 every 8 connection(s)
I20260928 14:53:48.928216  4399 acceptor_pool.cc:254] collecting diagnostics on the listening RPC socket 0.0.0.0:42895 every 8 connection(s)
W20260928 14:53:53.283103  4396 connection.cc:577] server connection from 127.0.0.1:49478: received bad data: 'Corruption: Invalid packet: message had a length of 2147483710, but we only support messages up to 2147483647 bytes
'
[       OK ] Parameters/TestRpc.TestRpcSidecarLimits/SSL_TCP (6063 ms)
[ RUN      ] Parameters/TestRpc.TestCallTimeoutDoesntAffectNegotiation/SSL_TCP
I20260928 14:53:53.290740  4425 acceptor_pool.cc:254] collecting diagnostics on the listening RPC socket 0.0.0.0:33905 every 8 connection(s)
I20260928 14:53:53.290786  4426 acceptor_pool.cc:254] collecting diagnostics on the listening RPC socket 0.0.0.0:33905 every 8 connection(s)
W20260928 14:53:53.309706  4419 negotiation.cc:266] Injecting 500ms delay in negotiation
I20260928 14:53:53.360011  4129 rpc-test-base.h:595] status: Timed out: connection negotiation to 0.0.0.0:33905 for RPC Sleep timed out after 0.050s (ON_OUTBOUND_QUEUE), seconds elapsed: 0.0505638
[       OK ] Parameters/TestRpc.TestCallTimeoutDoesntAffectNegotiation/SSL_TCP (529 ms)
[ RUN      ] Parameters/TestRpc.TestRpcHandlerLatencyMetric/SSL_TCP
I20260928 14:53:53.823576  4450 acceptor_pool.cc:254] collecting diagnostics on the listening RPC socket 0.0.0.0:46535 every 8 connection(s)
I20260928 14:53:53.823669  4451 acceptor_pool.cc:254] collecting diagnostics on the listening RPC socket 0.0.0.0:46535 every 8 connection(s)
I20260928 14:53:53.863408  4129 rpc-test.cc:1236] Sleep() min lat: 20282
I20260928 14:53:53.863476  4129 rpc-test.cc:1237] Sleep() mean lat: 20282
I20260928 14:53:53.863502  4129 rpc-test.cc:1238] Sleep() max lat: 20282
I20260928 14:53:53.863515  4129 rpc-test.cc:1239] Sleep() #calls: 1
[       OK ] Parameters/TestRpc.TestRpcHandlerLatencyMetric/SSL_TCP (50 ms)
[ RUN      ] Parameters/TestRpc.TimedOutOnResponseMetricServiceQueue/SSL_TCP
I20260928 14:53:53.900173  4476 acceptor_pool.cc:254] collecting diagnostics on the listening RPC socket 0.0.0.0:37703 every 8 connection(s)
I20260928 14:53:53.900218  4477 acceptor_pool.cc:254] collecting diagnostics on the listening RPC socket 0.0.0.0:37703 every 8 connection(s)
W20260928 14:53:53.953588  4478 rpcz_store.cc:267] Call kudu.rpc_test.CalculatorService.Sleep from 127.0.0.1:49830 (request call id 2) took 20 ms (client timeout 20 ms). Trace:
W20260928 14:53:53.953708  4478 rpcz_store.cc:269] 0928 14:53:53.933332 (+     0us) service_pool.cc:170] Inserting onto call queue
0928 14:53:53.953563 (+ 20231us) service_pool.cc:214] Skipping call since client already timed out
0928 14:53:53.953572 (+     9us) inbound_call.cc:173] Queueing failure response
Metrics: {}
[       OK ] Parameters/TestRpc.TimedOutOnResponseMetricServiceQueue/SSL_TCP (89 ms)
[ RUN      ] Parameters/TestRpc.RpcPendingConnectionsMetric/SSL_TCP
I20260928 14:53:53.956836  4499 acceptor_pool.cc:254] collecting diagnostics on the listening RPC socket 0.0.0.0:43065 every 8 connection(s)
I20260928 14:53:53.956918  4500 acceptor_pool.cc:254] collecting diagnostics on the listening RPC socket 0.0.0.0:43065 every 8 connection(s)
W20260928 14:53:53.957439  4495 negotiation.cc:337] Failed RPC negotiation. Trace:
0928 14:53:53.957294 (+     0us) reactor.cc:625] Submitting negotiation task for server connection from 127.0.0.1:50782 (local address 127.0.0.1:43065)
0928 14:53:53.957330 (+    36us) server_negotiation.cc:206] Beginning negotiation
0928 14:53:53.957332 (+     2us) server_negotiation.cc:399] Waiting for connection header
0928 14:53:53.957392 (+    60us) negotiation.cc:327] Negotiation complete: Network error: Server connection negotiation failed: server connection from 127.0.0.1:50782: BlockingRecv error: recv got EOF from 127.0.0.1:50782 (error 108)
Metrics: {"server-negotiator.queue_time_us":12}
[       OK ] Parameters/TestRpc.RpcPendingConnectionsMetric/SSL_TCP (13 ms)
[ RUN      ] Parameters/TestRpc.TestRpcContextClientDeadline/SSL_TCP
I20260928 14:53:53.987241  4515 acceptor_pool.cc:254] collecting diagnostics on the listening RPC socket 0.0.0.0:36147 every 8 connection(s)
I20260928 14:53:53.987268  4516 acceptor_pool.cc:254] collecting diagnostics on the listening RPC socket 0.0.0.0:36147 every 8 connection(s)
[       OK ] Parameters/TestRpc.TestRpcContextClientDeadline/SSL_TCP (58 ms)
[ RUN      ] Parameters/TestRpc.TestApplicationFeatureFlagUnsupportedServer/SSL_TCP
I20260928 14:53:54.039407  4540 acceptor_pool.cc:254] collecting diagnostics on the listening RPC socket 0.0.0.0:37725 every 8 connection(s)
I20260928 14:53:54.039424  4541 acceptor_pool.cc:254] collecting diagnostics on the listening RPC socket 0.0.0.0:37725 every 8 connection(s)
[       OK ] Parameters/TestRpc.TestApplicationFeatureFlagUnsupportedServer/SSL_TCP (23 ms)
[ RUN      ] Parameters/TestRpc.TestCancellationAsync/SSL_TCP
I20260928 14:53:54.057209  4566 acceptor_pool.cc:254] collecting diagnostics on the listening RPC socket 0.0.0.0:44887 every 8 connection(s)
I20260928 14:53:54.057262  4567 acceptor_pool.cc:254] collecting diagnostics on the listening RPC socket 0.0.0.0:44887 every 8 connection(s)
I20260928 14:53:54.057399  4129 rpc-test.cc:1716] Connecting to 0.0.0.0:44887
I20260928 14:53:54.062770  4129 test_util.cc:268] Using random seed: 1008622001
I20260928 14:53:54.078260  4570 rpc-test-base.h:240] got call: sleep_micros: 500 pattern: 4294967295 num_repetitions: 2097152 sidecar_idx: 0
I20260928 14:53:54.089906  4570 rpc-test-base.h:240] got call: sleep_micros: 500 pattern: 4294967295 num_repetitions: 2097152 sidecar_idx: 0
I20260928 14:53:54.101519  4570 rpc-test-base.h:240] got call: sleep_micros: 500 pattern: 4294967295 num_repetitions: 2097152 sidecar_idx: 0
I20260928 14:53:54.114382  4570 rpc-test-base.h:240] got call: sleep_micros: 500 pattern: 4294967295 num_repetitions: 2097152 sidecar_idx: 0
I20260928 14:53:54.127619  4570 rpc-test-base.h:240] got call: sleep_micros: 500 pattern: 4294967295 num_repetitions: 2097152 sidecar_idx: 0
I20260928 14:53:54.140190  4570 rpc-test-base.h:240] got call: sleep_micros: 500 pattern: 4294967295 num_repetitions: 2097152 sidecar_idx: 0
I20260928 14:53:54.152661  4570 rpc-test-base.h:240] got call: sleep_micros: 500 pattern: 4294967295 num_repetitions: 2097152 sidecar_idx: 0
I20260928 14:53:54.165601  4570 rpc-test-base.h:240] got call: sleep_micros: 500 pattern: 4294967295 num_repetitions: 2097152 sidecar_idx: 0
W20260928 14:53:54.168681  4565 connection.cc:441] server connection from 127.0.0.1:53936 torn down before Call kudu.rpc.GenericCalculatorService.SleepWithSidecar from 127.0.0.1:53936 (request call id 9) could send its response
[       OK ] Parameters/TestRpc.TestCancellationAsync/SSL_TCP (118 ms)
[ RUN      ] Parameters/TestRpc.TestPerformanceBySocketType/SSL_TCP
I20260928 14:53:54.197459  4591 acceptor_pool.cc:254] collecting diagnostics on the listening RPC socket 0.0.0.0:46287 every 8 connection(s)
I20260928 14:53:54.197489  4592 acceptor_pool.cc:254] collecting diagnostics on the listening RPC socket 0.0.0.0:46287 every 8 connection(s)
I20260928 14:53:54.197672  4129 rpc-test.cc:1846] Connecting to 0.0.0.0:46287
I20260928 14:53:55.787897  4129 rpc-test.cc:1859] Sending 1024MB via ssl-enabled tcp socket: real 1.572s	user 1.371s	sys 1.445s
I20260928 14:53:57.359150  4129 rpc-test.cc:1859] Sending 1024MB via ssl-enabled tcp socket: real 1.571s	user 1.453s	sys 1.379s
I20260928 14:53:58.958614  4129 rpc-test.cc:1859] Sending 1024MB via ssl-enabled tcp socket: real 1.599s	user 1.477s	sys 1.396s
I20260928 14:54:00.491837  4129 rpc-test.cc:1859] Sending 1024MB via ssl-enabled tcp socket: real 1.533s	user 1.282s	sys 1.465s
I20260928 14:54:02.024154  4129 rpc-test.cc:1859] Sending 1024MB via ssl-enabled tcp socket: real 1.532s	user 1.376s	sys 1.380s
[       OK ] Parameters/TestRpc.TestPerformanceBySocketType/SSL_TCP (7857 ms)
[----------] 20 tests from Parameters/TestRpc (27391 ms total)

[----------] 1 test from Parameters/TestRpcSocketTxRxQueue
[ RUN      ] Parameters/TestRpcSocketTxRxQueue.OverCapacity/0
W20260928 14:54:02.298725  4635 negotiation.cc:337] Failed RPC negotiation. Trace:
0928 14:54:02.037742 (+     0us) reactor.cc:625] Submitting negotiation task for client connection to 0.0.0.0:35791 (local address 127.0.0.1:55362)
0928 14:54:02.037783 (+    41us) negotiation.cc:107] Waiting for socket to connect
0928 14:54:02.037792 (+     9us) client_negotiation.cc:174] Beginning negotiation
0928 14:54:02.037837 (+    45us) client_negotiation.cc:252] Sending NEGOTIATE NegotiatePB request
0928 14:54:02.298485 (+260648us) negotiation.cc:327] Negotiation complete: Network error: Client connection negotiation failed: client connection to 0.0.0.0:35791: BlockingRecv error: recv error from unknown peer: Transport endpoint is not connected (error 107)
Metrics: {"client-negotiator.queue_time_us":17}
W20260928 14:54:02.298728  4644 negotiation.cc:337] Failed RPC negotiation. Trace:
0928 14:54:02.038696 (+     0us) reactor.cc:625] Submitting negotiation task for client connection to 0.0.0.0:35791 (local address 127.0.0.1:55364)
0928 14:54:02.038736 (+    40us) negotiation.cc:107] Waiting for socket to connect
0928 14:54:02.038744 (+     8us) client_negotiation.cc:174] Beginning negotiation
0928 14:54:02.038779 (+    35us) client_negotiation.cc:252] Sending NEGOTIATE NegotiatePB request
0928 14:54:02.298575 (+259796us) negotiation.cc:327] Negotiation complete: Network error: Client connection negotiation failed: client connection to 0.0.0.0:35791: BlockingRecv error: recv error from unknown peer: Transport endpoint is not connected (error 107)
Metrics: {"client-negotiator.queue_time_us":16}
W20260928 14:54:02.298938  4626 negotiation.cc:337] Failed RPC negotiation. Trace:
0928 14:54:02.036893 (+     0us) reactor.cc:625] Submitting negotiation task for client connection to 0.0.0.0:35791 (local address 127.0.0.1:55360)
0928 14:54:02.036944 (+    51us) negotiation.cc:107] Waiting for socket to connect
0928 14:54:02.036952 (+     8us) client_negotiation.cc:174] Beginning negotiation
0928 14:54:02.036989 (+    37us) client_negotiation.cc:252] Sending NEGOTIATE NegotiatePB request
0928 14:54:02.298485 (+261496us) negotiation.cc:327] Negotiation complete: Network error: Client connection negotiation failed: client connection to 0.0.0.0:35791: BlockingRecv error: recv error from unknown peer: Transport endpoint is not connected (error 107)
Metrics: {"client-negotiator.queue_time_us":28}
W20260928 14:54:02.298728  4653 negotiation.cc:337] Failed RPC negotiation. Trace:
0928 14:54:02.039525 (+     0us) reactor.cc:625] Submitting negotiation task for client connection to 0.0.0.0:35791 (local address 127.0.0.1:55374)
0928 14:54:02.039573 (+    48us) negotiation.cc:107] Waiting for socket to connect
0928 14:54:02.039582 (+     9us) client_negotiation.cc:174] Beginning negotiation
0928 14:54:02.039620 (+    38us) client_negotiation.cc:252] Sending NEGOTIATE NegotiatePB request
0928 14:54:02.298652 (+259032us) negotiation.cc:327] Negotiation complete: Network error: Client connection negotiation failed: client connection to 0.0.0.0:35791: BlockingRecv error: recv error from unknown peer: Transport endpoint is not connected (error 107)
Metrics: {"client-negotiator.queue_time_us":29}
W20260928 14:54:02.299095  4608 negotiation.cc:337] Failed RPC negotiation. Trace:
0928 14:54:02.035161 (+     0us) reactor.cc:625] Submitting negotiation task for client connection to 0.0.0.0:35791 (local address 127.0.0.1:55350)
0928 14:54:02.035200 (+    39us) negotiation.cc:107] Waiting for socket to connect
0928 14:54:02.035209 (+     9us) client_negotiation.cc:174] Beginning negotiation
0928 14:54:02.035259 (+    50us) client_negotiation.cc:252] Sending NEGOTIATE NegotiatePB request
0928 14:54:02.298500 (+263241us) negotiation.cc:327] Negotiation complete: Network error: Client connection negotiation failed: client connection to 0.0.0.0:35791: BlockingRecv error: recv error from unknown peer: Transport endpoint is not connected (error 107)
Metrics: {"client-negotiator.queue_time_us":16}
W20260928 14:54:02.299101  4617 negotiation.cc:337] Failed RPC negotiation. Trace:
0928 14:54:02.036052 (+     0us) reactor.cc:625] Submitting negotiation task for client connection to 0.0.0.0:35791 (local address 127.0.0.1:55356)
0928 14:54:02.036088 (+    36us) negotiation.cc:107] Waiting for socket to connect
0928 14:54:02.036096 (+     8us) client_negotiation.cc:174] Beginning negotiation
0928 14:54:02.036132 (+    36us) client_negotiation.cc:252] Sending NEGOTIATE NegotiatePB request
0928 14:54:02.298501 (+262369us) negotiation.cc:327] Negotiation complete: Network error: Client connection negotiation failed: client connection to 0.0.0.0:35791: BlockingRecv error: recv error from unknown peer: Transport endpoint is not connected (error 107)
Metrics: {"client-negotiator.queue_time_us":17}
[       OK ] Parameters/TestRpcSocketTxRxQueue.OverCapacity/0 (1047 ms)
[----------] 1 test from Parameters/TestRpcSocketTxRxQueue (1047 ms total)

[----------] Global test environment tear-down
[==========] 21 tests from 2 test suites ran. (28438 ms total)
[  PASSED  ] 20 tests.
[  FAILED  ] 1 test, listed below:
[  FAILED  ] Parameters/TestRpc.TestCallWithChainCertAndChainCA/SSL_TCP, where GetParam() = (true, false)

 1 FAILED TEST