Diagnosed failure

Parameters/TestRpc.TestCallWithChainCertAndRootCA/SSL_UnixSocket: /data0/somelongdirectorytoavoidrpathissues/src/kudu/src/kudu/rpc/rpc-test.cc:303: Failure
Failed
Bad status: Runtime error: could not verify certificate chain (error with cert: subject=CN = localhost, ST = sadfjas, C = AS, emailAddress = sdflkdsajf, O = lskdfjlsad, OU = sldfkja, issuer=C = AS, ST = ASDfkjdhf, L = lskdjf, O = saldfja, OU = skdjf, CN = localhost, emailAddress = sadjflkadsj): : certificate has expired
Google Test trace:
/data0/somelongdirectorytoavoidrpathissues/src/kudu/src/kudu/rpc/rpc-test.cc:300: Connecting to unix:/tmp/dist-test-taskLX42L2/test-tmp/rpc-test-c1a899e57a7e4452858eb2a81936d264.sock
I20260925 06:28:43.289176   390 test_util.cc:175] -----------------------------------------------
I20260925 06:28:43.289347   390 test_util.cc:176] Had fatal failures, leaving test files at /tmp/dist-test-taskLX42L2/test-tmp/rpc-test.2.Parameters_TestRpc.TestCallWithChainCertAndRootCA_SSL_UnixSocket.1790317719710426-390-0

Full log

Note: This is test shard 3 of 8.
[==========] Running 21 tests from 2 test suites.
[----------] Global test environment set-up.
[----------] 1 test from TestRpc
[ RUN      ] TestRpc.TestNegotiationTimeout
WARNING: Logging before InitGoogleLogging() is written to STDERR
I20260925 06:28:39.901504   390 rpc-test-base.h:595] status: Timed out: connection negotiation to 0.0.0.0:35239 for RPC Sleep timed out after 0.100s (ON_OUTBOUND_QUEUE), seconds elapsed: 0.101563
W20260925 06:28:42.971613   400 negotiation.cc:337] Failed RPC negotiation. Trace:
0925 06:28:39.800807 (+     0us) reactor.cc:625] Submitting negotiation task for client connection to 0.0.0.0:35239 (local address 127.0.0.1:35062)
0925 06:28:39.801474 (+   667us) negotiation.cc:107] Waiting for socket to connect
0925 06:28:39.801520 (+    46us) client_negotiation.cc:174] Beginning negotiation
0925 06:28:39.813835 (+ 12315us) client_negotiation.cc:252] Sending NEGOTIATE NegotiatePB request
0925 06:28:42.970464 (+3156629us) negotiation.cc:327] Negotiation complete: Timed out: Client connection negotiation failed: client connection to 0.0.0.0:35239: received 0 of 4 requested bytes
Metrics: {"client-negotiator.queue_time_us":215}
[       OK ] TestRpc.TestNegotiationTimeout (3212 ms)
[----------] 1 test from TestRpc (3212 ms total)

[----------] 20 tests from Parameters/TestRpc
[ RUN      ] Parameters/TestRpc.TestAcceptorPoolStartStop/SSL_UnixSocket
I20260925 06:28:43.005329   416 acceptor_pool.cc:254] collecting diagnostics on the listening RPC socket unix:/tmp/dist-test-taskLX42L2/test-tmp/rpc-test-c4df94439ce64e59a907a5d3cc86be1d.sock every 8 connection(s)
I20260925 06:28:43.007494   417 acceptor_pool.cc:254] collecting diagnostics on the listening RPC socket unix:/tmp/dist-test-taskLX42L2/test-tmp/rpc-test-c4df94439ce64e59a907a5d3cc86be1d.sock every 8 connection(s)
I20260925 06:28:43.047397   427 acceptor_pool.cc:254] collecting diagnostics on the listening RPC socket unix:/tmp/dist-test-taskLX42L2/test-tmp/rpc-test-c4df94439ce64e59a907a5d3cc86be1d.sock every 8 connection(s)
I20260925 06:28:43.048985   428 acceptor_pool.cc:254] collecting diagnostics on the listening RPC socket unix:/tmp/dist-test-taskLX42L2/test-tmp/rpc-test-c4df94439ce64e59a907a5d3cc86be1d.sock every 8 connection(s)
I20260925 06:28:43.085165   438 acceptor_pool.cc:254] collecting diagnostics on the listening RPC socket unix:/tmp/dist-test-taskLX42L2/test-tmp/rpc-test-c4df94439ce64e59a907a5d3cc86be1d.sock every 8 connection(s)
I20260925 06:28:43.085916   439 acceptor_pool.cc:254] collecting diagnostics on the listening RPC socket unix:/tmp/dist-test-taskLX42L2/test-tmp/rpc-test-c4df94439ce64e59a907a5d3cc86be1d.sock every 8 connection(s)
I20260925 06:28:43.110888   449 acceptor_pool.cc:254] collecting diagnostics on the listening RPC socket unix:/tmp/dist-test-taskLX42L2/test-tmp/rpc-test-c4df94439ce64e59a907a5d3cc86be1d.sock every 8 connection(s)
I20260925 06:28:43.111606   450 acceptor_pool.cc:254] collecting diagnostics on the listening RPC socket unix:/tmp/dist-test-taskLX42L2/test-tmp/rpc-test-c4df94439ce64e59a907a5d3cc86be1d.sock every 8 connection(s)
I20260925 06:28:43.138680   460 acceptor_pool.cc:254] collecting diagnostics on the listening RPC socket unix:/tmp/dist-test-taskLX42L2/test-tmp/rpc-test-c4df94439ce64e59a907a5d3cc86be1d.sock every 8 connection(s)
I20260925 06:28:43.139448   461 acceptor_pool.cc:254] collecting diagnostics on the listening RPC socket unix:/tmp/dist-test-taskLX42L2/test-tmp/rpc-test-c4df94439ce64e59a907a5d3cc86be1d.sock every 8 connection(s)
[       OK ] Parameters/TestRpc.TestAcceptorPoolStartStop/SSL_UnixSocket (167 ms)
[ RUN      ] Parameters/TestRpc.TestCall/SSL_UnixSocket
I20260925 06:28:43.165858   473 acceptor_pool.cc:254] collecting diagnostics on the listening RPC socket unix:/tmp/dist-test-taskLX42L2/test-tmp/rpc-test-671eedb960a14957bbd71b313eb34e9f.sock every 8 connection(s)
I20260925 06:28:43.167820   474 acceptor_pool.cc:254] collecting diagnostics on the listening RPC socket unix:/tmp/dist-test-taskLX42L2/test-tmp/rpc-test-671eedb960a14957bbd71b313eb34e9f.sock every 8 connection(s)
I20260925 06:28:43.172971   390 rpc-test.cc:234] Connecting to unix:/tmp/dist-test-taskLX42L2/test-tmp/rpc-test-671eedb960a14957bbd71b313eb34e9f.sock
W20260925 06:28:43.229426   470 connection.cc:196] Error closing socket: Network error: TlsSocket::Close: Broken pipe
[       OK ] Parameters/TestRpc.TestCall/SSL_UnixSocket (91 ms)
[ RUN      ] Parameters/TestRpc.TestCallWithChainCertAndRootCA/SSL_UnixSocket
I20260925 06:28:43.267999   498 acceptor_pool.cc:254] collecting diagnostics on the listening RPC socket unix:/tmp/dist-test-taskLX42L2/test-tmp/rpc-test-c1a899e57a7e4452858eb2a81936d264.sock every 8 connection(s)
I20260925 06:28:43.268829   499 acceptor_pool.cc:254] collecting diagnostics on the listening RPC socket unix:/tmp/dist-test-taskLX42L2/test-tmp/rpc-test-c1a899e57a7e4452858eb2a81936d264.sock every 8 connection(s)
/data0/somelongdirectorytoavoidrpathissues/src/kudu/src/kudu/rpc/rpc-test.cc:303: Failure
Failed
Bad status: Runtime error: could not verify certificate chain (error with cert: subject=CN = localhost, ST = sadfjas, C = AS, emailAddress = sdflkdsajf, O = lskdfjlsad, OU = sldfkja, issuer=C = AS, ST = ASDfkjdhf, L = lskdjf, O = saldfja, OU = skdjf, CN = localhost, emailAddress = sadjflkadsj): : certificate has expired
Google Test trace:
/data0/somelongdirectorytoavoidrpathissues/src/kudu/src/kudu/rpc/rpc-test.cc:300: Connecting to unix:/tmp/dist-test-taskLX42L2/test-tmp/rpc-test-c1a899e57a7e4452858eb2a81936d264.sock
I20260925 06:28:43.289176   390 test_util.cc:175] -----------------------------------------------
I20260925 06:28:43.289347   390 test_util.cc:176] Had fatal failures, leaving test files at /tmp/dist-test-taskLX42L2/test-tmp/rpc-test.2.Parameters_TestRpc.TestCallWithChainCertAndRootCA_SSL_UnixSocket.1790317719710426-390-0
[  FAILED  ] Parameters/TestRpc.TestCallWithChainCertAndRootCA/SSL_UnixSocket, where GetParam() = (true, true) (54 ms)
[ RUN      ] Parameters/TestRpc.TestCallWithBadPasswordProtectedKey/SSL_UnixSocket
[       OK ] Parameters/TestRpc.TestCallWithBadPasswordProtectedKey/SSL_UnixSocket (30 ms)
[ RUN      ] Parameters/TestRpc.TestInvalidMethodCall/SSL_UnixSocket
I20260925 06:28:43.354519   535 acceptor_pool.cc:254] collecting diagnostics on the listening RPC socket unix:/tmp/dist-test-taskLX42L2/test-tmp/rpc-test-3d002da2043f426b90d28a996eee085a.sock every 8 connection(s)
I20260925 06:28:43.355381   536 acceptor_pool.cc:254] collecting diagnostics on the listening RPC socket unix:/tmp/dist-test-taskLX42L2/test-tmp/rpc-test-3d002da2043f426b90d28a996eee085a.sock every 8 connection(s)
I20260925 06:28:43.358764   390 rpc-test.cc:406] Connecting to unix:/tmp/dist-test-taskLX42L2/test-tmp/rpc-test-3d002da2043f426b90d28a996eee085a.sock
W20260925 06:28:43.417637   532 connection.cc:196] Error closing socket: Network error: TlsSocket::Close: Broken pipe
[       OK ] Parameters/TestRpc.TestInvalidMethodCall/SSL_UnixSocket (102 ms)
[ RUN      ] Parameters/TestRpc.TestHighFDs/SSL_UnixSocket
I20260925 06:28:43.625041   560 acceptor_pool.cc:254] collecting diagnostics on the listening RPC socket unix:/tmp/dist-test-taskLX42L2/test-tmp/rpc-test-083f10fcaa204a75b8ffdcce387e87b3.sock every 8 connection(s)
I20260925 06:28:43.625766   561 acceptor_pool.cc:254] collecting diagnostics on the listening RPC socket unix:/tmp/dist-test-taskLX42L2/test-tmp/rpc-test-083f10fcaa204a75b8ffdcce387e87b3.sock every 8 connection(s)
[       OK ] Parameters/TestRpc.TestHighFDs/SSL_UnixSocket (266 ms)
[ RUN      ] Parameters/TestRpc.TestConnectionAlwaysKeepalive/SSL_UnixSocket
I20260925 06:28:43.707607   583 acceptor_pool.cc:254] collecting diagnostics on the listening RPC socket unix:/tmp/dist-test-taskLX42L2/test-tmp/rpc-test-15ddac27b3ba4d79ac896b0d477dc21e.sock every 8 connection(s)
I20260925 06:28:43.708304   584 acceptor_pool.cc:254] collecting diagnostics on the listening RPC socket unix:/tmp/dist-test-taskLX42L2/test-tmp/rpc-test-15ddac27b3ba4d79ac896b0d477dc21e.sock every 8 connection(s)
I20260925 06:28:43.711460   390 rpc-test.cc:532] Connecting to unix:/tmp/dist-test-taskLX42L2/test-tmp/rpc-test-15ddac27b3ba4d79ac896b0d477dc21e.sock
W20260925 06:28:46.745419   582 connection.cc:196] Error closing socket: Network error: TlsSocket::Close: Broken pipe
[       OK ] Parameters/TestRpc.TestConnectionAlwaysKeepalive/SSL_UnixSocket (3061 ms)
[ RUN      ] Parameters/TestRpc.TestReopenOutboundConnections/SSL_UnixSocket
I20260925 06:28:46.780140   606 acceptor_pool.cc:254] collecting diagnostics on the listening RPC socket unix:/tmp/dist-test-taskLX42L2/test-tmp/rpc-test-d33a3ed7f6c946279841e2ddf498eac1.sock every 8 connection(s)
I20260925 06:28:46.780812   607 acceptor_pool.cc:254] collecting diagnostics on the listening RPC socket unix:/tmp/dist-test-taskLX42L2/test-tmp/rpc-test-d33a3ed7f6c946279841e2ddf498eac1.sock every 8 connection(s)
I20260925 06:28:46.783927   390 rpc-test.cc:658] Connecting to unix:/tmp/dist-test-taskLX42L2/test-tmp/rpc-test-d33a3ed7f6c946279841e2ddf498eac1.sock
W20260925 06:28:46.814772   605 connection.cc:196] Error closing socket: Network error: TlsSocket::Close: Broken pipe
W20260925 06:28:46.834002   605 connection.cc:196] Error closing socket: Network error: TlsSocket::Close: Broken pipe
W20260925 06:28:46.843791   605 connection.cc:196] Error closing socket: Network error: TlsSocket::Close: Broken pipe
W20260925 06:28:46.853472   605 connection.cc:196] Error closing socket: Network error: TlsSocket::Close: Broken pipe
W20260925 06:28:46.863276   605 connection.cc:196] Error closing socket: Network error: TlsSocket::Close: Broken pipe
W20260925 06:28:46.873065   605 connection.cc:196] Error closing socket: Network error: TlsSocket::Close: Broken pipe
W20260925 06:28:46.882835   605 connection.cc:196] Error closing socket: Network error: TlsSocket::Close: Broken pipe
W20260925 06:28:46.892506   605 connection.cc:196] Error closing socket: Network error: TlsSocket::Close: Broken pipe
W20260925 06:28:46.902015   605 connection.cc:196] Error closing socket: Network error: TlsSocket::Close: Broken pipe
W20260925 06:28:46.911464   605 connection.cc:196] Error closing socket: Network error: TlsSocket::Close: Broken pipe
W20260925 06:28:46.921109   605 connection.cc:196] Error closing socket: Network error: TlsSocket::Close: Broken pipe
W20260925 06:28:46.929983   605 connection.cc:196] Error closing socket: Network error: TlsSocket::Close: Broken pipe
W20260925 06:28:46.939642   605 connection.cc:196] Error closing socket: Network error: TlsSocket::Close: Broken pipe
W20260925 06:28:46.939757   606 acceptor_pool.cc:285] unable to collect diagnostics on RPC socket unix:/tmp/dist-test-taskLX42L2/test-tmp/rpc-test-d33a3ed7f6c946279841e2ddf498eac1.sock: Not implemented: netlink diagnostics is currently supported only on IPv4 TCP sockets
W20260925 06:28:46.949440   605 connection.cc:196] Error closing socket: Network error: TlsSocket::Close: Broken pipe
W20260925 06:28:46.958644   605 connection.cc:196] Error closing socket: Network error: TlsSocket::Close: Broken pipe
W20260925 06:28:46.968019   605 connection.cc:196] Error closing socket: Network error: TlsSocket::Close: Broken pipe
W20260925 06:28:46.978485   605 connection.cc:196] Error closing socket: Network error: TlsSocket::Close: Broken pipe
W20260925 06:28:46.987941   605 connection.cc:196] Error closing socket: Network error: TlsSocket::Close: Broken pipe
W20260925 06:28:46.996922   605 connection.cc:196] Error closing socket: Network error: TlsSocket::Close: Broken pipe
W20260925 06:28:47.006662   605 connection.cc:196] Error closing socket: Network error: TlsSocket::Close: Broken pipe
W20260925 06:28:47.015581   605 connection.cc:196] Error closing socket: Network error: TlsSocket::Close: Broken pipe
W20260925 06:28:47.025138   605 connection.cc:196] Error closing socket: Network error: TlsSocket::Close: Broken pipe
W20260925 06:28:47.035753   605 connection.cc:196] Error closing socket: Network error: TlsSocket::Close: Broken pipe
W20260925 06:28:47.046504   605 connection.cc:196] Error closing socket: Network error: TlsSocket::Close: Broken pipe
W20260925 06:28:47.056257   605 connection.cc:196] Error closing socket: Network error: TlsSocket::Close: Broken pipe
W20260925 06:28:47.066247   605 connection.cc:196] Error closing socket: Network error: TlsSocket::Close: Broken pipe
W20260925 06:28:47.075425   605 connection.cc:196] Error closing socket: Network error: TlsSocket::Close: Broken pipe
W20260925 06:28:47.084506   605 connection.cc:196] Error closing socket: Network error: TlsSocket::Close: Broken pipe
W20260925 06:28:47.093637   605 connection.cc:196] Error closing socket: Network error: TlsSocket::Close: Broken pipe
W20260925 06:28:47.103202   605 connection.cc:196] Error closing socket: Network error: TlsSocket::Close: Broken pipe
W20260925 06:28:47.113535   605 connection.cc:196] Error closing socket: Network error: TlsSocket::Close: Broken pipe
[       OK ] Parameters/TestRpc.TestReopenOutboundConnections/SSL_UnixSocket (367 ms)
[ RUN      ] Parameters/TestRpc.TestConnectionNetworkPlane/SSL_UnixSocket
I20260925 06:28:47.133513   629 acceptor_pool.cc:254] collecting diagnostics on the listening RPC socket unix:/tmp/dist-test-taskLX42L2/test-tmp/rpc-test-b6665920420f48e18d5e022c1c7b845a.sock every 8 connection(s)
I20260925 06:28:47.134327   630 acceptor_pool.cc:254] collecting diagnostics on the listening RPC socket unix:/tmp/dist-test-taskLX42L2/test-tmp/rpc-test-b6665920420f48e18d5e022c1c7b845a.sock every 8 connection(s)
I20260925 06:28:47.137380   390 rpc-test.cc:772] Connecting to unix:/tmp/dist-test-taskLX42L2/test-tmp/rpc-test-b6665920420f48e18d5e022c1c7b845a.sock
W20260925 06:28:47.177899   628 connection.cc:196] Error closing socket: Network error: TlsSocket::Close: Broken pipe
[       OK ] Parameters/TestRpc.TestConnectionNetworkPlane/SSL_UnixSocket (64 ms)
[ RUN      ] Parameters/TestRpc.TestTCPKeepalive/SSL_UnixSocket
I20260925 06:28:47.197392   654 acceptor_pool.cc:254] collecting diagnostics on the listening RPC socket unix:/tmp/dist-test-taskLX42L2/test-tmp/rpc-test-49d94d8a7c7a417f86a1cbb6f55d6154.sock every 8 connection(s)
I20260925 06:28:47.198143   655 acceptor_pool.cc:254] collecting diagnostics on the listening RPC socket unix:/tmp/dist-test-taskLX42L2/test-tmp/rpc-test-49d94d8a7c7a417f86a1cbb6f55d6154.sock every 8 connection(s)
I20260925 06:28:47.240564   658 rpc-test-base.h:222] got call: sleep_micros: 8000000 deferred: true
I20260925 06:28:55.244629   658 rpcz_store.cc:275] Call kudu.rpc.GenericCalculatorService.Sleep from unix:<unnamed> (request call id 0) took 8004 ms. Trace:
I20260925 06:28:55.245038   658 rpcz_store.cc:276] 0925 06:28:47.240415 (+     0us) service_pool.cc:170] Inserting onto call queue
0925 06:28:47.240513 (+    98us) service_pool.cc:227] Handling call
0925 06:28:55.244456 (+8003943us) inbound_call.cc:173] Queueing success response
Metrics: {}
W20260925 06:28:55.251899   651 connection.cc:196] Error closing socket: Network error: TlsSocket::Close: Broken pipe
[       OK ] Parameters/TestRpc.TestTCPKeepalive/SSL_UnixSocket (8076 ms)
[ RUN      ] Parameters/TestRpc.TestMaxSmallSidecars/SSL_UnixSocket
I20260925 06:28:55.292371   680 acceptor_pool.cc:254] collecting diagnostics on the listening RPC socket unix:/tmp/dist-test-taskLX42L2/test-tmp/rpc-test-067dd6111827444bae0d2543193a2e66.sock every 8 connection(s)
I20260925 06:28:55.293273   681 acceptor_pool.cc:254] collecting diagnostics on the listening RPC socket unix:/tmp/dist-test-taskLX42L2/test-tmp/rpc-test-067dd6111827444bae0d2543193a2e66.sock every 8 connection(s)
W20260925 06:28:55.454226   677 connection.cc:196] Error closing socket: Network error: TlsSocket::Close: Broken pipe
[       OK ] Parameters/TestRpc.TestMaxSmallSidecars/SSL_UnixSocket (200 ms)
[ RUN      ] Parameters/TestRpc.TestCallTimeout/SSL_UnixSocket
I20260925 06:28:55.496232   705 acceptor_pool.cc:254] collecting diagnostics on the listening RPC socket unix:/tmp/dist-test-taskLX42L2/test-tmp/rpc-test-03d3e1be6fec462f9be13edc30add1dc.sock every 8 connection(s)
I20260925 06:28:55.496956   706 acceptor_pool.cc:254] collecting diagnostics on the listening RPC socket unix:/tmp/dist-test-taskLX42L2/test-tmp/rpc-test-03d3e1be6fec462f9be13edc30add1dc.sock every 8 connection(s)
I20260925 06:28:55.513139   390 rpc-test-base.h:595] status: Timed out: connection negotiation to unix:/tmp/dist-test-taskLX42L2/test-tmp/rpc-test-03d3e1be6fec462f9be13edc30add1dc.sock for RPC Sleep timed out after 0.000s (ON_OUTBOUND_QUEUE), seconds elapsed: 0.00228977
I20260925 06:28:55.520241   709 rpc-test-base.h:222] got call: sleep_micros: 700000
I20260925 06:28:55.713933   390 rpc-test-base.h:595] status: Timed out: Sleep RPC to unix:/tmp/dist-test-taskLX42L2/test-tmp/rpc-test-03d3e1be6fec462f9be13edc30add1dc.sock timed out after 0.200s (SENT), seconds elapsed: 0.20048
I20260925 06:28:55.715132   708 rpc-test-base.h:222] got call: sleep_micros: 2000000
W20260925 06:28:56.220961   709 rpcz_store.cc:267] Call kudu.rpc.GenericCalculatorService.Sleep from unix:<unnamed> (request call id 1) took 700 ms (client timeout 200 ms). Trace:
W20260925 06:28:56.221328   709 rpcz_store.cc:269] 0925 06:28:55.520093 (+     0us) service_pool.cc:170] Inserting onto call queue
0925 06:28:55.520196 (+   103us) service_pool.cc:227] Handling call
0925 06:28:56.220910 (+700714us) inbound_call.cc:173] Queueing success response
Metrics: {}
I20260925 06:28:57.216754   390 rpc-test-base.h:595] status: Timed out: Sleep RPC to unix:/tmp/dist-test-taskLX42L2/test-tmp/rpc-test-03d3e1be6fec462f9be13edc30add1dc.sock timed out after 1.500s (SENT), seconds elapsed: 1.50252
W20260925 06:28:57.221236   702 connection.cc:196] Error closing socket: Network error: TlsSocket::Close: Broken pipe
W20260925 06:28:57.715655   708 rpcz_store.cc:267] Call kudu.rpc.GenericCalculatorService.Sleep from unix:<unnamed> (request call id 2) took 2000 ms (client timeout 1500 ms). Trace:
W20260925 06:28:57.715993   708 rpcz_store.cc:269] 0925 06:28:55.714966 (+     0us) service_pool.cc:170] Inserting onto call queue
0925 06:28:55.715078 (+   112us) service_pool.cc:227] Handling call
0925 06:28:57.715603 (+2000525us) inbound_call.cc:173] Queueing success response
Metrics: {}
W20260925 06:28:57.716545   702 connection.cc:441] server connection from unix:<unnamed> torn down before Call kudu.rpc.GenericCalculatorService.Sleep from unix:<unnamed> (request call id 2) could send its response
[       OK ] Parameters/TestRpc.TestCallTimeout/SSL_UnixSocket (2262 ms)
[ RUN      ] Parameters/TestRpc.TestServerShutsDown/SSL_UnixSocket
I20260925 06:28:57.723310   390 rpc-test.cc:1125] Connecting to 0.0.0.0:43717
W20260925 06:28:57.736927   722 negotiation.cc:337] Failed RPC negotiation. Trace:
0925 06:28:57.735539 (+     0us) reactor.cc:625] Submitting negotiation task for client connection to 0.0.0.0:43717 (local address 127.0.0.1:40470)
0925 06:28:57.735981 (+   442us) negotiation.cc:107] Waiting for socket to connect
0925 06:28:57.736012 (+    31us) client_negotiation.cc:174] Beginning negotiation
0925 06:28:57.736221 (+   209us) client_negotiation.cc:252] Sending NEGOTIATE NegotiatePB request
0925 06:28:57.736422 (+   201us) negotiation.cc:327] Negotiation complete: Network error: Client connection negotiation failed: client connection to 0.0.0.0:43717: BlockingWrite error: write error: Broken pipe (error 32)
Metrics: {"client-negotiator.queue_time_us":119}
[       OK ] Parameters/TestRpc.TestServerShutsDown/SSL_UnixSocket (18 ms)
[ RUN      ] Parameters/TestRpc.TimedOutOnResponseMetric/SSL_UnixSocket
I20260925 06:28:57.775904   739 acceptor_pool.cc:254] collecting diagnostics on the listening RPC socket unix:/tmp/dist-test-taskLX42L2/test-tmp/rpc-test-490680d122564e65927768a3eeeecaaf.sock every 8 connection(s)
I20260925 06:28:57.776636   740 acceptor_pool.cc:254] collecting diagnostics on the listening RPC socket unix:/tmp/dist-test-taskLX42L2/test-tmp/rpc-test-490680d122564e65927768a3eeeecaaf.sock every 8 connection(s)
W20260925 06:28:58.013082   743 rpcz_store.cc:267] Call kudu.rpc_test.CalculatorService.Sleep from unix:<unnamed> (request call id 3) took 50 ms (client timeout 25 ms). Trace:
W20260925 06:28:58.013409   743 rpcz_store.cc:269] 0925 06:28:57.962512 (+     0us) service_pool.cc:170] Inserting onto call queue
0925 06:28:57.962619 (+   107us) service_pool.cc:227] Handling call
0925 06:28:58.013016 (+ 50397us) inbound_call.cc:173] Queueing success response
Related trace 'test_child':
Metrics: {"test_sleep_us":50000,"child_traces":[["test_child",{"related_trace_metric":1}]]}
W20260925 06:28:58.072218   743 rpcz_store.cc:267] Call kudu.rpc_test.CalculatorService.Sleep from unix:<unnamed> (request call id 4) took 50 ms (client timeout 50 ms). Trace:
W20260925 06:28:58.072588   743 rpcz_store.cc:269] 0925 06:28:58.021670 (+     0us) service_pool.cc:170] Inserting onto call queue
0925 06:28:58.021810 (+   140us) service_pool.cc:227] Handling call
0925 06:28:58.072160 (+ 50350us) inbound_call.cc:173] Queueing success response
Related trace 'test_child':
Metrics: {"test_sleep_us":50000,"child_traces":[["test_child",{"related_trace_metric":1}]]}
[       OK ] Parameters/TestRpc.TimedOutOnResponseMetric/SSL_UnixSocket (340 ms)
[ RUN      ] Parameters/TestRpc.AcceptorDispatchingTimesMetric/SSL_UnixSocket
I20260925 06:28:58.091825   764 acceptor_pool.cc:254] collecting diagnostics on the listening RPC socket 0.0.0.0:37187 every 8 connection(s)
I20260925 06:28:58.092468   765 acceptor_pool.cc:254] collecting diagnostics on the listening RPC socket 0.0.0.0:37187 every 8 connection(s)
W20260925 06:28:58.097929   760 negotiation.cc:337] Failed RPC negotiation. Trace:
0925 06:28:58.096129 (+     0us) reactor.cc:625] Submitting negotiation task for server connection from 127.0.0.1:59806 (local address 127.0.0.1:37187)
0925 06:28:58.096777 (+   648us) server_negotiation.cc:206] Beginning negotiation
0925 06:28:58.096812 (+    35us) server_negotiation.cc:399] Waiting for connection header
0925 06:28:58.097117 (+   305us) negotiation.cc:327] Negotiation complete: Network error: Server connection negotiation failed: server connection from 127.0.0.1:59806: BlockingRecv error: recv got EOF from 127.0.0.1:59806 (error 108)
Metrics: {"server-negotiator.queue_time_us":137}
[       OK ] Parameters/TestRpc.AcceptorDispatchingTimesMetric/SSL_UnixSocket (20 ms)
[ RUN      ] Parameters/TestRpc.TestRpcCallbackDestroysMessenger/SSL_UnixSocket
[       OK ] Parameters/TestRpc.TestRpcCallbackDestroysMessenger/SSL_UnixSocket (62 ms)
[ RUN      ] Parameters/TestRpc.TestApplicationFeatureFlag/SSL_UnixSocket
I20260925 06:28:58.181945   789 acceptor_pool.cc:254] collecting diagnostics on the listening RPC socket unix:/tmp/dist-test-taskLX42L2/test-tmp/rpc-test-571755e49bda4cbc80747715ecb02246.sock every 8 connection(s)
I20260925 06:28:58.182639   790 acceptor_pool.cc:254] collecting diagnostics on the listening RPC socket unix:/tmp/dist-test-taskLX42L2/test-tmp/rpc-test-571755e49bda4cbc80747715ecb02246.sock every 8 connection(s)
W20260925 06:28:58.215687   786 messenger.cc:357] Unable to handle RPC call: Not implemented: call requires unsupported application feature flags: 99
[       OK ] Parameters/TestRpc.TestApplicationFeatureFlag/SSL_UnixSocket (60 ms)
[ RUN      ] Parameters/TestRpc.TestCancellation/SSL_UnixSocket
I20260925 06:28:58.241539   814 acceptor_pool.cc:254] collecting diagnostics on the listening RPC socket unix:/tmp/dist-test-taskLX42L2/test-tmp/rpc-test-cc6e05b49deb45b2b8e16608bad39de2.sock every 8 connection(s)
I20260925 06:28:58.242260   815 acceptor_pool.cc:254] collecting diagnostics on the listening RPC socket unix:/tmp/dist-test-taskLX42L2/test-tmp/rpc-test-cc6e05b49deb45b2b8e16608bad39de2.sock every 8 connection(s)
I20260925 06:28:58.245301   390 rpc-test.cc:1648] Connecting to unix:/tmp/dist-test-taskLX42L2/test-tmp/rpc-test-cc6e05b49deb45b2b8e16608bad39de2.sock
I20260925 06:28:58.367506   390 rpc-test-base.h:595] status: Aborted: Sleep RPC to unix:/tmp/dist-test-taskLX42L2/test-tmp/rpc-test-cc6e05b49deb45b2b8e16608bad39de2.sock is cancelled in state READY, seconds elapsed: 0.000545736
I20260925 06:28:58.543231   390 rpc-test-base.h:595] status: Aborted: Sleep RPC to unix:/tmp/dist-test-taskLX42L2/test-tmp/rpc-test-cc6e05b49deb45b2b8e16608bad39de2.sock is cancelled in state SENT, seconds elapsed: 0.000832594
I20260925 06:28:58.543438   817 rpc-test-base.h:222] got call: sleep_micros: 510000
I20260925 06:28:58.718963   390 rpc-test-base.h:595] status: Aborted: Sleep RPC to unix:/tmp/dist-test-taskLX42L2/test-tmp/rpc-test-cc6e05b49deb45b2b8e16608bad39de2.sock is cancelled in state SENT, seconds elapsed: 0.000626575
I20260925 06:28:58.719321   816 rpc-test-base.h:222] got call: sleep_micros: 510000
I20260925 06:28:58.890338   390 rpc-test-base.h:595] status: Aborted: Sleep RPC to unix:/tmp/dist-test-taskLX42L2/test-tmp/rpc-test-cc6e05b49deb45b2b8e16608bad39de2.sock is cancelled in state SENT, seconds elapsed: 0.000863765
W20260925 06:28:58.901304   818 rpcz_store.cc:267] Call kudu.rpc.GenericCalculatorService.Sleep from unix:<unnamed> (request call id 11) took 10 ms (client timeout 10 ms). Trace:
W20260925 06:28:58.901605   818 rpcz_store.cc:269] 0925 06:28:58.890294 (+     0us) service_pool.cc:170] Inserting onto call queue
0925 06:28:58.901025 (+ 10731us) service_pool.cc:214] Skipping call since client already timed out
0925 06:28:58.901110 (+    85us) inbound_call.cc:173] Queueing failure response
Metrics: {}
I20260925 06:28:58.902148   818 rpc-test-base.h:222] got call: sleep_micros: 1500000
W20260925 06:28:59.054014   817 rpcz_store.cc:267] Call kudu.rpc.GenericCalculatorService.Sleep from unix:<unnamed> (request call id 3) took 510 ms (client timeout 10 ms). Trace:
W20260925 06:28:59.054314   817 rpcz_store.cc:269] 0925 06:28:58.543243 (+     0us) service_pool.cc:170] Inserting onto call queue
0925 06:28:58.543383 (+   140us) service_pool.cc:227] Handling call
0925 06:28:59.053963 (+510580us) inbound_call.cc:173] Queueing success response
Metrics: {}
W20260925 06:28:59.229908   816 rpcz_store.cc:267] Call kudu.rpc.GenericCalculatorService.Sleep from unix:<unnamed> (request call id 7) took 510 ms (client timeout 10 ms). Trace:
W20260925 06:28:59.230291   816 rpcz_store.cc:269] 0925 06:28:58.719111 (+     0us) service_pool.cc:170] Inserting onto call queue
0925 06:28:58.719276 (+   165us) service_pool.cc:227] Handling call
0925 06:28:59.229858 (+510582us) inbound_call.cc:173] Queueing success response
Metrics: {}
I20260925 06:28:59.895104   390 rpc-test-base.h:595] status: Timed out: Sleep RPC to unix:/tmp/dist-test-taskLX42L2/test-tmp/rpc-test-cc6e05b49deb45b2b8e16608bad39de2.sock timed out after 1.000s (SENT), seconds elapsed: 1.00425
I20260925 06:28:59.897119   816 rpc-test-base.h:222] got call: sleep_micros: 1500000
W20260925 06:29:00.402776   818 rpcz_store.cc:267] Call kudu.rpc.GenericCalculatorService.Sleep from unix:<unnamed> (request call id 12) took 1511 ms (client timeout 1000 ms). Trace:
W20260925 06:29:00.403115   818 rpcz_store.cc:269] 0925 06:28:58.891392 (+     0us) service_pool.cc:170] Inserting onto call queue
0925 06:28:58.902117 (+ 10725us) service_pool.cc:227] Handling call
0925 06:29:00.402636 (+1500519us) inbound_call.cc:173] Queueing success response
Metrics: {}
I20260925 06:29:00.897356   390 rpc-test-base.h:595] status: Timed out: Sleep RPC to unix:/tmp/dist-test-taskLX42L2/test-tmp/rpc-test-cc6e05b49deb45b2b8e16608bad39de2.sock timed out after 1.000s (SENT), seconds elapsed: 1.00169
W20260925 06:29:00.898875   811 messenger.cc:357] Unable to handle RPC call: Not implemented: call requires unsupported application feature flags: 99, 1
W20260925 06:29:00.900362   811 messenger.cc:357] Unable to handle RPC call: Not implemented: call requires unsupported application feature flags: 99, 1
W20260925 06:29:01.118145   811 connection.cc:196] Error closing socket: Network error: TlsSocket::Close: Broken pipe
W20260925 06:29:01.397740   816 rpcz_store.cc:267] Call kudu.rpc.GenericCalculatorService.Sleep from unix:<unnamed> (request call id 13) took 1501 ms (client timeout 1000 ms). Trace:
W20260925 06:29:01.398062   816 rpcz_store.cc:269] 0925 06:28:59.896801 (+     0us) service_pool.cc:170] Inserting onto call queue
0925 06:28:59.897005 (+   204us) service_pool.cc:227] Handling call
0925 06:29:01.397690 (+1500685us) inbound_call.cc:173] Queueing success response
Metrics: {}
W20260925 06:29:01.398551   811 connection.cc:441] server connection from unix:<unnamed> torn down before Call kudu.rpc.GenericCalculatorService.Sleep from unix:<unnamed> (request call id 13) could send its response
[       OK ] Parameters/TestRpc.TestCancellation/SSL_UnixSocket (3182 ms)
[ RUN      ] Parameters/TestRpc.TestCancellationMultiThreads/SSL_UnixSocket
I20260925 06:29:01.444798   840 acceptor_pool.cc:254] collecting diagnostics on the listening RPC socket unix:/tmp/dist-test-taskLX42L2/test-tmp/rpc-test-aff65cd603fd4078b48da2b73f84fd9d.sock every 8 connection(s)
I20260925 06:29:01.445649   841 acceptor_pool.cc:254] collecting diagnostics on the listening RPC socket unix:/tmp/dist-test-taskLX42L2/test-tmp/rpc-test-aff65cd603fd4078b48da2b73f84fd9d.sock every 8 connection(s)
I20260925 06:29:01.448664   390 rpc-test.cc:1808] Connecting to unix:/tmp/dist-test-taskLX42L2/test-tmp/rpc-test-aff65cd603fd4078b48da2b73f84fd9d.sock
I20260925 06:29:01.609036   854 test_util.cc:268] Using random seed: -721023000
I20260925 06:29:01.610309   855 test_util.cc:268] Using random seed: -721021651
I20260925 06:29:01.612370   856 test_util.cc:268] Using random seed: -721019596
I20260925 06:29:01.614104   857 test_util.cc:268] Using random seed: -721017990
I20260925 06:29:01.615767   858 test_util.cc:268] Using random seed: -721016352
I20260925 06:29:01.617192   859 test_util.cc:268] Using random seed: -721014892
I20260925 06:29:01.619516   860 test_util.cc:268] Using random seed: -721012589
I20260925 06:29:01.621447   861 test_util.cc:268] Using random seed: -721010641
I20260925 06:29:01.623726   862 test_util.cc:268] Using random seed: -721008381
I20260925 06:29:01.627178   863 test_util.cc:268] Using random seed: -721004949
I20260925 06:29:01.629209   864 test_util.cc:268] Using random seed: -721002874
I20260925 06:29:01.634549   865 test_util.cc:268] Using random seed: -720997555
I20260925 06:29:01.636950   866 test_util.cc:268] Using random seed: -720995227
I20260925 06:29:01.639134   867 test_util.cc:268] Using random seed: -720992927
I20260925 06:29:01.641588   868 test_util.cc:268] Using random seed: -720990952
I20260925 06:29:01.643124   869 test_util.cc:268] Using random seed: -720988989
I20260925 06:29:01.645470   870 test_util.cc:268] Using random seed: -720986644
I20260925 06:29:01.647943   871 test_util.cc:268] Using random seed: -720984153
I20260925 06:29:01.650060   872 test_util.cc:268] Using random seed: -720982047
I20260925 06:29:01.651999   873 test_util.cc:268] Using random seed: -720980128
I20260925 06:29:01.654044   874 test_util.cc:268] Using random seed: -720978086
I20260925 06:29:01.658675   875 test_util.cc:268] Using random seed: -720973459
I20260925 06:29:01.660606   876 test_util.cc:268] Using random seed: -720971513
I20260925 06:29:01.662631   877 test_util.cc:268] Using random seed: -720969483
I20260925 06:29:01.664736   878 test_util.cc:268] Using random seed: -720967817
I20260925 06:29:01.666636   879 test_util.cc:268] Using random seed: -720965918
I20260925 06:29:01.668504   880 test_util.cc:268] Using random seed: -720963615
I20260925 06:29:01.675124   881 test_util.cc:268] Using random seed: -720957426
I20260925 06:29:01.676479   882 test_util.cc:268] Using random seed: -720955608
I20260925 06:29:01.678511   883 test_util.cc:268] Using random seed: -720953588
W20260925 06:29:20.885279   837 connection.cc:196] Error closing socket: Network error: TlsSocket::Close: Broken pipe
[       OK ] Parameters/TestRpc.TestCancellationMultiThreads/SSL_UnixSocket (19495 ms)
[ RUN      ] Parameters/TestRpc.TestCallId/SSL_UnixSocket
I20260925 06:29:20.919443   897 acceptor_pool.cc:254] collecting diagnostics on the listening RPC socket unix:/tmp/dist-test-taskLX42L2/test-tmp/rpc-test-e79806acb91b47ddb02fc6c3d4c563fa.sock every 8 connection(s)
I20260925 06:29:20.920331   898 acceptor_pool.cc:254] collecting diagnostics on the listening RPC socket unix:/tmp/dist-test-taskLX42L2/test-tmp/rpc-test-e79806acb91b47ddb02fc6c3d4c563fa.sock every 8 connection(s)
W20260925 06:29:20.971642   894 connection.cc:196] Error closing socket: Network error: TlsSocket::Close: Broken pipe
[       OK ] Parameters/TestRpc.TestCallId/SSL_UnixSocket (75 ms)
[----------] 20 tests from Parameters/TestRpc (38002 ms total)

[----------] Global test environment tear-down
[==========] 21 tests from 2 test suites ran. (41215 ms total)
[  PASSED  ] 20 tests.
[  FAILED  ] 1 test, listed below:
[  FAILED  ] Parameters/TestRpc.TestCallWithChainCertAndRootCA/SSL_UnixSocket, where GetParam() = (true, true)

 1 FAILED TEST
I20260925 06:29:20.995112   390 logging.cc:424] LogThrottler /data0/somelongdirectorytoavoidrpathissues/src/kudu/src/kudu/rpc/acceptor_pool.cc:285: suppressed but not reported on 3 messages since previous log ~34 seconds ago