Diagnosed failure

Parameters/TestRpc.TestCallWithChainCertAndChainCA/SSL_UnixSocket: /data0/somelongdirectorytoavoidrpathissues/src/kudu/src/kudu/rpc/rpc-test.cc:270: Failure
Failed
Bad status: Runtime error: could not verify certificate chain (error with cert: subject=CN = localhost, ST = sadfjas, C = AS, emailAddress = sdflkdsajf, O = lskdfjlsad, OU = sldfkja, issuer=C = AS, ST = ASDfkjdhf, L = lskdjf, O = saldfja, OU = skdjf, CN = localhost, emailAddress = sadjflkadsj): : certificate has expired
Google Test trace:
/data0/somelongdirectorytoavoidrpathissues/src/kudu/src/kudu/rpc/rpc-test.cc:267: Connecting to unix:/tmp/dist-test-taskH4X4Pl/test-tmp/rpc-test-6ca2da41dd214fe685430d3bac74d54f.sock
I20260927 18:36:37.885715 16688 test_util.cc:175] -----------------------------------------------
I20260927 18:36:37.885782 16688 test_util.cc:176] Had fatal failures, leaving test files at /tmp/dist-test-taskH4X4Pl/test-tmp/rpc-test.6.Parameters_TestRpc.TestCallWithChainCertAndChainCA_SSL_UnixSocket.1790534197824370-16688-0

Full log

Note: This is test shard 7 of 8.
[==========] Running 21 tests from 2 test suites.
[----------] Global test environment set-up.
[----------] 20 tests from Parameters/TestRpc
[ RUN      ] Parameters/TestRpc.TestMessengerCreateDestroy/SSL_UnixSocket
WARNING: Logging before InitGoogleLogging() is written to STDERR
I20260927 18:36:37.846980 16688 rpc-test.cc:169] started messenger TestCreateDestroy
[       OK ] Parameters/TestRpc.TestMessengerCreateDestroy/SSL_UnixSocket (18 ms)
[ RUN      ] Parameters/TestRpc.TestNegotiationDeadlock/SSL_UnixSocket
I20260927 18:36:37.865581 16708 acceptor_pool.cc:254] collecting diagnostics on the listening RPC socket unix:/tmp/dist-test-taskH4X4Pl/test-tmp/rpc-test-906385b2a1014c238592130c2499e65b.sock every 8 connection(s)
I20260927 18:36:37.865639 16709 acceptor_pool.cc:254] collecting diagnostics on the listening RPC socket unix:/tmp/dist-test-taskH4X4Pl/test-tmp/rpc-test-906385b2a1014c238592130c2499e65b.sock every 8 connection(s)
[       OK ] Parameters/TestRpc.TestNegotiationDeadlock/SSL_UnixSocket (26 ms)
[ RUN      ] Parameters/TestRpc.TestCallWithChainCertAndChainCA/SSL_UnixSocket
I20260927 18:36:37.881038 16724 acceptor_pool.cc:254] collecting diagnostics on the listening RPC socket unix:/tmp/dist-test-taskH4X4Pl/test-tmp/rpc-test-6ca2da41dd214fe685430d3bac74d54f.sock every 8 connection(s)
I20260927 18:36:37.881096 16725 acceptor_pool.cc:254] collecting diagnostics on the listening RPC socket unix:/tmp/dist-test-taskH4X4Pl/test-tmp/rpc-test-6ca2da41dd214fe685430d3bac74d54f.sock every 8 connection(s)
/data0/somelongdirectorytoavoidrpathissues/src/kudu/src/kudu/rpc/rpc-test.cc:270: Failure
Failed
Bad status: Runtime error: could not verify certificate chain (error with cert: subject=CN = localhost, ST = sadfjas, C = AS, emailAddress = sdflkdsajf, O = lskdfjlsad, OU = sldfkja, issuer=C = AS, ST = ASDfkjdhf, L = lskdjf, O = saldfja, OU = skdjf, CN = localhost, emailAddress = sadjflkadsj): : certificate has expired
Google Test trace:
/data0/somelongdirectorytoavoidrpathissues/src/kudu/src/kudu/rpc/rpc-test.cc:267: Connecting to unix:/tmp/dist-test-taskH4X4Pl/test-tmp/rpc-test-6ca2da41dd214fe685430d3bac74d54f.sock
I20260927 18:36:37.885715 16688 test_util.cc:175] -----------------------------------------------
I20260927 18:36:37.885782 16688 test_util.cc:176] Had fatal failures, leaving test files at /tmp/dist-test-taskH4X4Pl/test-tmp/rpc-test.6.Parameters_TestRpc.TestCallWithChainCertAndChainCA_SSL_UnixSocket.1790534197824370-16688-0
[  FAILED  ] Parameters/TestRpc.TestCallWithChainCertAndChainCA/SSL_UnixSocket, where GetParam() = (true, true) (10 ms)
[ RUN      ] Parameters/TestRpc.TestCallWithPasswordProtectedKey/SSL_UnixSocket
I20260927 18:36:37.903373 16749 acceptor_pool.cc:254] collecting diagnostics on the listening RPC socket unix:/tmp/dist-test-taskH4X4Pl/test-tmp/rpc-test-6d87e2da2a7f4f2dbc68bd9ac9f56f15.sock every 8 connection(s)
I20260927 18:36:37.903409 16750 acceptor_pool.cc:254] collecting diagnostics on the listening RPC socket unix:/tmp/dist-test-taskH4X4Pl/test-tmp/rpc-test-6d87e2da2a7f4f2dbc68bd9ac9f56f15.sock every 8 connection(s)
W20260927 18:36:37.915695 16746 connection.cc:196] Error closing socket: Network error: TlsSocket::Close: Broken pipe
[       OK ] Parameters/TestRpc.TestCallWithPasswordProtectedKey/SSL_UnixSocket (31 ms)
[ RUN      ] Parameters/TestRpc.TestCallToBadServer/SSL_UnixSocket
I20260927 18:36:37.929358 16688 rpc-test.cc:394] Status: Network error: Client connection negotiation failed: client connection to 0.0.0.0:0: connect: Connection refused (error 111)
I20260927 18:36:37.929924 16688 rpc-test.cc:394] Status: Network error: Client connection negotiation failed: client connection to 0.0.0.0:0: connect: Connection refused (error 111)
I20260927 18:36:37.930370 16688 rpc-test.cc:394] Status: Network error: Client connection negotiation failed: client connection to 0.0.0.0:0: connect: Connection refused (error 111)
I20260927 18:36:37.930811 16688 rpc-test.cc:394] Status: Network error: Client connection negotiation failed: client connection to 0.0.0.0:0: connect: Connection refused (error 111)
I20260927 18:36:37.931279 16688 rpc-test.cc:394] Status: Network error: Client connection negotiation failed: client connection to 0.0.0.0:0: connect: Connection refused (error 111)
[       OK ] Parameters/TestRpc.TestCallToBadServer/SSL_UnixSocket (14 ms)
[ RUN      ] Parameters/TestRpc.TestWrongService/SSL_UnixSocket
I20260927 18:36:37.947741 16784 acceptor_pool.cc:254] collecting diagnostics on the listening RPC socket unix:/tmp/dist-test-taskH4X4Pl/test-tmp/rpc-test-d9ecbb86f5214f67b9ff6ffdf888d04d.sock every 8 connection(s)
I20260927 18:36:37.947790 16785 acceptor_pool.cc:254] collecting diagnostics on the listening RPC socket unix:/tmp/dist-test-taskH4X4Pl/test-tmp/rpc-test-d9ecbb86f5214f67b9ff6ffdf888d04d.sock every 8 connection(s)
I20260927 18:36:37.962734 16781 messenger.cc:345] service WrongServiceName not registered on TestServer
W20260927 18:36:37.963598 16781 connection.cc:196] Error closing socket: Network error: TlsSocket::Close: Broken pipe
[       OK ] Parameters/TestRpc.TestWrongService/SSL_UnixSocket (32 ms)
[ RUN      ] Parameters/TestRpc.TestConnectionKeepalive/SSL_UnixSocket
I20260927 18:36:37.974588 16807 acceptor_pool.cc:254] collecting diagnostics on the listening RPC socket unix:/tmp/dist-test-taskH4X4Pl/test-tmp/rpc-test-1cadb5c36c9b41c88e25b0f0e0a1b4e8.sock every 8 connection(s)
I20260927 18:36:37.974634 16808 acceptor_pool.cc:254] collecting diagnostics on the listening RPC socket unix:/tmp/dist-test-taskH4X4Pl/test-tmp/rpc-test-1cadb5c36c9b41c88e25b0f0e0a1b4e8.sock every 8 connection(s)
I20260927 18:36:37.974923 16688 rpc-test.cc:488] Connecting to unix:/tmp/dist-test-taskH4X4Pl/test-tmp/rpc-test-1cadb5c36c9b41c88e25b0f0e0a1b4e8.sock
W20260927 18:36:38.466311 16820 connection.cc:196] Error closing socket: Network error: TlsSocket::Close: Broken pipe
[       OK ] Parameters/TestRpc.TestConnectionKeepalive/SSL_UnixSocket (1046 ms)
[ RUN      ] Parameters/TestRpc.TestClientConnectionMetrics/SSL_UnixSocket
I20260927 18:36:39.022418 16832 acceptor_pool.cc:254] collecting diagnostics on the listening RPC socket unix:/tmp/dist-test-taskH4X4Pl/test-tmp/rpc-test-f4268d55ea6447caae9380c5fad8e4db.sock every 8 connection(s)
I20260927 18:36:39.022534 16833 acceptor_pool.cc:254] collecting diagnostics on the listening RPC socket unix:/tmp/dist-test-taskH4X4Pl/test-tmp/rpc-test-f4268d55ea6447caae9380c5fad8e4db.sock every 8 connection(s)
I20260927 18:36:39.022848 16688 rpc-test.cc:569] Connecting to unix:/tmp/dist-test-taskH4X4Pl/test-tmp/rpc-test-f4268d55ea6447caae9380c5fad8e4db.sock
W20260927 18:36:49.560132 16829 connection.cc:196] Error closing socket: Network error: TlsSocket::Close: Broken pipe
[       OK ] Parameters/TestRpc.TestClientConnectionMetrics/SSL_UnixSocket (10550 ms)
[ RUN      ] Parameters/TestRpc.TestCredentialsPolicy/SSL_UnixSocket
I20260927 18:36:49.567924 16855 acceptor_pool.cc:254] collecting diagnostics on the listening RPC socket unix:/tmp/dist-test-taskH4X4Pl/test-tmp/rpc-test-67225e5cfc2545e1af9a65bddabf8dc5.sock every 8 connection(s)
I20260927 18:36:49.568084 16856 acceptor_pool.cc:254] collecting diagnostics on the listening RPC socket unix:/tmp/dist-test-taskH4X4Pl/test-tmp/rpc-test-67225e5cfc2545e1af9a65bddabf8dc5.sock every 8 connection(s)
I20260927 18:36:49.568356 16688 rpc-test.cc:700] Connecting to unix:/tmp/dist-test-taskH4X4Pl/test-tmp/rpc-test-67225e5cfc2545e1af9a65bddabf8dc5.sock
W20260927 18:36:49.594425 16854 connection.cc:196] Error closing socket: Network error: TlsSocket::Close: Broken pipe
[       OK ] Parameters/TestRpc.TestCredentialsPolicy/SSL_UnixSocket (38 ms)
[ RUN      ] Parameters/TestRpc.TestCallLongerThanKeepalive/SSL_UnixSocket
I20260927 18:36:49.614204 16880 acceptor_pool.cc:254] collecting diagnostics on the listening RPC socket unix:/tmp/dist-test-taskH4X4Pl/test-tmp/rpc-test-b669bdc7df9c4e2397a7a17bd16c0c24.sock every 8 connection(s)
I20260927 18:36:49.614269 16881 acceptor_pool.cc:254] collecting diagnostics on the listening RPC socket unix:/tmp/dist-test-taskH4X4Pl/test-tmp/rpc-test-b669bdc7df9c4e2397a7a17bd16c0c24.sock every 8 connection(s)
I20260927 18:36:49.623737 16884 rpc-test-base.h:222] got call: sleep_micros: 3000000 deferred: true
I20260927 18:36:52.624586 16884 rpcz_store.cc:275] Call kudu.rpc.GenericCalculatorService.Sleep from unix:<unnamed> (request call id 0) took 3000 ms. Trace:
I20260927 18:36:52.624717 16884 rpcz_store.cc:276] 0927 18:36:49.623675 (+     0us) service_pool.cc:170] Inserting onto call queue
0927 18:36:49.623721 (+    46us) service_pool.cc:227] Handling call
0927 18:36:52.624564 (+3000843us) inbound_call.cc:173] Queueing success response
Metrics: {}
[       OK ] Parameters/TestRpc.TestCallLongerThanKeepalive/SSL_UnixSocket (3028 ms)
[ RUN      ] Parameters/TestRpc.TestRpcSidecar/SSL_UnixSocket
I20260927 18:36:52.643500 16905 acceptor_pool.cc:254] collecting diagnostics on the listening RPC socket unix:/tmp/dist-test-taskH4X4Pl/test-tmp/rpc-test-84ee40f5003646c1ba9b4700a7e8eeb8.sock every 8 connection(s)
I20260927 18:36:52.643625 16906 acceptor_pool.cc:254] collecting diagnostics on the listening RPC socket unix:/tmp/dist-test-taskH4X4Pl/test-tmp/rpc-test-84ee40f5003646c1ba9b4700a7e8eeb8.sock every 8 connection(s)
W20260927 18:36:52.691298 16902 connection.cc:196] Error closing socket: Network error: TlsSocket::Close: Broken pipe
[       OK ] Parameters/TestRpc.TestRpcSidecar/SSL_UnixSocket (63 ms)
[ RUN      ] Parameters/TestRpc.TestRpcSidecarLimits/SSL_UnixSocket
I20260927 18:36:54.365717 16930 acceptor_pool.cc:254] collecting diagnostics on the listening RPC socket unix:/tmp/dist-test-taskH4X4Pl/test-tmp/rpc-test-fd8c891dddbc4ae4aac7072ffbfad688.sock every 8 connection(s)
I20260927 18:36:54.365756 16931 acceptor_pool.cc:254] collecting diagnostics on the listening RPC socket unix:/tmp/dist-test-taskH4X4Pl/test-tmp/rpc-test-fd8c891dddbc4ae4aac7072ffbfad688.sock every 8 connection(s)
W20260927 18:36:54.381873 16688 serialization.cc:72] Serialized kudu.rpc_test.PushStringsRequestPB (2147483654 bytes) is larger than the maximum configured RPC message size (52428800 bytes). Sending anyway, but peer may reject the data.
W20260927 18:36:54.385401 16927 connection.cc:535] server connection from unix:<unnamed> recv error: Network error: RPC frame had a length of 2147483714, but we only support messages up to 52428800 bytes long.
W20260927 18:36:54.385461 16927 connection.cc:158] shutting down server connection from unix:<unnamed> with pending inbound data: 4/2147483714 bytes received; last active 0 ns ago: status Network error: RPC frame had a length of 2147483714, but we only support messages up to 52428800 bytes long.
W20260927 18:36:54.385720 16943 connection.cc:196] Error closing socket: Network error: TlsSocket::Close: Broken pipe
I20260927 18:36:54.398012 16955 acceptor_pool.cc:254] collecting diagnostics on the listening RPC socket unix:/tmp/dist-test-taskH4X4Pl/test-tmp/rpc-test-fd8c891dddbc4ae4aac7072ffbfad688.sock every 8 connection(s)
I20260927 18:36:54.398139 16956 acceptor_pool.cc:254] collecting diagnostics on the listening RPC socket unix:/tmp/dist-test-taskH4X4Pl/test-tmp/rpc-test-fd8c891dddbc4ae4aac7072ffbfad688.sock every 8 connection(s)
W20260927 18:36:59.225512 16952 connection.cc:577] server connection from unix:<unnamed>: received bad data: 'Corruption: Invalid packet: message had a length of 2147483710, but we only support messages up to 2147483647 bytes
'
W20260927 18:36:59.225915 16968 connection.cc:196] Error closing socket: Network error: TlsSocket::Close: Broken pipe
[       OK ] Parameters/TestRpc.TestRpcSidecarLimits/SSL_UnixSocket (6535 ms)
[ RUN      ] Parameters/TestRpc.TestCallTimeoutDoesntAffectNegotiation/SSL_UnixSocket
I20260927 18:36:59.250700 16980 acceptor_pool.cc:254] collecting diagnostics on the listening RPC socket unix:/tmp/dist-test-taskH4X4Pl/test-tmp/rpc-test-e6e1a0aba67841fca7dd254d30106db4.sock every 8 connection(s)
I20260927 18:36:59.250754 16981 acceptor_pool.cc:254] collecting diagnostics on the listening RPC socket unix:/tmp/dist-test-taskH4X4Pl/test-tmp/rpc-test-e6e1a0aba67841fca7dd254d30106db4.sock every 8 connection(s)
W20260927 18:36:59.262281 16976 negotiation.cc:266] Injecting 500ms delay in negotiation
I20260927 18:36:59.312740 16688 rpc-test-base.h:595] status: Timed out: connection negotiation to unix:/tmp/dist-test-taskH4X4Pl/test-tmp/rpc-test-e6e1a0aba67841fca7dd254d30106db4.sock for RPC Sleep timed out after 0.050s (ON_OUTBOUND_QUEUE), seconds elapsed: 0.0508065
W20260927 18:36:59.767627 16977 connection.cc:196] Error closing socket: Network error: TlsSocket::Close: Broken pipe
[       OK ] Parameters/TestRpc.TestCallTimeoutDoesntAffectNegotiation/SSL_UnixSocket (540 ms)
[ RUN      ] Parameters/TestRpc.TestRpcHandlerLatencyMetric/SSL_UnixSocket
I20260927 18:36:59.792870 17005 acceptor_pool.cc:254] collecting diagnostics on the listening RPC socket unix:/tmp/dist-test-taskH4X4Pl/test-tmp/rpc-test-4822823a6c3845c2abf4e9531727d01c.sock every 8 connection(s)
I20260927 18:36:59.792940 17006 acceptor_pool.cc:254] collecting diagnostics on the listening RPC socket unix:/tmp/dist-test-taskH4X4Pl/test-tmp/rpc-test-4822823a6c3845c2abf4e9531727d01c.sock every 8 connection(s)
I20260927 18:36:59.834385 16688 rpc-test.cc:1236] Sleep() min lat: 20342
I20260927 18:36:59.834450 16688 rpc-test.cc:1237] Sleep() mean lat: 20342
I20260927 18:36:59.834477 16688 rpc-test.cc:1238] Sleep() max lat: 20342
I20260927 18:36:59.834491 16688 rpc-test.cc:1239] Sleep() #calls: 1
[       OK ] Parameters/TestRpc.TestRpcHandlerLatencyMetric/SSL_UnixSocket (67 ms)
[ RUN      ] Parameters/TestRpc.TimedOutOnResponseMetricServiceQueue/SSL_UnixSocket
I20260927 18:36:59.849957 17031 acceptor_pool.cc:254] collecting diagnostics on the listening RPC socket unix:/tmp/dist-test-taskH4X4Pl/test-tmp/rpc-test-825936cc86344b80ab6943d05f7ae5f4.sock every 8 connection(s)
I20260927 18:36:59.849978 17032 acceptor_pool.cc:254] collecting diagnostics on the listening RPC socket unix:/tmp/dist-test-taskH4X4Pl/test-tmp/rpc-test-825936cc86344b80ab6943d05f7ae5f4.sock every 8 connection(s)
W20260927 18:36:59.905529 17033 rpcz_store.cc:267] Call kudu.rpc_test.CalculatorService.Sleep from unix:<unnamed> (request call id 2) took 20 ms (client timeout 20 ms). Trace:
W20260927 18:36:59.905651 17033 rpcz_store.cc:269] 0927 18:36:59.885232 (+     0us) service_pool.cc:170] Inserting onto call queue
0927 18:36:59.905494 (+ 20262us) service_pool.cc:214] Skipping call since client already timed out
0927 18:36:59.905515 (+    21us) inbound_call.cc:173] Queueing failure response
Metrics: {}
W20260927 18:36:59.906392 17028 connection.cc:196] Error closing socket: Network error: TlsSocket::Close: Broken pipe
[       OK ] Parameters/TestRpc.TimedOutOnResponseMetricServiceQueue/SSL_UnixSocket (71 ms)
[ RUN      ] Parameters/TestRpc.RpcPendingConnectionsMetric/SSL_UnixSocket
I20260927 18:36:59.910122 17054 acceptor_pool.cc:254] collecting diagnostics on the listening RPC socket 0.0.0.0:38853 every 8 connection(s)
I20260927 18:36:59.910192 17055 acceptor_pool.cc:254] collecting diagnostics on the listening RPC socket 0.0.0.0:38853 every 8 connection(s)
W20260927 18:36:59.911214 17050 negotiation.cc:337] Failed RPC negotiation. Trace:
0927 18:36:59.910836 (+     0us) reactor.cc:625] Submitting negotiation task for server connection from 127.0.0.1:43992 (local address 127.0.0.1:38853)
0927 18:36:59.910918 (+    82us) server_negotiation.cc:206] Beginning negotiation
0927 18:36:59.910921 (+     3us) server_negotiation.cc:399] Waiting for connection header
0927 18:36:59.911014 (+    93us) negotiation.cc:327] Negotiation complete: Network error: Server connection negotiation failed: server connection from 127.0.0.1:43992: BlockingRecv error: recv got EOF from 127.0.0.1:43992 (error 108)
Metrics: {"server-negotiator.queue_time_us":20}
[       OK ] Parameters/TestRpc.RpcPendingConnectionsMetric/SSL_UnixSocket (14 ms)
[ RUN      ] Parameters/TestRpc.TestRpcContextClientDeadline/SSL_UnixSocket
I20260927 18:36:59.933290 17070 acceptor_pool.cc:254] collecting diagnostics on the listening RPC socket unix:/tmp/dist-test-taskH4X4Pl/test-tmp/rpc-test-24c9163a34b94d0cb685496163d000f4.sock every 8 connection(s)
I20260927 18:36:59.933328 17071 acceptor_pool.cc:254] collecting diagnostics on the listening RPC socket unix:/tmp/dist-test-taskH4X4Pl/test-tmp/rpc-test-24c9163a34b94d0cb685496163d000f4.sock every 8 connection(s)
[       OK ] Parameters/TestRpc.TestRpcContextClientDeadline/SSL_UnixSocket (57 ms)
[ RUN      ] Parameters/TestRpc.TestApplicationFeatureFlagUnsupportedServer/SSL_UnixSocket
I20260927 18:37:00.030501 17095 acceptor_pool.cc:254] collecting diagnostics on the listening RPC socket unix:/tmp/dist-test-taskH4X4Pl/test-tmp/rpc-test-9ae24671364845109cb9fd0e9ece1dc2.sock every 8 connection(s)
I20260927 18:37:00.030539 17096 acceptor_pool.cc:254] collecting diagnostics on the listening RPC socket unix:/tmp/dist-test-taskH4X4Pl/test-tmp/rpc-test-9ae24671364845109cb9fd0e9ece1dc2.sock every 8 connection(s)
W20260927 18:37:00.045584 17092 connection.cc:196] Error closing socket: Network error: TlsSocket::Close: Broken pipe
[       OK ] Parameters/TestRpc.TestApplicationFeatureFlagUnsupportedServer/SSL_UnixSocket (66 ms)
[ RUN      ] Parameters/TestRpc.TestCancellationAsync/SSL_UnixSocket
I20260927 18:37:00.052637 17120 acceptor_pool.cc:254] collecting diagnostics on the listening RPC socket unix:/tmp/dist-test-taskH4X4Pl/test-tmp/rpc-test-c5fc91a4e273429aa961ef3e7a1f6acc.sock every 8 connection(s)
I20260927 18:37:00.052676 17121 acceptor_pool.cc:254] collecting diagnostics on the listening RPC socket unix:/tmp/dist-test-taskH4X4Pl/test-tmp/rpc-test-c5fc91a4e273429aa961ef3e7a1f6acc.sock every 8 connection(s)
I20260927 18:37:00.052951 16688 rpc-test.cc:1716] Connecting to unix:/tmp/dist-test-taskH4X4Pl/test-tmp/rpc-test-c5fc91a4e273429aa961ef3e7a1f6acc.sock
I20260927 18:37:00.068583 16688 test_util.cc:268] Using random seed: 1009071842
I20260927 18:37:00.085903 17124 rpc-test-base.h:240] got call: sleep_micros: 500 pattern: 4294967295 num_repetitions: 2097152 sidecar_idx: 0
I20260927 18:37:00.102866 17123 rpc-test-base.h:240] got call: sleep_micros: 500 pattern: 4294967295 num_repetitions: 2097152 sidecar_idx: 0
I20260927 18:37:00.116937 17122 rpc-test-base.h:240] got call: sleep_micros: 500 pattern: 4294967295 num_repetitions: 2097152 sidecar_idx: 0
I20260927 18:37:00.132576 17124 rpc-test-base.h:240] got call: sleep_micros: 500 pattern: 4294967295 num_repetitions: 2097152 sidecar_idx: 0
I20260927 18:37:00.148491 17122 rpc-test-base.h:240] got call: sleep_micros: 500 pattern: 4294967295 num_repetitions: 2097152 sidecar_idx: 0
I20260927 18:37:00.165036 17124 rpc-test-base.h:240] got call: sleep_micros: 500 pattern: 4294967295 num_repetitions: 2097152 sidecar_idx: 0
I20260927 18:37:00.180843 17122 rpc-test-base.h:240] got call: sleep_micros: 500 pattern: 4294967295 num_repetitions: 2097152 sidecar_idx: 0
W20260927 18:37:00.182467 17117 connection.cc:196] Error closing socket: Network error: TlsSocket::Close: Broken pipe
W20260927 18:37:00.189086 17117 connection.cc:441] server connection from unix:<unnamed> torn down before Call kudu.rpc.GenericCalculatorService.SleepWithSidecar from unix:<unnamed> (request call id 8) could send its response
W20260927 18:37:00.198731 17117 connection.cc:441] server connection from unix:<unnamed> torn down before Call kudu.rpc.GenericCalculatorService.SleepWithSidecar from unix:<unnamed> (request call id 9) could send its response
[       OK ] Parameters/TestRpc.TestCancellationAsync/SSL_UnixSocket (153 ms)
[ RUN      ] Parameters/TestRpc.TestPerformanceBySocketType/SSL_UnixSocket
I20260927 18:37:00.222215 17145 acceptor_pool.cc:254] collecting diagnostics on the listening RPC socket unix:/tmp/dist-test-taskH4X4Pl/test-tmp/rpc-test-f0c6951a91174cb0b67349d10e2f5087.sock every 8 connection(s)
I20260927 18:37:00.222270 17146 acceptor_pool.cc:254] collecting diagnostics on the listening RPC socket unix:/tmp/dist-test-taskH4X4Pl/test-tmp/rpc-test-f0c6951a91174cb0b67349d10e2f5087.sock every 8 connection(s)
I20260927 18:37:00.222589 16688 rpc-test.cc:1846] Connecting to unix:/tmp/dist-test-taskH4X4Pl/test-tmp/rpc-test-f0c6951a91174cb0b67349d10e2f5087.sock
I20260927 18:37:01.817621 16688 rpc-test.cc:1859] Sending 1024MB via ssl-enabled unix socket: real 1.585s	user 1.999s	sys 0.878s
I20260927 18:37:03.406548 16688 rpc-test.cc:1859] Sending 1024MB via ssl-enabled unix socket: real 1.589s	user 1.912s	sys 0.971s
I20260927 18:37:04.915182 16688 rpc-test.cc:1859] Sending 1024MB via ssl-enabled unix socket: real 1.509s	user 1.892s	sys 0.872s
I20260927 18:37:06.438450 16688 rpc-test.cc:1859] Sending 1024MB via ssl-enabled unix socket: real 1.523s	user 1.871s	sys 0.923s
I20260927 18:37:08.001827 16688 rpc-test.cc:1859] Sending 1024MB via ssl-enabled unix socket: real 1.563s	user 1.917s	sys 0.944s
[       OK ] Parameters/TestRpc.TestPerformanceBySocketType/SSL_UnixSocket (7803 ms)
[----------] 20 tests from Parameters/TestRpc (30173 ms total)

[----------] 1 test from Parameters/TestRpcSocketTxRxQueue
[ RUN      ] Parameters/TestRpcSocketTxRxQueue.AcceptorRxQueueSizeMetric/0
I20260927 18:37:08.006579 17170 acceptor_pool.cc:254] collecting diagnostics on the listening RPC socket 0.0.0.0:43157 every 1 connection(s)
I20260927 18:37:08.006665 17171 acceptor_pool.cc:254] collecting diagnostics on the listening RPC socket 0.0.0.0:43157 every 1 connection(s)
W20260927 18:37:08.007531 17166 negotiation.cc:337] Failed RPC negotiation. Trace:
0927 18:37:08.007268 (+     0us) reactor.cc:625] Submitting negotiation task for server connection from 127.0.0.1:55302 (local address 127.0.0.1:43157)
0927 18:37:08.007373 (+   105us) server_negotiation.cc:206] Beginning negotiation
0927 18:37:08.007377 (+     4us) server_negotiation.cc:399] Waiting for connection header
0927 18:37:08.007463 (+    86us) negotiation.cc:327] Negotiation complete: Network error: Server connection negotiation failed: server connection from 127.0.0.1:55302: BlockingRecv error: recv got EOF from 127.0.0.1:55302 (error 108)
Metrics: {"server-negotiator.queue_time_us":42}
[       OK ] Parameters/TestRpcSocketTxRxQueue.AcceptorRxQueueSizeMetric/0 (5 ms)
[----------] 1 test from Parameters/TestRpcSocketTxRxQueue (5 ms total)

[----------] Global test environment tear-down
[==========] 21 tests from 2 test suites ran. (30179 ms total)
[  PASSED  ] 20 tests.
[  FAILED  ] 1 test, listed below:
[  FAILED  ] Parameters/TestRpc.TestCallWithChainCertAndChainCA/SSL_UnixSocket, where GetParam() = (true, true)

 1 FAILED TEST