Parameters/TestRpc.TestCallWithChainCertAndRootCA/SSL_TCP: /data0/somelongdirectorytoavoidrpathissues/src/kudu/src/kudu/rpc/rpc-test.cc:303: Failure
Failed
Bad status: Runtime error: could not verify certificate chain (error with cert: subject=CN = localhost, ST = sadfjas, C = AS, emailAddress = sdflkdsajf, O = lskdfjlsad, OU = sldfkja, issuer=C = AS, ST = ASDfkjdhf, L = lskdjf, O = saldfja, OU = skdjf, CN = localhost, emailAddress = sadjflkadsj): : certificate has expired
Google Test trace:
/data0/somelongdirectorytoavoidrpathissues/src/kudu/src/kudu/rpc/rpc-test.cc:300: Connecting to 0.0.0.0:37297
I20260926 22:05:16.372272 13976 test_util.cc:175] -----------------------------------------------
I20260926 22:05:16.372460 13976 test_util.cc:176] Had fatal failures, leaving test files at /tmp/dist-test-taskohG7r_/test-tmp/rpc-test.1.Parameters_TestRpc.TestCallWithChainCertAndRootCA_SSL_TCP.1790460314784769-13976-0
Note: This is test shard 2 of 8.
[==========] Running 21 tests from 2 test suites.
[----------] Global test environment set-up.
[----------] 1 test from TestRpc
[ RUN ] TestRpc.TestMethodsByName
[ OK ] TestRpc.TestMethodsByName (7 ms)
[----------] 1 test from TestRpc (7 ms total)
[----------] 20 tests from Parameters/TestRpc
[ RUN ] Parameters/TestRpc.TestAcceptorPoolStartStop/SSL_TCP
WARNING: Logging before InitGoogleLogging() is written to STDERR
I20260926 22:05:14.907778 13991 acceptor_pool.cc:254] collecting diagnostics on the listening RPC socket 0.0.0.0:38223 every 8 connection(s)
I20260926 22:05:14.909411 13992 acceptor_pool.cc:254] collecting diagnostics on the listening RPC socket 0.0.0.0:38223 every 8 connection(s)
I20260926 22:05:16.091509 14003 acceptor_pool.cc:254] collecting diagnostics on the listening RPC socket 0.0.0.0:39647 every 8 connection(s)
I20260926 22:05:16.093654 14004 acceptor_pool.cc:254] collecting diagnostics on the listening RPC socket 0.0.0.0:39647 every 8 connection(s)
I20260926 22:05:16.127942 14014 acceptor_pool.cc:254] collecting diagnostics on the listening RPC socket 0.0.0.0:35277 every 8 connection(s)
I20260926 22:05:16.129460 14015 acceptor_pool.cc:254] collecting diagnostics on the listening RPC socket 0.0.0.0:35277 every 8 connection(s)
I20260926 22:05:16.170702 14025 acceptor_pool.cc:254] collecting diagnostics on the listening RPC socket 0.0.0.0:42089 every 8 connection(s)
I20260926 22:05:16.171479 14026 acceptor_pool.cc:254] collecting diagnostics on the listening RPC socket 0.0.0.0:42089 every 8 connection(s)
I20260926 22:05:16.203284 14036 acceptor_pool.cc:254] collecting diagnostics on the listening RPC socket 0.0.0.0:45741 every 8 connection(s)
I20260926 22:05:16.204115 14037 acceptor_pool.cc:254] collecting diagnostics on the listening RPC socket 0.0.0.0:45741 every 8 connection(s)
[ OK ] Parameters/TestRpc.TestAcceptorPoolStartStop/SSL_TCP (1357 ms)
[ RUN ] Parameters/TestRpc.TestCall/SSL_TCP
I20260926 22:05:16.231846 14049 acceptor_pool.cc:254] collecting diagnostics on the listening RPC socket 0.0.0.0:43247 every 8 connection(s)
I20260926 22:05:16.234251 14050 acceptor_pool.cc:254] collecting diagnostics on the listening RPC socket 0.0.0.0:43247 every 8 connection(s)
I20260926 22:05:16.240592 13976 rpc-test.cc:234] Connecting to 0.0.0.0:43247
[ OK ] Parameters/TestRpc.TestCall/SSL_TCP (121 ms)
[ RUN ] Parameters/TestRpc.TestCallWithChainCertAndRootCA/SSL_TCP
I20260926 22:05:16.351392 14074 acceptor_pool.cc:254] collecting diagnostics on the listening RPC socket 0.0.0.0:37297 every 8 connection(s)
I20260926 22:05:16.352164 14075 acceptor_pool.cc:254] collecting diagnostics on the listening RPC socket 0.0.0.0:37297 every 8 connection(s)
/data0/somelongdirectorytoavoidrpathissues/src/kudu/src/kudu/rpc/rpc-test.cc:303: Failure
Failed
Bad status: Runtime error: could not verify certificate chain (error with cert: subject=CN = localhost, ST = sadfjas, C = AS, emailAddress = sdflkdsajf, O = lskdfjlsad, OU = sldfkja, issuer=C = AS, ST = ASDfkjdhf, L = lskdjf, O = saldfja, OU = skdjf, CN = localhost, emailAddress = sadjflkadsj): : certificate has expired
Google Test trace:
/data0/somelongdirectorytoavoidrpathissues/src/kudu/src/kudu/rpc/rpc-test.cc:300: Connecting to 0.0.0.0:37297
I20260926 22:05:16.372272 13976 test_util.cc:175] -----------------------------------------------
I20260926 22:05:16.372460 13976 test_util.cc:176] Had fatal failures, leaving test files at /tmp/dist-test-taskohG7r_/test-tmp/rpc-test.1.Parameters_TestRpc.TestCallWithChainCertAndRootCA_SSL_TCP.1790460314784769-13976-0
[ FAILED ] Parameters/TestRpc.TestCallWithChainCertAndRootCA/SSL_TCP, where GetParam() = (true, false) (42 ms)
[ RUN ] Parameters/TestRpc.TestCallWithBadPasswordProtectedKey/SSL_TCP
[ OK ] Parameters/TestRpc.TestCallWithBadPasswordProtectedKey/SSL_TCP (31 ms)
[ RUN ] Parameters/TestRpc.TestInvalidMethodCall/SSL_TCP
I20260926 22:05:16.426297 14111 acceptor_pool.cc:254] collecting diagnostics on the listening RPC socket 0.0.0.0:43969 every 8 connection(s)
I20260926 22:05:16.427136 14112 acceptor_pool.cc:254] collecting diagnostics on the listening RPC socket 0.0.0.0:43969 every 8 connection(s)
I20260926 22:05:16.430630 13976 rpc-test.cc:406] Connecting to 0.0.0.0:43969
[ OK ] Parameters/TestRpc.TestInvalidMethodCall/SSL_TCP (70 ms)
[ RUN ] Parameters/TestRpc.TestHighFDs/SSL_TCP
I20260926 22:05:16.721010 14136 acceptor_pool.cc:254] collecting diagnostics on the listening RPC socket 0.0.0.0:42891 every 8 connection(s)
I20260926 22:05:16.721855 14137 acceptor_pool.cc:254] collecting diagnostics on the listening RPC socket 0.0.0.0:42891 every 8 connection(s)
[ OK ] Parameters/TestRpc.TestHighFDs/SSL_TCP (297 ms)
[ RUN ] Parameters/TestRpc.TestConnectionAlwaysKeepalive/SSL_TCP
I20260926 22:05:16.803367 14159 acceptor_pool.cc:254] collecting diagnostics on the listening RPC socket 0.0.0.0:44393 every 8 connection(s)
I20260926 22:05:16.804255 14160 acceptor_pool.cc:254] collecting diagnostics on the listening RPC socket 0.0.0.0:44393 every 8 connection(s)
I20260926 22:05:16.807791 13976 rpc-test.cc:532] Connecting to 0.0.0.0:44393
[ OK ] Parameters/TestRpc.TestConnectionAlwaysKeepalive/SSL_TCP (3100 ms)
[ RUN ] Parameters/TestRpc.TestReopenOutboundConnections/SSL_TCP
I20260926 22:05:19.912652 14182 acceptor_pool.cc:254] collecting diagnostics on the listening RPC socket 0.0.0.0:41877 every 8 connection(s)
I20260926 22:05:19.913370 14183 acceptor_pool.cc:254] collecting diagnostics on the listening RPC socket 0.0.0.0:41877 every 8 connection(s)
I20260926 22:05:19.916757 13976 rpc-test.cc:658] Connecting to 0.0.0.0:41877
[ OK ] Parameters/TestRpc.TestReopenOutboundConnections/SSL_TCP (435 ms)
[ RUN ] Parameters/TestRpc.TestConnectionNetworkPlane/SSL_TCP
I20260926 22:05:20.345597 14205 acceptor_pool.cc:254] collecting diagnostics on the listening RPC socket 0.0.0.0:45069 every 8 connection(s)
I20260926 22:05:20.346331 14206 acceptor_pool.cc:254] collecting diagnostics on the listening RPC socket 0.0.0.0:45069 every 8 connection(s)
I20260926 22:05:20.349635 13976 rpc-test.cc:772] Connecting to 0.0.0.0:45069
[ OK ] Parameters/TestRpc.TestConnectionNetworkPlane/SSL_TCP (90 ms)
[ RUN ] Parameters/TestRpc.TestTCPKeepalive/SSL_TCP
I20260926 22:05:20.420688 14230 acceptor_pool.cc:254] collecting diagnostics on the listening RPC socket 0.0.0.0:39091 every 8 connection(s)
I20260926 22:05:20.421446 14231 acceptor_pool.cc:254] collecting diagnostics on the listening RPC socket 0.0.0.0:39091 every 8 connection(s)
I20260926 22:05:20.478020 14234 rpc-test-base.h:222] got call: sleep_micros: 8000000 deferred: true
I20260926 22:05:28.482618 14234 rpcz_store.cc:275] Call kudu.rpc.GenericCalculatorService.Sleep from 127.0.0.1:56362 (request call id 0) took 8004 ms. Trace:
I20260926 22:05:28.483035 14234 rpcz_store.cc:276] 0926 22:05:20.477729 (+ 0us) service_pool.cc:170] Inserting onto call queue
0926 22:05:20.477840 (+ 111us) service_pool.cc:227] Handling call
0926 22:05:28.482454 (+8004614us) inbound_call.cc:173] Queueing success response
Metrics: {}
[ OK ] Parameters/TestRpc.TestTCPKeepalive/SSL_TCP (8097 ms)
[ RUN ] Parameters/TestRpc.TestMaxSmallSidecars/SSL_TCP
I20260926 22:05:28.542821 14256 acceptor_pool.cc:254] collecting diagnostics on the listening RPC socket 0.0.0.0:41785 every 8 connection(s)
I20260926 22:05:28.543485 14257 acceptor_pool.cc:254] collecting diagnostics on the listening RPC socket 0.0.0.0:41785 every 8 connection(s)
[ OK ] Parameters/TestRpc.TestMaxSmallSidecars/SSL_TCP (214 ms)
[ RUN ] Parameters/TestRpc.TestCallTimeout/SSL_TCP
I20260926 22:05:28.737972 14281 acceptor_pool.cc:254] collecting diagnostics on the listening RPC socket 0.0.0.0:34543 every 8 connection(s)
I20260926 22:05:28.738701 14282 acceptor_pool.cc:254] collecting diagnostics on the listening RPC socket 0.0.0.0:34543 every 8 connection(s)
I20260926 22:05:28.757534 13976 rpc-test-base.h:595] status: Timed out: connection negotiation to 0.0.0.0:34543 for RPC Sleep timed out after 0.000s (ON_OUTBOUND_QUEUE), seconds elapsed: 0.0026211
I20260926 22:05:28.766212 14285 rpc-test-base.h:222] got call: sleep_micros: 700000
I20260926 22:05:28.958966 13976 rpc-test-base.h:595] status: Timed out: Sleep RPC to 0.0.0.0:34543 timed out after 0.200s (SENT), seconds elapsed: 0.201048
I20260926 22:05:28.960466 14284 rpc-test-base.h:222] got call: sleep_micros: 2000000
W20260926 22:05:29.466882 14285 rpcz_store.cc:267] Call kudu.rpc.GenericCalculatorService.Sleep from 127.0.0.1:33464 (request call id 1) took 700 ms (client timeout 200 ms). Trace:
W20260926 22:05:29.467207 14285 rpcz_store.cc:269] 0926 22:05:28.766000 (+ 0us) service_pool.cc:170] Inserting onto call queue
0926 22:05:28.766151 (+ 151us) service_pool.cc:227] Handling call
0926 22:05:29.466819 (+700668us) inbound_call.cc:173] Queueing success response
Metrics: {}
I20260926 22:05:30.461390 13976 rpc-test-base.h:595] status: Timed out: Sleep RPC to 0.0.0.0:34543 timed out after 1.500s (SENT), seconds elapsed: 1.50206
W20260926 22:05:30.960948 14284 rpcz_store.cc:267] Call kudu.rpc.GenericCalculatorService.Sleep from 127.0.0.1:33464 (request call id 2) took 2000 ms (client timeout 1500 ms). Trace:
W20260926 22:05:30.961265 14284 rpcz_store.cc:269] 0926 22:05:28.960176 (+ 0us) service_pool.cc:170] Inserting onto call queue
0926 22:05:28.960318 (+ 142us) service_pool.cc:227] Handling call
0926 22:05:30.960895 (+2000577us) inbound_call.cc:173] Queueing success response
Metrics: {}
W20260926 22:05:30.961902 14279 connection.cc:441] server connection from 127.0.0.1:33464 torn down before Call kudu.rpc.GenericCalculatorService.Sleep from 127.0.0.1:33464 (request call id 2) could send its response
[ OK ] Parameters/TestRpc.TestCallTimeout/SSL_TCP (2256 ms)
[ RUN ] Parameters/TestRpc.TestServerShutsDown/SSL_TCP
I20260926 22:05:30.969264 13976 rpc-test.cc:1125] Connecting to 0.0.0.0:40673
W20260926 22:05:30.979627 14298 negotiation.cc:337] Failed RPC negotiation. Trace:
0926 22:05:30.978075 (+ 0us) reactor.cc:625] Submitting negotiation task for client connection to 0.0.0.0:40673 (local address 127.0.0.1:38780)
0926 22:05:30.978521 (+ 446us) negotiation.cc:107] Waiting for socket to connect
0926 22:05:30.978553 (+ 32us) client_negotiation.cc:174] Beginning negotiation
0926 22:05:30.978800 (+ 247us) client_negotiation.cc:252] Sending NEGOTIATE NegotiatePB request
0926 22:05:30.979025 (+ 225us) negotiation.cc:327] Negotiation complete: Network error: Client connection negotiation failed: client connection to 0.0.0.0:40673: BlockingWrite error: write error: Broken pipe (error 32)
Metrics: {"client-negotiator.queue_time_us":120}
[ OK ] Parameters/TestRpc.TestServerShutsDown/SSL_TCP (14 ms)
[ RUN ] Parameters/TestRpc.TimedOutOnResponseMetric/SSL_TCP
I20260926 22:05:31.006826 14315 acceptor_pool.cc:254] collecting diagnostics on the listening RPC socket 0.0.0.0:36411 every 8 connection(s)
I20260926 22:05:31.007879 14316 acceptor_pool.cc:254] collecting diagnostics on the listening RPC socket 0.0.0.0:36411 every 8 connection(s)
W20260926 22:05:31.252522 14319 rpcz_store.cc:267] Call kudu.rpc_test.CalculatorService.Sleep from 127.0.0.1:37936 (request call id 3) took 50 ms (client timeout 25 ms). Trace:
W20260926 22:05:31.252864 14319 rpcz_store.cc:269] 0926 22:05:31.201872 (+ 0us) service_pool.cc:170] Inserting onto call queue
0926 22:05:31.201985 (+ 113us) service_pool.cc:227] Handling call
0926 22:05:31.252436 (+ 50451us) inbound_call.cc:173] Queueing success response
Related trace 'test_child':
Metrics: {"test_sleep_us":50000,"child_traces":[["test_child",{"related_trace_metric":1}]]}
W20260926 22:05:31.312485 14319 rpcz_store.cc:267] Call kudu.rpc_test.CalculatorService.Sleep from 127.0.0.1:37936 (request call id 4) took 50 ms (client timeout 50 ms). Trace:
W20260926 22:05:31.312803 14319 rpcz_store.cc:269] 0926 22:05:31.261917 (+ 0us) service_pool.cc:170] Inserting onto call queue
0926 22:05:31.262050 (+ 133us) service_pool.cc:227] Handling call
0926 22:05:31.312428 (+ 50378us) inbound_call.cc:173] Queueing success response
Related trace 'test_child':
Metrics: {"test_sleep_us":50000,"child_traces":[["test_child",{"related_trace_metric":1}]]}
[ OK ] Parameters/TestRpc.TimedOutOnResponseMetric/SSL_TCP (341 ms)
[ RUN ] Parameters/TestRpc.AcceptorDispatchingTimesMetric/SSL_TCP
I20260926 22:05:31.342550 14340 acceptor_pool.cc:254] collecting diagnostics on the listening RPC socket 0.0.0.0:35197 every 8 connection(s)
I20260926 22:05:31.343288 14341 acceptor_pool.cc:254] collecting diagnostics on the listening RPC socket 0.0.0.0:35197 every 8 connection(s)
W20260926 22:05:31.349869 14336 negotiation.cc:337] Failed RPC negotiation. Trace:
0926 22:05:31.347469 (+ 0us) reactor.cc:625] Submitting negotiation task for server connection from 127.0.0.1:58434 (local address 127.0.0.1:35197)
0926 22:05:31.348392 (+ 923us) server_negotiation.cc:206] Beginning negotiation
0926 22:05:31.348428 (+ 36us) server_negotiation.cc:399] Waiting for connection header
0926 22:05:31.348852 (+ 424us) negotiation.cc:327] Negotiation complete: Network error: Server connection negotiation failed: server connection from 127.0.0.1:58434: BlockingRecv error: recv got EOF from 127.0.0.1:58434 (error 108)
Metrics: {"server-negotiator.queue_time_us":198}
[ OK ] Parameters/TestRpc.AcceptorDispatchingTimesMetric/SSL_TCP (28 ms)
[ RUN ] Parameters/TestRpc.TestRpcCallbackDestroysMessenger/SSL_TCP
[ OK ] Parameters/TestRpc.TestRpcCallbackDestroysMessenger/SSL_TCP (22 ms)
[ RUN ] Parameters/TestRpc.TestApplicationFeatureFlag/SSL_TCP
I20260926 22:05:31.408691 14365 acceptor_pool.cc:254] collecting diagnostics on the listening RPC socket 0.0.0.0:45267 every 8 connection(s)
I20260926 22:05:31.409410 14366 acceptor_pool.cc:254] collecting diagnostics on the listening RPC socket 0.0.0.0:45267 every 8 connection(s)
W20260926 22:05:31.445274 14363 messenger.cc:357] Unable to handle RPC call: Not implemented: call requires unsupported application feature flags: 99
[ OK ] Parameters/TestRpc.TestApplicationFeatureFlag/SSL_TCP (77 ms)
[ RUN ] Parameters/TestRpc.TestCancellation/SSL_TCP
I20260926 22:05:31.484629 14390 acceptor_pool.cc:254] collecting diagnostics on the listening RPC socket 0.0.0.0:40619 every 8 connection(s)
I20260926 22:05:31.485334 14391 acceptor_pool.cc:254] collecting diagnostics on the listening RPC socket 0.0.0.0:40619 every 8 connection(s)
I20260926 22:05:31.488487 13976 rpc-test.cc:1648] Connecting to 0.0.0.0:40619
I20260926 22:05:31.609887 13976 rpc-test-base.h:595] status: Aborted: Sleep RPC to 0.0.0.0:40619 is cancelled in state READY, seconds elapsed: 0.000348308
I20260926 22:05:31.760179 13976 rpc-test-base.h:595] status: Aborted: Sleep RPC to 0.0.0.0:40619 is cancelled in state SENT, seconds elapsed: 0.000954799
I20260926 22:05:31.804378 14393 rpc-test-base.h:222] got call: sleep_micros: 510000
I20260926 22:05:31.923058 13976 rpc-test-base.h:595] status: Aborted: Sleep RPC to 0.0.0.0:40619 is cancelled in state SENT, seconds elapsed: 0.000864746
I20260926 22:05:31.968016 14392 rpc-test-base.h:222] got call: sleep_micros: 510000
I20260926 22:05:32.093434 13976 rpc-test-base.h:595] status: Aborted: Sleep RPC to 0.0.0.0:40619 is cancelled in state SENT, seconds elapsed: 0.000820862
W20260926 22:05:32.137202 14394 rpcz_store.cc:267] Call kudu.rpc.GenericCalculatorService.Sleep from 127.0.0.1:39950 (request call id 11) took 15 ms (client timeout 10 ms). Trace:
W20260926 22:05:32.137530 14394 rpcz_store.cc:269] 0926 22:05:32.121334 (+ 0us) service_pool.cc:170] Inserting onto call queue
0926 22:05:32.136888 (+ 15554us) service_pool.cc:214] Skipping call since client already timed out
0926 22:05:32.137011 (+ 123us) inbound_call.cc:173] Queueing failure response
Metrics: {}
I20260926 22:05:32.138101 14394 rpc-test-base.h:222] got call: sleep_micros: 1500000
W20260926 22:05:32.315235 14393 rpcz_store.cc:267] Call kudu.rpc.GenericCalculatorService.Sleep from 127.0.0.1:39950 (request call id 3) took 512 ms (client timeout 10 ms). Trace:
W20260926 22:05:32.315595 14393 rpcz_store.cc:269] 0926 22:05:31.802432 (+ 0us) service_pool.cc:170] Inserting onto call queue
0926 22:05:31.804292 (+ 1860us) service_pool.cc:227] Handling call
0926 22:05:32.315179 (+510887us) inbound_call.cc:173] Queueing success response
Metrics: {}
W20260926 22:05:32.478785 14392 rpcz_store.cc:267] Call kudu.rpc.GenericCalculatorService.Sleep from 127.0.0.1:39950 (request call id 7) took 511 ms (client timeout 10 ms). Trace:
W20260926 22:05:32.479215 14392 rpcz_store.cc:269] 0926 22:05:31.967739 (+ 0us) service_pool.cc:170] Inserting onto call queue
0926 22:05:31.967935 (+ 196us) service_pool.cc:227] Handling call
0926 22:05:32.478728 (+510793us) inbound_call.cc:173] Queueing success response
Metrics: {}
I20260926 22:05:33.095712 13976 rpc-test-base.h:595] status: Timed out: Sleep RPC to 0.0.0.0:40619 timed out after 1.000s (SENT), seconds elapsed: 1.00188
I20260926 22:05:33.096978 14392 rpc-test-base.h:222] got call: sleep_micros: 1500000
W20260926 22:05:33.638648 14394 rpcz_store.cc:267] Call kudu.rpc.GenericCalculatorService.Sleep from 127.0.0.1:39950 (request call id 12) took 1517 ms (client timeout 1000 ms). Trace:
W20260926 22:05:33.639065 14394 rpcz_store.cc:269] 0926 22:05:32.121662 (+ 0us) service_pool.cc:170] Inserting onto call queue
0926 22:05:32.138058 (+ 16396us) service_pool.cc:227] Handling call
0926 22:05:33.638599 (+1500541us) inbound_call.cc:173] Queueing success response
Metrics: {}
I20260926 22:05:34.097110 13976 rpc-test-base.h:595] status: Timed out: Sleep RPC to 0.0.0.0:40619 timed out after 1.000s (SENT), seconds elapsed: 1.0011
W20260926 22:05:34.098472 14389 messenger.cc:357] Unable to handle RPC call: Not implemented: call requires unsupported application feature flags: 99, 1
W20260926 22:05:34.099906 14389 messenger.cc:357] Unable to handle RPC call: Not implemented: call requires unsupported application feature flags: 99, 1
W20260926 22:05:34.597455 14392 rpcz_store.cc:267] Call kudu.rpc.GenericCalculatorService.Sleep from 127.0.0.1:39950 (request call id 13) took 1500 ms (client timeout 1000 ms). Trace:
W20260926 22:05:34.597767 14392 rpcz_store.cc:269] 0926 22:05:33.096820 (+ 0us) service_pool.cc:170] Inserting onto call queue
0926 22:05:33.096930 (+ 110us) service_pool.cc:227] Handling call
0926 22:05:34.597404 (+1500474us) inbound_call.cc:173] Queueing success response
Metrics: {}
W20260926 22:05:34.598412 14389 connection.cc:441] server connection from 127.0.0.1:39950 torn down before Call kudu.rpc.GenericCalculatorService.Sleep from 127.0.0.1:39950 (request call id 13) could send its response
[ OK ] Parameters/TestRpc.TestCancellation/SSL_TCP (3150 ms)
[ RUN ] Parameters/TestRpc.TestCancellationMultiThreads/SSL_TCP
I20260926 22:05:34.624110 14415 acceptor_pool.cc:254] collecting diagnostics on the listening RPC socket 0.0.0.0:41967 every 8 connection(s)
I20260926 22:05:34.624912 14416 acceptor_pool.cc:254] collecting diagnostics on the listening RPC socket 0.0.0.0:41967 every 8 connection(s)
I20260926 22:05:34.628012 13976 rpc-test.cc:1808] Connecting to 0.0.0.0:41967
I20260926 22:05:34.777019 14429 test_util.cc:268] Using random seed: 138224282
I20260926 22:05:34.778546 14430 test_util.cc:268] Using random seed: 138225810
I20260926 22:05:34.779984 14431 test_util.cc:268] Using random seed: 138227254
I20260926 22:05:34.781517 14432 test_util.cc:268] Using random seed: 138228761
I20260926 22:05:34.783249 14433 test_util.cc:268] Using random seed: 138230356
I20260926 22:05:34.784634 14434 test_util.cc:268] Using random seed: 138231758
I20260926 22:05:34.786244 14435 test_util.cc:268] Using random seed: 138233356
I20260926 22:05:34.787765 14436 test_util.cc:268] Using random seed: 138234907
I20260926 22:05:34.789948 14437 test_util.cc:268] Using random seed: 138237086
I20260926 22:05:34.791643 14438 test_util.cc:268] Using random seed: 138238786
I20260926 22:05:34.793614 14439 test_util.cc:268] Using random seed: 138240292
I20260926 22:05:34.795506 14440 test_util.cc:268] Using random seed: 138242196
I20260926 22:05:34.797317 14441 test_util.cc:268] Using random seed: 138244394
I20260926 22:05:34.799281 14442 test_util.cc:268] Using random seed: 138246389
I20260926 22:05:34.801321 14443 test_util.cc:268] Using random seed: 138248437
I20260926 22:05:34.805166 14445 test_util.cc:268] Using random seed: 138252292
I20260926 22:05:34.805985 14444 test_util.cc:268] Using random seed: 138253138
I20260926 22:05:34.808794 14446 test_util.cc:268] Using random seed: 138255519
I20260926 22:05:34.810835 14447 test_util.cc:268] Using random seed: 138257603
I20260926 22:05:34.813592 14448 test_util.cc:268] Using random seed: 138260317
I20260926 22:05:34.815987 14449 test_util.cc:268] Using random seed: 138263104
I20260926 22:05:34.817737 14450 test_util.cc:268] Using random seed: 138264830
I20260926 22:05:34.819568 14451 test_util.cc:268] Using random seed: 138266705
I20260926 22:05:34.821632 14452 test_util.cc:268] Using random seed: 138268778
I20260926 22:05:34.823356 14453 test_util.cc:268] Using random seed: 138270497
I20260926 22:05:34.826360 14454 test_util.cc:268] Using random seed: 138272971
I20260926 22:05:34.828658 14455 test_util.cc:268] Using random seed: 138275310
I20260926 22:05:34.830384 14456 test_util.cc:268] Using random seed: 138277486
I20260926 22:05:34.832470 14457 test_util.cc:268] Using random seed: 138279577
I20260926 22:05:34.834455 14458 test_util.cc:268] Using random seed: 138281616
[ OK ] Parameters/TestRpc.TestCancellationMultiThreads/SSL_TCP (18417 ms)
[ RUN ] Parameters/TestRpc.TestCallId/SSL_TCP
I20260926 22:05:53.059717 14472 acceptor_pool.cc:254] collecting diagnostics on the listening RPC socket 0.0.0.0:42625 every 8 connection(s)
I20260926 22:05:53.060531 14473 acceptor_pool.cc:254] collecting diagnostics on the listening RPC socket 0.0.0.0:42625 every 8 connection(s)
[ OK ] Parameters/TestRpc.TestCallId/SSL_TCP (105 ms)
[----------] 20 tests from Parameters/TestRpc (38277 ms total)
[----------] Global test environment tear-down
[==========] 21 tests from 2 test suites ran. (38286 ms total)
[ PASSED ] 20 tests.
[ FAILED ] 1 test, listed below:
[ FAILED ] Parameters/TestRpc.TestCallWithChainCertAndRootCA/SSL_TCP, where GetParam() = (true, false)
1 FAILED TEST