Parameters/TestRpc.TestCallWithChainCertAndChainCA/SSL_UnixSocket: /data0/somelongdirectorytoavoidrpathissues/src/kudu/src/kudu/rpc/rpc-test.cc:270: Failure
Failed
Bad status: Runtime error: could not verify certificate chain (error with cert: subject=CN = localhost, ST = sadfjas, C = AS, emailAddress = sdflkdsajf, O = lskdfjlsad, OU = sldfkja, issuer=C = AS, ST = ASDfkjdhf, L = lskdjf, O = saldfja, OU = skdjf, CN = localhost, emailAddress = sadjflkadsj): : certificate has expired
Google Test trace:
/data0/somelongdirectorytoavoidrpathissues/src/kudu/src/kudu/rpc/rpc-test.cc:267: Connecting to unix:/tmp/dist-test-taskAmDysv/test-tmp/rpc-test-7493269dca524901860eb08e5d4c7f0a.sock
I20260925 19:39:16.135493 7885 test_util.cc:175] -----------------------------------------------
I20260925 19:39:16.135708 7885 test_util.cc:176] Had fatal failures, leaving test files at /tmp/dist-test-taskAmDysv/test-tmp/rpc-test.6.Parameters_TestRpc.TestCallWithChainCertAndChainCA_SSL_UnixSocket.1790365154765654-7885-0
Parameters/TestRpc.TimedOutOnResponseMetricServiceQueue/SSL_UnixSocket: /data0/somelongdirectorytoavoidrpathissues/src/kudu/src/kudu/rpc/rpc-test.cc:1427: Failure
Expected equality of these values:
3
latency_histogram->TotalCount()
Which is: 2
W20260925 19:42:00.798257 8223 rpcz_store.cc:269] 0925 19:42:00.776913 (+ 0us) service_pool.cc:170] Inserting onto call queue
0925 19:42:00.797720 (+ 20807us) service_pool.cc:214] Skipping call since client already timed out
0925 19:42:00.797840 (+ 120us) inbound_call.cc:173] Queueing failure response
Metrics: {}
W20260925 19:42:00.801034 8218 connection.cc:196] Error closing socket: Network error: TlsSocket::Close: Broken pipe
I20260925 19:42:00.805859 7885 test_util.cc:175] -----------------------------------------------
I20260925 19:42:00.806010 7885 test_util.cc:176] Had fatal failures, leaving test files at /tmp/dist-test-taskAmDysv/test-tmp/rpc-test.6.Parameters_TestRpc.TimedOutOnResponseMetricServiceQueue_SSL_UnixSocket.1790365154765654-7885-0
Note: This is test shard 7 of 8.
[==========] Running 21 tests from 2 test suites.
[----------] Global test environment set-up.
[----------] 20 tests from Parameters/TestRpc
[ RUN ] Parameters/TestRpc.TestMessengerCreateDestroy/SSL_UnixSocket
WARNING: Logging before InitGoogleLogging() is written to STDERR
I20260925 19:39:14.872885 7885 rpc-test.cc:169] started messenger TestCreateDestroy
[ OK ] Parameters/TestRpc.TestMessengerCreateDestroy/SSL_UnixSocket (1180 ms)
[ RUN ] Parameters/TestRpc.TestNegotiationDeadlock/SSL_UnixSocket
I20260925 19:39:16.026154 7907 acceptor_pool.cc:254] collecting diagnostics on the listening RPC socket unix:/tmp/dist-test-taskAmDysv/test-tmp/rpc-test-7bc3da5a12ae43efa0fce8f3502cafce.sock every 8 connection(s)
I20260925 19:39:16.027772 7908 acceptor_pool.cc:254] collecting diagnostics on the listening RPC socket unix:/tmp/dist-test-taskAmDysv/test-tmp/rpc-test-7bc3da5a12ae43efa0fce8f3502cafce.sock every 8 connection(s)
[ OK ] Parameters/TestRpc.TestNegotiationDeadlock/SSL_UnixSocket (86 ms)
[ RUN ] Parameters/TestRpc.TestCallWithChainCertAndChainCA/SSL_UnixSocket
I20260925 19:39:16.106108 7923 acceptor_pool.cc:254] collecting diagnostics on the listening RPC socket unix:/tmp/dist-test-taskAmDysv/test-tmp/rpc-test-7493269dca524901860eb08e5d4c7f0a.sock every 8 connection(s)
I20260925 19:39:16.108342 7924 acceptor_pool.cc:254] collecting diagnostics on the listening RPC socket unix:/tmp/dist-test-taskAmDysv/test-tmp/rpc-test-7493269dca524901860eb08e5d4c7f0a.sock every 8 connection(s)
/data0/somelongdirectorytoavoidrpathissues/src/kudu/src/kudu/rpc/rpc-test.cc:270: Failure
Failed
Bad status: Runtime error: could not verify certificate chain (error with cert: subject=CN = localhost, ST = sadfjas, C = AS, emailAddress = sdflkdsajf, O = lskdfjlsad, OU = sldfkja, issuer=C = AS, ST = ASDfkjdhf, L = lskdjf, O = saldfja, OU = skdjf, CN = localhost, emailAddress = sadjflkadsj): : certificate has expired
Google Test trace:
/data0/somelongdirectorytoavoidrpathissues/src/kudu/src/kudu/rpc/rpc-test.cc:267: Connecting to unix:/tmp/dist-test-taskAmDysv/test-tmp/rpc-test-7493269dca524901860eb08e5d4c7f0a.sock
I20260925 19:39:16.135493 7885 test_util.cc:175] -----------------------------------------------
I20260925 19:39:16.135708 7885 test_util.cc:176] Had fatal failures, leaving test files at /tmp/dist-test-taskAmDysv/test-tmp/rpc-test.6.Parameters_TestRpc.TestCallWithChainCertAndChainCA_SSL_UnixSocket.1790365154765654-7885-0
[ FAILED ] Parameters/TestRpc.TestCallWithChainCertAndChainCA/SSL_UnixSocket, where GetParam() = (true, true) (48 ms)
[ RUN ] Parameters/TestRpc.TestCallWithPasswordProtectedKey/SSL_UnixSocket
I20260925 19:39:16.165105 7948 acceptor_pool.cc:254] collecting diagnostics on the listening RPC socket unix:/tmp/dist-test-taskAmDysv/test-tmp/rpc-test-82c2396a90ae457a89e4708a99869a83.sock every 8 connection(s)
I20260925 19:39:16.165851 7949 acceptor_pool.cc:254] collecting diagnostics on the listening RPC socket unix:/tmp/dist-test-taskAmDysv/test-tmp/rpc-test-82c2396a90ae457a89e4708a99869a83.sock every 8 connection(s)
W20260925 19:39:16.208527 7945 connection.cc:196] Error closing socket: Network error: TlsSocket::Close: Broken pipe
[ OK ] Parameters/TestRpc.TestCallWithPasswordProtectedKey/SSL_UnixSocket (77 ms)
[ RUN ] Parameters/TestRpc.TestCallToBadServer/SSL_UnixSocket
I20260925 19:39:16.241976 7885 rpc-test.cc:394] Status: Network error: Client connection negotiation failed: client connection to 0.0.0.0:0: connect: Connection refused (error 111)
I20260925 19:39:16.243495 7885 rpc-test.cc:394] Status: Network error: Client connection negotiation failed: client connection to 0.0.0.0:0: connect: Connection refused (error 111)
I20260925 19:39:16.244839 7885 rpc-test.cc:394] Status: Network error: Client connection negotiation failed: client connection to 0.0.0.0:0: connect: Connection refused (error 111)
I20260925 19:39:16.246192 7885 rpc-test.cc:394] Status: Network error: Client connection negotiation failed: client connection to 0.0.0.0:0: connect: Connection refused (error 111)
I20260925 19:39:16.247557 7885 rpc-test.cc:394] Status: Network error: Client connection negotiation failed: client connection to 0.0.0.0:0: connect: Connection refused (error 111)
[ OK ] Parameters/TestRpc.TestCallToBadServer/SSL_UnixSocket (36 ms)
[ RUN ] Parameters/TestRpc.TestWrongService/SSL_UnixSocket
I20260925 19:39:16.271649 7983 acceptor_pool.cc:254] collecting diagnostics on the listening RPC socket unix:/tmp/dist-test-taskAmDysv/test-tmp/rpc-test-42c0f66bd0ef4327bb85af078b85a669.sock every 8 connection(s)
I20260925 19:39:16.272526 7984 acceptor_pool.cc:254] collecting diagnostics on the listening RPC socket unix:/tmp/dist-test-taskAmDysv/test-tmp/rpc-test-42c0f66bd0ef4327bb85af078b85a669.sock every 8 connection(s)
I20260925 19:39:16.308831 7980 messenger.cc:345] service WrongServiceName not registered on TestServer
W20260925 19:39:16.311726 7980 connection.cc:196] Error closing socket: Network error: TlsSocket::Close: Broken pipe
[ OK ] Parameters/TestRpc.TestWrongService/SSL_UnixSocket (66 ms)
[ RUN ] Parameters/TestRpc.TestConnectionKeepalive/SSL_UnixSocket
I20260925 19:39:16.333617 8006 acceptor_pool.cc:254] collecting diagnostics on the listening RPC socket unix:/tmp/dist-test-taskAmDysv/test-tmp/rpc-test-27ce0318148c499595ad5278286fe9ff.sock every 8 connection(s)
I20260925 19:39:16.334329 8007 acceptor_pool.cc:254] collecting diagnostics on the listening RPC socket unix:/tmp/dist-test-taskAmDysv/test-tmp/rpc-test-27ce0318148c499595ad5278286fe9ff.sock every 8 connection(s)
I20260925 19:39:16.337536 7885 rpc-test.cc:488] Connecting to unix:/tmp/dist-test-taskAmDysv/test-tmp/rpc-test-27ce0318148c499595ad5278286fe9ff.sock
W20260925 19:39:16.819970 8019 connection.cc:196] Error closing socket: Network error: TlsSocket::Close: Broken pipe
[ OK ] Parameters/TestRpc.TestConnectionKeepalive/SSL_UnixSocket (1067 ms)
[ RUN ] Parameters/TestRpc.TestClientConnectionMetrics/SSL_UnixSocket
I20260925 19:39:17.412232 8031 acceptor_pool.cc:254] collecting diagnostics on the listening RPC socket unix:/tmp/dist-test-taskAmDysv/test-tmp/rpc-test-c9035c2ce7c24a178ffb5fed18a43228.sock every 8 connection(s)
I20260925 19:39:17.412951 8032 acceptor_pool.cc:254] collecting diagnostics on the listening RPC socket unix:/tmp/dist-test-taskAmDysv/test-tmp/rpc-test-c9035c2ce7c24a178ffb5fed18a43228.sock every 8 connection(s)
I20260925 19:39:17.416229 7885 rpc-test.cc:569] Connecting to unix:/tmp/dist-test-taskAmDysv/test-tmp/rpc-test-c9035c2ce7c24a178ffb5fed18a43228.sock
W20260925 19:41:38.345670 8028 connection.cc:196] Error closing socket: Network error: TlsSocket::Close: Broken pipe
[ OK ] Parameters/TestRpc.TestClientConnectionMetrics/SSL_UnixSocket (140968 ms)
[ RUN ] Parameters/TestRpc.TestCredentialsPolicy/SSL_UnixSocket
I20260925 19:41:38.391816 8068 acceptor_pool.cc:254] collecting diagnostics on the listening RPC socket unix:/tmp/dist-test-taskAmDysv/test-tmp/rpc-test-f56ef140da8d4c8e8ace686fe8f9ddfb.sock every 8 connection(s)
I20260925 19:41:38.392814 8069 acceptor_pool.cc:254] collecting diagnostics on the listening RPC socket unix:/tmp/dist-test-taskAmDysv/test-tmp/rpc-test-f56ef140da8d4c8e8ace686fe8f9ddfb.sock every 8 connection(s)
I20260925 19:41:38.396524 7885 rpc-test.cc:700] Connecting to unix:/tmp/dist-test-taskAmDysv/test-tmp/rpc-test-f56ef140da8d4c8e8ace686fe8f9ddfb.sock
W20260925 19:41:38.443435 8067 connection.cc:196] Error closing socket: Network error: TlsSocket::Close: Broken pipe
[ OK ] Parameters/TestRpc.TestCredentialsPolicy/SSL_UnixSocket (113 ms)
[ RUN ] Parameters/TestRpc.TestCallLongerThanKeepalive/SSL_UnixSocket
I20260925 19:41:38.489928 8093 acceptor_pool.cc:254] collecting diagnostics on the listening RPC socket unix:/tmp/dist-test-taskAmDysv/test-tmp/rpc-test-a06334189c6c46d6b21f965ee50e165e.sock every 8 connection(s)
I20260925 19:41:38.490711 8094 acceptor_pool.cc:254] collecting diagnostics on the listening RPC socket unix:/tmp/dist-test-taskAmDysv/test-tmp/rpc-test-a06334189c6c46d6b21f965ee50e165e.sock every 8 connection(s)
I20260925 19:41:38.541082 8097 rpc-test-base.h:222] got call: sleep_micros: 3000000 deferred: true
I20260925 19:41:41.545702 8097 rpcz_store.cc:275] Call kudu.rpc.GenericCalculatorService.Sleep from unix:<unnamed> (request call id 0) took 3004 ms. Trace:
I20260925 19:41:41.546047 8097 rpcz_store.cc:276] 0925 19:41:38.540891 (+ 0us) service_pool.cc:170] Inserting onto call queue
0925 19:41:38.541019 (+ 128us) service_pool.cc:227] Handling call
0925 19:41:41.545615 (+3004596us) inbound_call.cc:173] Queueing success response
Metrics: {}
W20260925 19:41:41.550511 8090 connection.cc:196] Error closing socket: Network error: TlsSocket::Close: Broken pipe
[ OK ] Parameters/TestRpc.TestCallLongerThanKeepalive/SSL_UnixSocket (3089 ms)
[ RUN ] Parameters/TestRpc.TestRpcSidecar/SSL_UnixSocket
I20260925 19:41:41.587481 8118 acceptor_pool.cc:254] collecting diagnostics on the listening RPC socket unix:/tmp/dist-test-taskAmDysv/test-tmp/rpc-test-62f04fb28ad34721bdd9fbd4c20518dc.sock every 8 connection(s)
I20260925 19:41:41.588296 8119 acceptor_pool.cc:254] collecting diagnostics on the listening RPC socket unix:/tmp/dist-test-taskAmDysv/test-tmp/rpc-test-62f04fb28ad34721bdd9fbd4c20518dc.sock every 8 connection(s)
[ OK ] Parameters/TestRpc.TestRpcSidecar/SSL_UnixSocket (592 ms)
[ RUN ] Parameters/TestRpc.TestRpcSidecarLimits/SSL_UnixSocket
I20260925 19:41:59.308938 8145 acceptor_pool.cc:254] collecting diagnostics on the listening RPC socket unix:/tmp/dist-test-taskAmDysv/test-tmp/rpc-test-25088670e07545ad8bd4b3e6b2aa0ee3.sock every 8 connection(s)
I20260925 19:41:59.309731 8146 acceptor_pool.cc:254] collecting diagnostics on the listening RPC socket unix:/tmp/dist-test-taskAmDysv/test-tmp/rpc-test-25088670e07545ad8bd4b3e6b2aa0ee3.sock every 8 connection(s)
W20260925 19:41:59.328509 7885 serialization.cc:72] Serialized kudu.rpc_test.PushStringsRequestPB (2147483654 bytes) is larger than the maximum configured RPC message size (52428800 bytes). Sending anyway, but peer may reject the data.
W20260925 19:41:59.341154 8142 connection.cc:535] server connection from unix:<unnamed> recv error: Network error: RPC frame had a length of 2147483714, but we only support messages up to 52428800 bytes long.
W20260925 19:41:59.341637 8142 connection.cc:158] shutting down server connection from unix:<unnamed> with pending inbound data: 4/2147483714 bytes received; last active 0 ns ago: status Network error: RPC frame had a length of 2147483714, but we only support messages up to 52428800 bytes long.
W20260925 19:41:59.342679 8158 connection.cc:698] client connection to unix:/tmp/dist-test-taskAmDysv/test-tmp/rpc-test-25088670e07545ad8bd4b3e6b2aa0ee3.sock send error: Network error: failed to write to TLS socket: Broken pipe
W20260925 19:41:59.343392 8158 connection.cc:196] Error closing socket: Network error: TlsSocket::Close: Success
[ OK ] Parameters/TestRpc.TestRpcSidecarLimits/SSL_UnixSocket (17889 ms)
[ RUN ] Parameters/TestRpc.TestCallTimeoutDoesntAffectNegotiation/SSL_UnixSocket
I20260925 19:42:00.060489 8170 acceptor_pool.cc:254] collecting diagnostics on the listening RPC socket unix:/tmp/dist-test-taskAmDysv/test-tmp/rpc-test-3ff6e59b581a40f9b6e9e341d6b29d45.sock every 8 connection(s)
I20260925 19:42:00.061175 8171 acceptor_pool.cc:254] collecting diagnostics on the listening RPC socket unix:/tmp/dist-test-taskAmDysv/test-tmp/rpc-test-3ff6e59b581a40f9b6e9e341d6b29d45.sock every 8 connection(s)
W20260925 19:42:00.082916 8166 negotiation.cc:266] Injecting 500ms delay in negotiation
I20260925 19:42:00.132340 7885 rpc-test-base.h:595] status: Timed out: connection negotiation to unix:/tmp/dist-test-taskAmDysv/test-tmp/rpc-test-3ff6e59b581a40f9b6e9e341d6b29d45.sock for RPC Sleep timed out after 0.050s (ON_OUTBOUND_QUEUE), seconds elapsed: 0.0506017
W20260925 19:42:00.595770 8167 connection.cc:196] Error closing socket: Network error: TlsSocket::Close: Broken pipe
[ OK ] Parameters/TestRpc.TestCallTimeoutDoesntAffectNegotiation/SSL_UnixSocket (560 ms)
[ RUN ] Parameters/TestRpc.TestRpcHandlerLatencyMetric/SSL_UnixSocket
I20260925 19:42:00.629904 8195 acceptor_pool.cc:254] collecting diagnostics on the listening RPC socket unix:/tmp/dist-test-taskAmDysv/test-tmp/rpc-test-a8896aef3acf412baf33964589380b39.sock every 8 connection(s)
I20260925 19:42:00.630685 8196 acceptor_pool.cc:254] collecting diagnostics on the listening RPC socket unix:/tmp/dist-test-taskAmDysv/test-tmp/rpc-test-a8896aef3acf412baf33964589380b39.sock every 8 connection(s)
I20260925 19:42:00.683746 7885 rpc-test.cc:1236] Sleep() min lat: 21755
I20260925 19:42:00.684048 7885 rpc-test.cc:1237] Sleep() mean lat: 21755
I20260925 19:42:00.684275 7885 rpc-test.cc:1238] Sleep() max lat: 21755
I20260925 19:42:00.684509 7885 rpc-test.cc:1239] Sleep() #calls: 1
W20260925 19:42:00.687738 8192 connection.cc:196] Error closing socket: Network error: TlsSocket::Close: Broken pipe
[ OK ] Parameters/TestRpc.TestRpcHandlerLatencyMetric/SSL_UnixSocket (93 ms)
[ RUN ] Parameters/TestRpc.TimedOutOnResponseMetricServiceQueue/SSL_UnixSocket
I20260925 19:42:00.711726 8221 acceptor_pool.cc:254] collecting diagnostics on the listening RPC socket unix:/tmp/dist-test-taskAmDysv/test-tmp/rpc-test-f25e563dc2a54125ac0aa851ddaecbdb.sock every 8 connection(s)
I20260925 19:42:00.712481 8222 acceptor_pool.cc:254] collecting diagnostics on the listening RPC socket unix:/tmp/dist-test-taskAmDysv/test-tmp/rpc-test-f25e563dc2a54125ac0aa851ddaecbdb.sock every 8 connection(s)
W20260925 19:42:00.797894 8223 rpcz_store.cc:267] Call kudu.rpc_test.CalculatorService.Sleep from unix:<unnamed> (request call id 2) took 21 ms (client timeout 20 ms). Trace:
/data0/somelongdirectorytoavoidrpathissues/src/kudu/src/kudu/rpc/rpc-test.cc:1427: Failure
Expected equality of these values:
3
latency_histogram->TotalCount()
Which is: 2
W20260925 19:42:00.798257 8223 rpcz_store.cc:269] 0925 19:42:00.776913 (+ 0us) service_pool.cc:170] Inserting onto call queue
0925 19:42:00.797720 (+ 20807us) service_pool.cc:214] Skipping call since client already timed out
0925 19:42:00.797840 (+ 120us) inbound_call.cc:173] Queueing failure response
Metrics: {}
W20260925 19:42:00.801034 8218 connection.cc:196] Error closing socket: Network error: TlsSocket::Close: Broken pipe
I20260925 19:42:00.805859 7885 test_util.cc:175] -----------------------------------------------
I20260925 19:42:00.806010 7885 test_util.cc:176] Had fatal failures, leaving test files at /tmp/dist-test-taskAmDysv/test-tmp/rpc-test.6.Parameters_TestRpc.TimedOutOnResponseMetricServiceQueue_SSL_UnixSocket.1790365154765654-7885-0
[ FAILED ] Parameters/TestRpc.TimedOutOnResponseMetricServiceQueue/SSL_UnixSocket, where GetParam() = (true, true) (112 ms)
[ RUN ] Parameters/TestRpc.RpcPendingConnectionsMetric/SSL_UnixSocket
I20260925 19:42:00.816390 8244 acceptor_pool.cc:254] collecting diagnostics on the listening RPC socket 0.0.0.0:45777 every 8 connection(s)
I20260925 19:42:00.817149 8245 acceptor_pool.cc:254] collecting diagnostics on the listening RPC socket 0.0.0.0:45777 every 8 connection(s)
W20260925 19:42:00.822790 8240 negotiation.cc:337] Failed RPC negotiation. Trace:
0925 19:42:00.821317 (+ 0us) reactor.cc:625] Submitting negotiation task for server connection from 127.0.0.1:32918 (local address 127.0.0.1:45777)
0925 19:42:00.821812 (+ 495us) server_negotiation.cc:206] Beginning negotiation
0925 19:42:00.821832 (+ 20us) server_negotiation.cc:399] Waiting for connection header
0925 19:42:00.822100 (+ 268us) negotiation.cc:327] Negotiation complete: Network error: Server connection negotiation failed: server connection from 127.0.0.1:32918: BlockingRecv error: recv got EOF from 127.0.0.1:32918 (error 108)
Metrics: {"server-negotiator.queue_time_us":166}
[ OK ] Parameters/TestRpc.RpcPendingConnectionsMetric/SSL_UnixSocket (31 ms)
[ RUN ] Parameters/TestRpc.TestRpcContextClientDeadline/SSL_UnixSocket
I20260925 19:42:00.856325 8260 acceptor_pool.cc:254] collecting diagnostics on the listening RPC socket unix:/tmp/dist-test-taskAmDysv/test-tmp/rpc-test-b5899ebd4c5241549e2ec852b23fa5bf.sock every 8 connection(s)
I20260925 19:42:00.857091 8261 acceptor_pool.cc:254] collecting diagnostics on the listening RPC socket unix:/tmp/dist-test-taskAmDysv/test-tmp/rpc-test-b5899ebd4c5241549e2ec852b23fa5bf.sock every 8 connection(s)
[ OK ] Parameters/TestRpc.TestRpcContextClientDeadline/SSL_UnixSocket (83 ms)
[ RUN ] Parameters/TestRpc.TestApplicationFeatureFlagUnsupportedServer/SSL_UnixSocket
I20260925 19:42:00.938201 8285 acceptor_pool.cc:254] collecting diagnostics on the listening RPC socket unix:/tmp/dist-test-taskAmDysv/test-tmp/rpc-test-6bf5457cd86c44928de0da18f965292b.sock every 8 connection(s)
I20260925 19:42:00.938961 8286 acceptor_pool.cc:254] collecting diagnostics on the listening RPC socket unix:/tmp/dist-test-taskAmDysv/test-tmp/rpc-test-6bf5457cd86c44928de0da18f965292b.sock every 8 connection(s)
[ OK ] Parameters/TestRpc.TestApplicationFeatureFlagUnsupportedServer/SSL_UnixSocket (54 ms)
[ RUN ] Parameters/TestRpc.TestCancellationAsync/SSL_UnixSocket
I20260925 19:42:01.000926 8310 acceptor_pool.cc:254] collecting diagnostics on the listening RPC socket unix:/tmp/dist-test-taskAmDysv/test-tmp/rpc-test-a40c1457e8884d4bad5ee0b18329c994.sock every 8 connection(s)
I20260925 19:42:01.001686 8311 acceptor_pool.cc:254] collecting diagnostics on the listening RPC socket unix:/tmp/dist-test-taskAmDysv/test-tmp/rpc-test-a40c1457e8884d4bad5ee0b18329c994.sock every 8 connection(s)
I20260925 19:42:01.004863 7885 rpc-test.cc:1716] Connecting to unix:/tmp/dist-test-taskAmDysv/test-tmp/rpc-test-a40c1457e8884d4bad5ee0b18329c994.sock
I20260925 19:42:01.028234 7885 test_util.cc:268] Using random seed: -386243984
I20260925 19:42:01.276010 8314 rpc-test-base.h:240] got call: sleep_micros: 500 pattern: 4294967295 num_repetitions: 2097152 sidecar_idx: 0
I20260925 19:42:01.505714 8313 rpc-test-base.h:240] got call: sleep_micros: 500 pattern: 4294967295 num_repetitions: 2097152 sidecar_idx: 0
I20260925 19:42:01.723244 8314 rpc-test-base.h:240] got call: sleep_micros: 500 pattern: 4294967295 num_repetitions: 2097152 sidecar_idx: 0
I20260925 19:42:01.925761 8313 rpc-test-base.h:240] got call: sleep_micros: 500 pattern: 4294967295 num_repetitions: 2097152 sidecar_idx: 0
I20260925 19:42:02.153764 8313 rpc-test-base.h:240] got call: sleep_micros: 500 pattern: 4294967295 num_repetitions: 2097152 sidecar_idx: 0
I20260925 19:42:02.375291 8313 rpc-test-base.h:240] got call: sleep_micros: 500 pattern: 4294967295 num_repetitions: 2097152 sidecar_idx: 0
I20260925 19:42:02.598001 8314 rpc-test-base.h:240] got call: sleep_micros: 500 pattern: 4294967295 num_repetitions: 2097152 sidecar_idx: 0
I20260925 19:42:02.833532 8313 rpc-test-base.h:240] got call: sleep_micros: 500 pattern: 4294967295 num_repetitions: 2097152 sidecar_idx: 0
I20260925 19:42:03.050053 8314 rpc-test-base.h:240] got call: sleep_micros: 500 pattern: 4294967295 num_repetitions: 2097152 sidecar_idx: 0
W20260925 19:42:03.078732 8307 connection.cc:196] Error closing socket: Network error: TlsSocket::Close: Broken pipe
W20260925 19:42:03.187780 8307 connection.cc:441] server connection from unix:<unnamed> torn down before Call kudu.rpc.GenericCalculatorService.SleepWithSidecar from unix:<unnamed> (request call id 9) could send its response
[ OK ] Parameters/TestRpc.TestCancellationAsync/SSL_UnixSocket (2223 ms)
[ RUN ] Parameters/TestRpc.TestPerformanceBySocketType/SSL_UnixSocket
I20260925 19:42:03.298286 8335 acceptor_pool.cc:254] collecting diagnostics on the listening RPC socket unix:/tmp/dist-test-taskAmDysv/test-tmp/rpc-test-36ee29cc3bf94f67ad3578a9779e2850.sock every 8 connection(s)
I20260925 19:42:03.299059 8336 acceptor_pool.cc:254] collecting diagnostics on the listening RPC socket unix:/tmp/dist-test-taskAmDysv/test-tmp/rpc-test-36ee29cc3bf94f67ad3578a9779e2850.sock every 8 connection(s)
I20260925 19:42:03.302201 7885 rpc-test.cc:1846] Connecting to unix:/tmp/dist-test-taskAmDysv/test-tmp/rpc-test-36ee29cc3bf94f67ad3578a9779e2850.sock
I20260925 19:42:25.519903 7885 rpc-test.cc:1859] Sending 1024MB via ssl-enabled unix socket: real 22.189s user 19.920s sys 13.597s
I20260925 19:42:47.520216 7885 rpc-test.cc:1859] Sending 1024MB via ssl-enabled unix socket: real 22.000s user 19.785s sys 13.498s
I20260925 19:43:09.526968 7885 rpc-test.cc:1859] Sending 1024MB via ssl-enabled unix socket: real 22.006s user 19.980s sys 13.328s
I20260925 19:43:31.759696 7885 rpc-test.cc:1859] Sending 1024MB via ssl-enabled unix socket: real 22.232s user 20.380s sys 13.349s
I20260925 19:43:53.582654 7885 rpc-test.cc:1859] Sending 1024MB via ssl-enabled unix socket: real 21.822s user 19.664s sys 13.159s
W20260925 19:43:53.589525 8332 connection.cc:196] Error closing socket: Network error: TlsSocket::Close: Broken pipe
[ OK ] Parameters/TestRpc.TestPerformanceBySocketType/SSL_UnixSocket (110403 ms)
[----------] 20 tests from Parameters/TestRpc (278781 ms total)
[----------] 1 test from Parameters/TestRpcSocketTxRxQueue
[ RUN ] Parameters/TestRpcSocketTxRxQueue.AcceptorRxQueueSizeMetric/0
I20260925 19:43:53.612811 8371 acceptor_pool.cc:254] collecting diagnostics on the listening RPC socket 0.0.0.0:33457 every 1 connection(s)
I20260925 19:43:53.613721 8372 acceptor_pool.cc:254] collecting diagnostics on the listening RPC socket 0.0.0.0:33457 every 1 connection(s)
W20260925 19:43:53.619702 8367 negotiation.cc:337] Failed RPC negotiation. Trace:
0925 19:43:53.617839 (+ 0us) reactor.cc:625] Submitting negotiation task for server connection from 127.0.0.1:37264 (local address 127.0.0.1:33457)
0925 19:43:53.618335 (+ 496us) server_negotiation.cc:206] Beginning negotiation
0925 19:43:53.618359 (+ 24us) server_negotiation.cc:399] Waiting for connection header
0925 19:43:53.618667 (+ 308us) negotiation.cc:327] Negotiation complete: Network error: Server connection negotiation failed: server connection from 127.0.0.1:37264: BlockingRecv error: recv got EOF from 127.0.0.1:37264 (error 108)
Metrics: {"server-negotiator.queue_time_us":142}
[ OK ] Parameters/TestRpcSocketTxRxQueue.AcceptorRxQueueSizeMetric/0 (25 ms)
[----------] 1 test from Parameters/TestRpcSocketTxRxQueue (25 ms total)
[----------] Global test environment tear-down
[==========] 21 tests from 2 test suites ran. (278808 ms total)
[ PASSED ] 19 tests.
[ FAILED ] 2 tests, listed below:
[ FAILED ] Parameters/TestRpc.TestCallWithChainCertAndChainCA/SSL_UnixSocket, where GetParam() = (true, true)
[ FAILED ] Parameters/TestRpc.TimedOutOnResponseMetricServiceQueue/SSL_UnixSocket, where GetParam() = (true, true)
2 FAILED TESTS