Diagnosed failure

Parameters/TestRpc.TestCallWithChainCertAndChainCA/SSL_TCP: /data0/somelongdirectorytoavoidrpathissues/src/kudu/src/kudu/rpc/rpc-test.cc:270: Failure
Failed
Bad status: Runtime error: could not verify certificate chain (error with cert: subject=CN = localhost, ST = sadfjas, C = AS, emailAddress = sdflkdsajf, O = lskdfjlsad, OU = sldfkja, issuer=C = AS, ST = ASDfkjdhf, L = lskdjf, O = saldfja, OU = skdjf, CN = localhost, emailAddress = sadjflkadsj): : certificate has expired
Google Test trace:
/data0/somelongdirectorytoavoidrpathissues/src/kudu/src/kudu/rpc/rpc-test.cc:267: Connecting to 0.0.0.0:35833
I20260928 02:36:12.501639 16946 test_util.cc:175] -----------------------------------------------
I20260928 02:36:12.501684 16946 test_util.cc:176] Had fatal failures, leaving test files at /tmp/dist-test-task29ECHB/test-tmp/rpc-test.5.Parameters_TestRpc.TestCallWithChainCertAndChainCA_SSL_TCP.1790562972430388-16946-0

Full log

Note: This is test shard 6 of 8.
[==========] Running 21 tests from 2 test suites.
[----------] Global test environment set-up.
[----------] 20 tests from Parameters/TestRpc
[ RUN      ] Parameters/TestRpc.TestMessengerCreateDestroy/SSL_TCP
WARNING: Logging before InitGoogleLogging() is written to STDERR
I20260928 02:36:12.451702 16946 rpc-test.cc:169] started messenger TestCreateDestroy
[       OK ] Parameters/TestRpc.TestMessengerCreateDestroy/SSL_TCP (20 ms)
[ RUN      ] Parameters/TestRpc.TestNegotiationDeadlock/SSL_TCP
I20260928 02:36:12.468044 16966 acceptor_pool.cc:254] collecting diagnostics on the listening RPC socket 0.0.0.0:42937 every 8 connection(s)
I20260928 02:36:12.468112 16967 acceptor_pool.cc:254] collecting diagnostics on the listening RPC socket 0.0.0.0:42937 every 8 connection(s)
[       OK ] Parameters/TestRpc.TestNegotiationDeadlock/SSL_TCP (22 ms)
[ RUN      ] Parameters/TestRpc.TestCallWithChainCertAndChainCA/SSL_TCP
I20260928 02:36:12.497816 16983 acceptor_pool.cc:254] collecting diagnostics on the listening RPC socket 0.0.0.0:35833 every 8 connection(s)
I20260928 02:36:12.497880 16982 acceptor_pool.cc:254] collecting diagnostics on the listening RPC socket 0.0.0.0:35833 every 8 connection(s)
/data0/somelongdirectorytoavoidrpathissues/src/kudu/src/kudu/rpc/rpc-test.cc:270: Failure
Failed
Bad status: Runtime error: could not verify certificate chain (error with cert: subject=CN = localhost, ST = sadfjas, C = AS, emailAddress = sdflkdsajf, O = lskdfjlsad, OU = sldfkja, issuer=C = AS, ST = ASDfkjdhf, L = lskdjf, O = saldfja, OU = skdjf, CN = localhost, emailAddress = sadjflkadsj): : certificate has expired
Google Test trace:
/data0/somelongdirectorytoavoidrpathissues/src/kudu/src/kudu/rpc/rpc-test.cc:267: Connecting to 0.0.0.0:35833
I20260928 02:36:12.501639 16946 test_util.cc:175] -----------------------------------------------
I20260928 02:36:12.501684 16946 test_util.cc:176] Had fatal failures, leaving test files at /tmp/dist-test-task29ECHB/test-tmp/rpc-test.5.Parameters_TestRpc.TestCallWithChainCertAndChainCA_SSL_TCP.1790562972430388-16946-0
[  FAILED  ] Parameters/TestRpc.TestCallWithChainCertAndChainCA/SSL_TCP, where GetParam() = (true, false) (26 ms)
[ RUN      ] Parameters/TestRpc.TestCallWithPasswordProtectedKey/SSL_TCP
I20260928 02:36:12.511018 17007 acceptor_pool.cc:254] collecting diagnostics on the listening RPC socket 0.0.0.0:44073 every 8 connection(s)
I20260928 02:36:12.511062 17008 acceptor_pool.cc:254] collecting diagnostics on the listening RPC socket 0.0.0.0:44073 every 8 connection(s)
[       OK ] Parameters/TestRpc.TestCallWithPasswordProtectedKey/SSL_TCP (21 ms)
[ RUN      ] Parameters/TestRpc.TestCallToBadServer/SSL_TCP
I20260928 02:36:12.530208 16946 rpc-test.cc:394] Status: Network error: Client connection negotiation failed: client connection to 0.0.0.0:0: connect: Connection refused (error 111)
I20260928 02:36:12.530573 16946 rpc-test.cc:394] Status: Network error: Client connection negotiation failed: client connection to 0.0.0.0:0: connect: Connection refused (error 111)
I20260928 02:36:12.530851 16946 rpc-test.cc:394] Status: Network error: Client connection negotiation failed: client connection to 0.0.0.0:0: connect: Connection refused (error 111)
I20260928 02:36:12.531102 16946 rpc-test.cc:394] Status: Network error: Client connection negotiation failed: client connection to 0.0.0.0:0: connect: Connection refused (error 111)
I20260928 02:36:12.531330 16946 rpc-test.cc:394] Status: Network error: Client connection negotiation failed: client connection to 0.0.0.0:0: connect: Connection refused (error 111)
[       OK ] Parameters/TestRpc.TestCallToBadServer/SSL_TCP (8 ms)
[ RUN      ] Parameters/TestRpc.TestWrongService/SSL_TCP
I20260928 02:36:12.537322 17043 acceptor_pool.cc:254] collecting diagnostics on the listening RPC socket 0.0.0.0:43363 every 8 connection(s)
I20260928 02:36:12.537318 17042 acceptor_pool.cc:254] collecting diagnostics on the listening RPC socket 0.0.0.0:43363 every 8 connection(s)
I20260928 02:36:12.561220 17040 messenger.cc:345] service WrongServiceName not registered on TestServer
[       OK ] Parameters/TestRpc.TestWrongService/SSL_TCP (30 ms)
[ RUN      ] Parameters/TestRpc.TestConnectionKeepalive/SSL_TCP
I20260928 02:36:12.588001 17065 acceptor_pool.cc:254] collecting diagnostics on the listening RPC socket 0.0.0.0:34081 every 8 connection(s)
I20260928 02:36:12.588071 17066 acceptor_pool.cc:254] collecting diagnostics on the listening RPC socket 0.0.0.0:34081 every 8 connection(s)
I20260928 02:36:12.588227 16946 rpc-test.cc:488] Connecting to 0.0.0.0:34081
[       OK ] Parameters/TestRpc.TestConnectionKeepalive/SSL_TCP (1048 ms)
[ RUN      ] Parameters/TestRpc.TestClientConnectionMetrics/SSL_TCP
I20260928 02:36:13.623347 17090 acceptor_pool.cc:254] collecting diagnostics on the listening RPC socket 0.0.0.0:46881 every 8 connection(s)
I20260928 02:36:13.623382 17091 acceptor_pool.cc:254] collecting diagnostics on the listening RPC socket 0.0.0.0:46881 every 8 connection(s)
I20260928 02:36:13.623565 16946 rpc-test.cc:569] Connecting to 0.0.0.0:46881
[       OK ] Parameters/TestRpc.TestClientConnectionMetrics/SSL_TCP (9511 ms)
[ RUN      ] Parameters/TestRpc.TestCredentialsPolicy/SSL_TCP
I20260928 02:36:23.131170 17113 acceptor_pool.cc:254] collecting diagnostics on the listening RPC socket 0.0.0.0:32989 every 8 connection(s)
I20260928 02:36:23.131214 17114 acceptor_pool.cc:254] collecting diagnostics on the listening RPC socket 0.0.0.0:32989 every 8 connection(s)
I20260928 02:36:23.131392 16946 rpc-test.cc:700] Connecting to 0.0.0.0:32989
[       OK ] Parameters/TestRpc.TestCredentialsPolicy/SSL_TCP (45 ms)
[ RUN      ] Parameters/TestRpc.TestCallLongerThanKeepalive/SSL_TCP
I20260928 02:36:23.176441 17138 acceptor_pool.cc:254] collecting diagnostics on the listening RPC socket 0.0.0.0:41937 every 8 connection(s)
I20260928 02:36:23.176491 17139 acceptor_pool.cc:254] collecting diagnostics on the listening RPC socket 0.0.0.0:41937 every 8 connection(s)
I20260928 02:36:23.187434 17142 rpc-test-base.h:222] got call: sleep_micros: 3000000 deferred: true
I20260928 02:36:26.188133 17142 rpcz_store.cc:275] Call kudu.rpc.GenericCalculatorService.Sleep from 127.0.0.1:43076 (request call id 0) took 3000 ms. Trace:
I20260928 02:36:26.188235 17142 rpcz_store.cc:276] 0928 02:36:23.187375 (+     0us) service_pool.cc:170] Inserting onto call queue
0928 02:36:23.187410 (+    35us) service_pool.cc:227] Handling call
0928 02:36:26.188117 (+3000707us) inbound_call.cc:173] Queueing success response
Metrics: {}
[       OK ] Parameters/TestRpc.TestCallLongerThanKeepalive/SSL_TCP (3022 ms)
[ RUN      ] Parameters/TestRpc.TestRpcSidecar/SSL_TCP
I20260928 02:36:26.215770 17163 acceptor_pool.cc:254] collecting diagnostics on the listening RPC socket 0.0.0.0:38107 every 8 connection(s)
I20260928 02:36:26.215819 17164 acceptor_pool.cc:254] collecting diagnostics on the listening RPC socket 0.0.0.0:38107 every 8 connection(s)
[       OK ] Parameters/TestRpc.TestRpcSidecar/SSL_TCP (64 ms)
[ RUN      ] Parameters/TestRpc.TestRpcSidecarLimits/SSL_TCP
I20260928 02:36:27.843050 17188 acceptor_pool.cc:254] collecting diagnostics on the listening RPC socket 0.0.0.0:43053 every 8 connection(s)
I20260928 02:36:27.843071 17189 acceptor_pool.cc:254] collecting diagnostics on the listening RPC socket 0.0.0.0:43053 every 8 connection(s)
W20260928 02:36:27.855623 16946 serialization.cc:72] Serialized kudu.rpc_test.PushStringsRequestPB (2147483654 bytes) is larger than the maximum configured RPC message size (52428800 bytes). Sending anyway, but peer may reject the data.
W20260928 02:36:27.858853 17187 connection.cc:535] server connection from 127.0.0.1:57492 recv error: Network error: RPC frame had a length of 2147483714, but we only support messages up to 52428800 bytes long.
W20260928 02:36:27.858923 17187 connection.cc:158] shutting down server connection from 127.0.0.1:57492 with pending inbound data: 4/2147483714 bytes received; last active 0 ns ago: status Network error: RPC frame had a length of 2147483714, but we only support messages up to 52428800 bytes long.
W20260928 02:36:27.859169 17201 connection.cc:196] Error closing socket: Network error: TlsSocket::Close: Connection reset by peer
I20260928 02:36:27.873935 17214 acceptor_pool.cc:254] collecting diagnostics on the listening RPC socket 0.0.0.0:43241 every 8 connection(s)
I20260928 02:36:27.873965 17213 acceptor_pool.cc:254] collecting diagnostics on the listening RPC socket 0.0.0.0:43241 every 8 connection(s)
W20260928 02:36:31.468010 17210 connection.cc:577] server connection from 127.0.0.1:39372: received bad data: 'Corruption: Invalid packet: message had a length of 2147483710, but we only support messages up to 2147483647 bytes
'
[       OK ] Parameters/TestRpc.TestRpcSidecarLimits/SSL_TCP (5215 ms)
[ RUN      ] Parameters/TestRpc.TestCallTimeoutDoesntAffectNegotiation/SSL_TCP
I20260928 02:36:31.494761 17238 acceptor_pool.cc:254] collecting diagnostics on the listening RPC socket 0.0.0.0:36193 every 8 connection(s)
I20260928 02:36:31.494863 17239 acceptor_pool.cc:254] collecting diagnostics on the listening RPC socket 0.0.0.0:36193 every 8 connection(s)
W20260928 02:36:31.514242 17234 negotiation.cc:266] Injecting 500ms delay in negotiation
I20260928 02:36:31.564522 16946 rpc-test-base.h:595] status: Timed out: connection negotiation to 0.0.0.0:36193 for RPC Sleep timed out after 0.050s (ON_OUTBOUND_QUEUE), seconds elapsed: 0.0507329
[       OK ] Parameters/TestRpc.TestCallTimeoutDoesntAffectNegotiation/SSL_TCP (549 ms)
[ RUN      ] Parameters/TestRpc.TestRpcHandlerLatencyMetric/SSL_TCP
I20260928 02:36:32.057605 17264 acceptor_pool.cc:254] collecting diagnostics on the listening RPC socket 0.0.0.0:46667 every 8 connection(s)
I20260928 02:36:32.057607 17263 acceptor_pool.cc:254] collecting diagnostics on the listening RPC socket 0.0.0.0:46667 every 8 connection(s)
I20260928 02:36:32.110057 16946 rpc-test.cc:1236] Sleep() min lat: 20319
I20260928 02:36:32.110128 16946 rpc-test.cc:1237] Sleep() mean lat: 20319
I20260928 02:36:32.110154 16946 rpc-test.cc:1238] Sleep() max lat: 20319
I20260928 02:36:32.110169 16946 rpc-test.cc:1239] Sleep() #calls: 1
[       OK ] Parameters/TestRpc.TestRpcHandlerLatencyMetric/SSL_TCP (91 ms)
[ RUN      ] Parameters/TestRpc.TimedOutOnResponseMetricServiceQueue/SSL_TCP
I20260928 02:36:32.140735 17289 acceptor_pool.cc:254] collecting diagnostics on the listening RPC socket 0.0.0.0:36463 every 8 connection(s)
I20260928 02:36:32.140740 17290 acceptor_pool.cc:254] collecting diagnostics on the listening RPC socket 0.0.0.0:36463 every 8 connection(s)
W20260928 02:36:32.190745 17291 rpcz_store.cc:267] Call kudu.rpc_test.CalculatorService.Sleep from 127.0.0.1:49332 (request call id 2) took 20 ms (client timeout 20 ms). Trace:
W20260928 02:36:32.190874 17291 rpcz_store.cc:269] 0928 02:36:32.170513 (+     0us) service_pool.cc:170] Inserting onto call queue
0928 02:36:32.190721 (+ 20208us) service_pool.cc:214] Skipping call since client already timed out
0928 02:36:32.190731 (+    10us) inbound_call.cc:173] Queueing failure response
Metrics: {}
[       OK ] Parameters/TestRpc.TimedOutOnResponseMetricServiceQueue/SSL_TCP (80 ms)
[ RUN      ] Parameters/TestRpc.RpcPendingConnectionsMetric/SSL_TCP
I20260928 02:36:32.194160 17312 acceptor_pool.cc:254] collecting diagnostics on the listening RPC socket 0.0.0.0:40203 every 8 connection(s)
I20260928 02:36:32.194224 17313 acceptor_pool.cc:254] collecting diagnostics on the listening RPC socket 0.0.0.0:40203 every 8 connection(s)
W20260928 02:36:32.194798 17308 negotiation.cc:337] Failed RPC negotiation. Trace:
0928 02:36:32.194628 (+     0us) reactor.cc:625] Submitting negotiation task for server connection from 127.0.0.1:40786 (local address 127.0.0.1:40203)
0928 02:36:32.194685 (+    57us) server_negotiation.cc:206] Beginning negotiation
0928 02:36:32.194686 (+     1us) server_negotiation.cc:399] Waiting for connection header
0928 02:36:32.194752 (+    66us) negotiation.cc:327] Negotiation complete: Network error: Server connection negotiation failed: server connection from 127.0.0.1:40786: BlockingRecv error: recv got EOF from 127.0.0.1:40786 (error 108)
Metrics: {"server-negotiator.queue_time_us":28}
[       OK ] Parameters/TestRpc.RpcPendingConnectionsMetric/SSL_TCP (13 ms)
[ RUN      ] Parameters/TestRpc.TestRpcContextClientDeadline/SSL_TCP
I20260928 02:36:32.211678 17328 acceptor_pool.cc:254] collecting diagnostics on the listening RPC socket 0.0.0.0:33179 every 8 connection(s)
I20260928 02:36:32.211680 17329 acceptor_pool.cc:254] collecting diagnostics on the listening RPC socket 0.0.0.0:33179 every 8 connection(s)
[       OK ] Parameters/TestRpc.TestRpcContextClientDeadline/SSL_TCP (46 ms)
[ RUN      ] Parameters/TestRpc.TestApplicationFeatureFlagUnsupportedServer/SSL_TCP
I20260928 02:36:32.259708 17353 acceptor_pool.cc:254] collecting diagnostics on the listening RPC socket 0.0.0.0:35547 every 8 connection(s)
I20260928 02:36:32.259748 17354 acceptor_pool.cc:254] collecting diagnostics on the listening RPC socket 0.0.0.0:35547 every 8 connection(s)
[       OK ] Parameters/TestRpc.TestApplicationFeatureFlagUnsupportedServer/SSL_TCP (26 ms)
[ RUN      ] Parameters/TestRpc.TestCancellationAsync/SSL_TCP
I20260928 02:36:32.303507 17378 acceptor_pool.cc:254] collecting diagnostics on the listening RPC socket 0.0.0.0:33951 every 8 connection(s)
I20260928 02:36:32.303556 17379 acceptor_pool.cc:254] collecting diagnostics on the listening RPC socket 0.0.0.0:33951 every 8 connection(s)
I20260928 02:36:32.303731 16946 rpc-test.cc:1716] Connecting to 0.0.0.0:33951
I20260928 02:36:32.310288 16946 test_util.cc:268] Using random seed: -283457522
I20260928 02:36:32.330227 17382 rpc-test-base.h:240] got call: sleep_micros: 500 pattern: 4294967295 num_repetitions: 2097152 sidecar_idx: 0
I20260928 02:36:32.345548 17382 rpc-test-base.h:240] got call: sleep_micros: 500 pattern: 4294967295 num_repetitions: 2097152 sidecar_idx: 0
I20260928 02:36:32.362787 17382 rpc-test-base.h:240] got call: sleep_micros: 500 pattern: 4294967295 num_repetitions: 2097152 sidecar_idx: 0
I20260928 02:36:32.374946 17382 rpc-test-base.h:240] got call: sleep_micros: 500 pattern: 4294967295 num_repetitions: 2097152 sidecar_idx: 0
I20260928 02:36:32.387825 17382 rpc-test-base.h:240] got call: sleep_micros: 500 pattern: 4294967295 num_repetitions: 2097152 sidecar_idx: 0
I20260928 02:36:32.400971 17382 rpc-test-base.h:240] got call: sleep_micros: 500 pattern: 4294967295 num_repetitions: 2097152 sidecar_idx: 0
I20260928 02:36:32.413079 17382 rpc-test-base.h:240] got call: sleep_micros: 500 pattern: 4294967295 num_repetitions: 2097152 sidecar_idx: 0
I20260928 02:36:32.426266 17382 rpc-test-base.h:240] got call: sleep_micros: 500 pattern: 4294967295 num_repetitions: 2097152 sidecar_idx: 0
W20260928 02:36:32.429333 17376 connection.cc:441] server connection from 127.0.0.1:53950 torn down before Call kudu.rpc.GenericCalculatorService.SleepWithSidecar from 127.0.0.1:53950 (request call id 9) could send its response
[       OK ] Parameters/TestRpc.TestCancellationAsync/SSL_TCP (150 ms)
[ RUN      ] Parameters/TestRpc.TestPerformanceBySocketType/SSL_TCP
I20260928 02:36:32.446928 17403 acceptor_pool.cc:254] collecting diagnostics on the listening RPC socket 0.0.0.0:34177 every 8 connection(s)
I20260928 02:36:32.446985 17404 acceptor_pool.cc:254] collecting diagnostics on the listening RPC socket 0.0.0.0:34177 every 8 connection(s)
I20260928 02:36:32.447134 16946 rpc-test.cc:1846] Connecting to 0.0.0.0:34177
I20260928 02:36:34.078647 16946 rpc-test.cc:1859] Sending 1024MB via ssl-enabled tcp socket: real 1.623s	user 1.382s	sys 1.502s
I20260928 02:36:35.720786 16946 rpc-test.cc:1859] Sending 1024MB via ssl-enabled tcp socket: real 1.642s	user 1.409s	sys 1.492s
I20260928 02:36:37.258888 16946 rpc-test.cc:1859] Sending 1024MB via ssl-enabled tcp socket: real 1.538s	user 1.328s	sys 1.432s
I20260928 02:36:38.918408 16946 rpc-test.cc:1859] Sending 1024MB via ssl-enabled tcp socket: real 1.659s	user 1.527s	sys 1.411s
I20260928 02:36:40.576763 16946 rpc-test.cc:1859] Sending 1024MB via ssl-enabled tcp socket: real 1.658s	user 1.393s	sys 1.565s
[       OK ] Parameters/TestRpc.TestPerformanceBySocketType/SSL_TCP (8147 ms)
[----------] 20 tests from Parameters/TestRpc (28145 ms total)

[----------] 1 test from Parameters/TestRpcSocketTxRxQueue
[ RUN      ] Parameters/TestRpcSocketTxRxQueue.OverCapacity/0
W20260928 02:36:40.844120 17429 negotiation.cc:337] Failed RPC negotiation. Trace:
0928 02:36:40.581008 (+     0us) reactor.cc:625] Submitting negotiation task for client connection to 0.0.0.0:38319 (local address 127.0.0.1:39478)
0928 02:36:40.581062 (+    54us) negotiation.cc:107] Waiting for socket to connect
0928 02:36:40.581072 (+    10us) client_negotiation.cc:174] Beginning negotiation
0928 02:36:40.581113 (+    41us) client_negotiation.cc:252] Sending NEGOTIATE NegotiatePB request
0928 02:36:40.843939 (+262826us) negotiation.cc:327] Negotiation complete: Network error: Client connection negotiation failed: client connection to 0.0.0.0:38319: BlockingRecv error: recv error from unknown peer: Transport endpoint is not connected (error 107)
Metrics: {"client-negotiator.queue_time_us":32}
W20260928 02:36:40.844125 17420 negotiation.cc:337] Failed RPC negotiation. Trace:
0928 02:36:40.580137 (+     0us) reactor.cc:625] Submitting negotiation task for client connection to 0.0.0.0:38319 (local address 127.0.0.1:39470)
0928 02:36:40.580174 (+    37us) negotiation.cc:107] Waiting for socket to connect
0928 02:36:40.580183 (+     9us) client_negotiation.cc:174] Beginning negotiation
0928 02:36:40.580227 (+    44us) client_negotiation.cc:252] Sending NEGOTIATE NegotiatePB request
0928 02:36:40.843938 (+263711us) negotiation.cc:327] Negotiation complete: Network error: Client connection negotiation failed: client connection to 0.0.0.0:38319: BlockingRecv error: recv error from unknown peer: Transport endpoint is not connected (error 107)
Metrics: {"client-negotiator.queue_time_us":17}
W20260928 02:36:40.844130 17456 negotiation.cc:337] Failed RPC negotiation. Trace:
0928 02:36:40.583693 (+     0us) reactor.cc:625] Submitting negotiation task for client connection to 0.0.0.0:38319 (local address 127.0.0.1:39510)
0928 02:36:40.583733 (+    40us) negotiation.cc:107] Waiting for socket to connect
0928 02:36:40.583743 (+    10us) client_negotiation.cc:174] Beginning negotiation
0928 02:36:40.583787 (+    44us) client_negotiation.cc:252] Sending NEGOTIATE NegotiatePB request
0928 02:36:40.843937 (+260150us) negotiation.cc:327] Negotiation complete: Network error: Client connection negotiation failed: client connection to 0.0.0.0:38319: BlockingRecv error: recv error from unknown peer: Transport endpoint is not connected (error 107)
Metrics: {"client-negotiator.queue_time_us":18}
W20260928 02:36:40.844331 17438 negotiation.cc:337] Failed RPC negotiation. Trace:
0928 02:36:40.581959 (+     0us) reactor.cc:625] Submitting negotiation task for client connection to 0.0.0.0:38319 (local address 127.0.0.1:39486)
0928 02:36:40.582000 (+    41us) negotiation.cc:107] Waiting for socket to connect
0928 02:36:40.582009 (+     9us) client_negotiation.cc:174] Beginning negotiation
0928 02:36:40.582057 (+    48us) client_negotiation.cc:252] Sending NEGOTIATE NegotiatePB request
0928 02:36:40.843937 (+261880us) negotiation.cc:327] Negotiation complete: Network error: Client connection negotiation failed: client connection to 0.0.0.0:38319: BlockingRecv error: recv error from unknown peer: Transport endpoint is not connected (error 107)
Metrics: {"client-negotiator.queue_time_us":17}
W20260928 02:36:40.844430 17465 negotiation.cc:337] Failed RPC negotiation. Trace:
0928 02:36:40.584513 (+     0us) reactor.cc:625] Submitting negotiation task for client connection to 0.0.0.0:38319 (local address 127.0.0.1:39526)
0928 02:36:40.584545 (+    32us) negotiation.cc:107] Waiting for socket to connect
0928 02:36:40.584553 (+     8us) client_negotiation.cc:174] Beginning negotiation
0928 02:36:40.584588 (+    35us) client_negotiation.cc:252] Sending NEGOTIATE NegotiatePB request
0928 02:36:40.844196 (+259608us) negotiation.cc:327] Negotiation complete: Network error: Client connection negotiation failed: client connection to 0.0.0.0:38319: BlockingRecv error: recv error from unknown peer: Transport endpoint is not connected (error 107)
Metrics: {"client-negotiator.queue_time_us":15}
W20260928 02:36:40.844130 17447 negotiation.cc:337] Failed RPC negotiation. Trace:
0928 02:36:40.582753 (+     0us) reactor.cc:625] Submitting negotiation task for client connection to 0.0.0.0:38319 (local address 127.0.0.1:39498)
0928 02:36:40.582843 (+    90us) negotiation.cc:107] Waiting for socket to connect
0928 02:36:40.582851 (+     8us) client_negotiation.cc:174] Beginning negotiation
0928 02:36:40.582891 (+    40us) client_negotiation.cc:252] Sending NEGOTIATE NegotiatePB request
0928 02:36:40.843993 (+261102us) negotiation.cc:327] Negotiation complete: Network error: Client connection negotiation failed: client connection to 0.0.0.0:38319: BlockingRecv error: recv error from unknown peer: Transport endpoint is not connected (error 107)
Metrics: {"client-negotiator.queue_time_us":70}
[       OK ] Parameters/TestRpcSocketTxRxQueue.OverCapacity/0 (1042 ms)
[----------] 1 test from Parameters/TestRpcSocketTxRxQueue (1043 ms total)

[----------] Global test environment tear-down
[==========] 21 tests from 2 test suites ran. (29188 ms total)
[  PASSED  ] 20 tests.
[  FAILED  ] 1 test, listed below:
[  FAILED  ] Parameters/TestRpc.TestCallWithChainCertAndChainCA/SSL_TCP, where GetParam() = (true, false)

 1 FAILED TEST