Diagnosed failure
Parameters/TestRpc.TestCallWithChainCertAndChainCA/SSL_TCP: /data0/somelongdirectorytoavoidrpathissues/src/kudu/src/kudu/rpc/rpc-test.cc:270: Failure
Failed
Bad status: Runtime error: could not verify certificate chain (error with cert: subject=CN = localhost, ST = sadfjas, C = AS, emailAddress = sdflkdsajf, O = lskdfjlsad, OU = sldfkja, issuer=C = AS, ST = ASDfkjdhf, L = lskdjf, O = saldfja, OU = skdjf, CN = localhost, emailAddress = sadjflkadsj): : certificate has expired
Google Test trace:
/data0/somelongdirectorytoavoidrpathissues/src/kudu/src/kudu/rpc/rpc-test.cc:267: Connecting to 0.0.0.0:44071
I20260924 03:09:16.242456 3040 test_util.cc:175] -----------------------------------------------
I20260924 03:09:16.242529 3040 test_util.cc:176] Had fatal failures, leaving test files at /tmp/dist-test-taskQ5R1rY/test-tmp/rpc-test.5.Parameters_TestRpc.TestCallWithChainCertAndChainCA_SSL_TCP.1790219356126631-3040-0
Full log
Note: This is test shard 6 of 8.
[==========] Running 21 tests from 2 test suites.
[----------] Global test environment set-up.
[----------] 20 tests from Parameters/TestRpc
[ RUN ] Parameters/TestRpc.TestMessengerCreateDestroy/SSL_TCP
WARNING: Logging before InitGoogleLogging() is written to STDERR
I20260924 03:09:16.181421 3040 rpc-test.cc:169] started messenger TestCreateDestroy
[ OK ] Parameters/TestRpc.TestMessengerCreateDestroy/SSL_TCP (38 ms)
[ RUN ] Parameters/TestRpc.TestNegotiationDeadlock/SSL_TCP
I20260924 03:09:16.193812 3060 acceptor_pool.cc:254] collecting diagnostics on the listening RPC socket 0.0.0.0:41135 every 8 connection(s)
I20260924 03:09:16.194082 3061 acceptor_pool.cc:254] collecting diagnostics on the listening RPC socket 0.0.0.0:41135 every 8 connection(s)
[ OK ] Parameters/TestRpc.TestNegotiationDeadlock/SSL_TCP (28 ms)
[ RUN ] Parameters/TestRpc.TestCallWithChainCertAndChainCA/SSL_TCP
I20260924 03:09:16.232009 3076 acceptor_pool.cc:254] collecting diagnostics on the listening RPC socket 0.0.0.0:44071 every 8 connection(s)
I20260924 03:09:16.232328 3077 acceptor_pool.cc:254] collecting diagnostics on the listening RPC socket 0.0.0.0:44071 every 8 connection(s)
/data0/somelongdirectorytoavoidrpathissues/src/kudu/src/kudu/rpc/rpc-test.cc:270: Failure
Failed
Bad status: Runtime error: could not verify certificate chain (error with cert: subject=CN = localhost, ST = sadfjas, C = AS, emailAddress = sdflkdsajf, O = lskdfjlsad, OU = sldfkja, issuer=C = AS, ST = ASDfkjdhf, L = lskdjf, O = saldfja, OU = skdjf, CN = localhost, emailAddress = sadjflkadsj): : certificate has expired
Google Test trace:
/data0/somelongdirectorytoavoidrpathissues/src/kudu/src/kudu/rpc/rpc-test.cc:267: Connecting to 0.0.0.0:44071
I20260924 03:09:16.242456 3040 test_util.cc:175] -----------------------------------------------
I20260924 03:09:16.242529 3040 test_util.cc:176] Had fatal failures, leaving test files at /tmp/dist-test-taskQ5R1rY/test-tmp/rpc-test.5.Parameters_TestRpc.TestCallWithChainCertAndChainCA_SSL_TCP.1790219356126631-3040-0
[ FAILED ] Parameters/TestRpc.TestCallWithChainCertAndChainCA/SSL_TCP, where GetParam() = (true, false) (30 ms)
[ RUN ] Parameters/TestRpc.TestCallWithPasswordProtectedKey/SSL_TCP
I20260924 03:09:16.257020 3101 acceptor_pool.cc:254] collecting diagnostics on the listening RPC socket 0.0.0.0:37997 every 8 connection(s)
I20260924 03:09:16.257268 3102 acceptor_pool.cc:254] collecting diagnostics on the listening RPC socket 0.0.0.0:37997 every 8 connection(s)
[ OK ] Parameters/TestRpc.TestCallWithPasswordProtectedKey/SSL_TCP (47 ms)
[ RUN ] Parameters/TestRpc.TestCallToBadServer/SSL_TCP
I20260924 03:09:16.301685 3040 rpc-test.cc:394] Status: Network error: Client connection negotiation failed: client connection to 0.0.0.0:0: connect: Connection refused (error 111)
I20260924 03:09:16.302314 3040 rpc-test.cc:394] Status: Network error: Client connection negotiation failed: client connection to 0.0.0.0:0: connect: Connection refused (error 111)
I20260924 03:09:16.302959 3040 rpc-test.cc:394] Status: Network error: Client connection negotiation failed: client connection to 0.0.0.0:0: connect: Connection refused (error 111)
I20260924 03:09:16.303547 3040 rpc-test.cc:394] Status: Network error: Client connection negotiation failed: client connection to 0.0.0.0:0: connect: Connection refused (error 111)
I20260924 03:09:16.304145 3040 rpc-test.cc:394] Status: Network error: Client connection negotiation failed: client connection to 0.0.0.0:0: connect: Connection refused (error 111)
[ OK ] Parameters/TestRpc.TestCallToBadServer/SSL_TCP (16 ms)
[ RUN ] Parameters/TestRpc.TestWrongService/SSL_TCP
I20260924 03:09:16.322638 3136 acceptor_pool.cc:254] collecting diagnostics on the listening RPC socket 0.0.0.0:35019 every 8 connection(s)
I20260924 03:09:16.322952 3137 acceptor_pool.cc:254] collecting diagnostics on the listening RPC socket 0.0.0.0:35019 every 8 connection(s)
I20260924 03:09:16.338356 3133 messenger.cc:345] service WrongServiceName not registered on TestServer
[ OK ] Parameters/TestRpc.TestWrongService/SSL_TCP (37 ms)
[ RUN ] Parameters/TestRpc.TestConnectionKeepalive/SSL_TCP
I20260924 03:09:16.353133 3159 acceptor_pool.cc:254] collecting diagnostics on the listening RPC socket 0.0.0.0:37167 every 8 connection(s)
I20260924 03:09:16.353394 3160 acceptor_pool.cc:254] collecting diagnostics on the listening RPC socket 0.0.0.0:37167 every 8 connection(s)
I20260924 03:09:16.354312 3040 rpc-test.cc:488] Connecting to 0.0.0.0:37167
[ OK ] Parameters/TestRpc.TestConnectionKeepalive/SSL_TCP (1058 ms)
[ RUN ] Parameters/TestRpc.TestClientConnectionMetrics/SSL_TCP
I20260924 03:09:17.417394 3184 acceptor_pool.cc:254] collecting diagnostics on the listening RPC socket 0.0.0.0:40379 every 8 connection(s)
I20260924 03:09:17.417630 3185 acceptor_pool.cc:254] collecting diagnostics on the listening RPC socket 0.0.0.0:40379 every 8 connection(s)
I20260924 03:09:17.418571 3040 rpc-test.cc:569] Connecting to 0.0.0.0:40379
[ OK ] Parameters/TestRpc.TestClientConnectionMetrics/SSL_TCP (19249 ms)
[ RUN ] Parameters/TestRpc.TestCredentialsPolicy/SSL_TCP
I20260924 03:09:36.690186 3207 acceptor_pool.cc:254] collecting diagnostics on the listening RPC socket 0.0.0.0:38661 every 8 connection(s)
I20260924 03:09:36.690424 3208 acceptor_pool.cc:254] collecting diagnostics on the listening RPC socket 0.0.0.0:38661 every 8 connection(s)
I20260924 03:09:36.691391 3040 rpc-test.cc:700] Connecting to 0.0.0.0:38661
[ OK ] Parameters/TestRpc.TestCredentialsPolicy/SSL_TCP (68 ms)
[ RUN ] Parameters/TestRpc.TestCallLongerThanKeepalive/SSL_TCP
I20260924 03:09:36.734939 3232 acceptor_pool.cc:254] collecting diagnostics on the listening RPC socket 0.0.0.0:44215 every 8 connection(s)
I20260924 03:09:36.735186 3233 acceptor_pool.cc:254] collecting diagnostics on the listening RPC socket 0.0.0.0:44215 every 8 connection(s)
I20260924 03:09:36.750567 3236 rpc-test-base.h:222] got call: sleep_micros: 3000000 deferred: true
I20260924 03:09:39.752148 3236 rpcz_store.cc:275] Call kudu.rpc.GenericCalculatorService.Sleep from 127.0.0.1:51136 (request call id 0) took 3001 ms. Trace:
I20260924 03:09:39.752332 3236 rpcz_store.cc:276] 0924 03:09:36.750478 (+ 0us) service_pool.cc:170] Inserting onto call queue
0924 03:09:36.750530 (+ 52us) service_pool.cc:227] Handling call
0924 03:09:39.752079 (+3001549us) inbound_call.cc:173] Queueing success response
Metrics: {}
[ OK ] Parameters/TestRpc.TestCallLongerThanKeepalive/SSL_TCP (3038 ms)
[ RUN ] Parameters/TestRpc.TestRpcSidecar/SSL_TCP
I20260924 03:09:39.772837 3257 acceptor_pool.cc:254] collecting diagnostics on the listening RPC socket 0.0.0.0:42917 every 8 connection(s)
I20260924 03:09:39.773041 3258 acceptor_pool.cc:254] collecting diagnostics on the listening RPC socket 0.0.0.0:42917 every 8 connection(s)
[ OK ] Parameters/TestRpc.TestRpcSidecar/SSL_TCP (106 ms)
[ RUN ] Parameters/TestRpc.TestRpcSidecarLimits/SSL_TCP
I20260924 03:09:41.898730 3282 acceptor_pool.cc:254] collecting diagnostics on the listening RPC socket 0.0.0.0:39239 every 8 connection(s)
I20260924 03:09:41.899037 3283 acceptor_pool.cc:254] collecting diagnostics on the listening RPC socket 0.0.0.0:39239 every 8 connection(s)
W20260924 03:09:41.931466 3040 serialization.cc:72] Serialized kudu.rpc_test.PushStringsRequestPB (2147483654 bytes) is larger than the maximum configured RPC message size (52428800 bytes). Sending anyway, but peer may reject the data.
W20260924 03:09:41.939153 3279 connection.cc:535] server connection from 127.0.0.1:41422 recv error: Network error: RPC frame had a length of 2147483714, but we only support messages up to 52428800 bytes long.
W20260924 03:09:41.939306 3279 connection.cc:158] shutting down server connection from 127.0.0.1:41422 with pending inbound data: 4/2147483714 bytes received; last active 0 ns ago: status Network error: RPC frame had a length of 2147483714, but we only support messages up to 52428800 bytes long.
W20260924 03:09:41.939846 3295 connection.cc:196] Error closing socket: Network error: TlsSocket::Close: Connection reset by peer
I20260924 03:09:41.959038 3307 acceptor_pool.cc:254] collecting diagnostics on the listening RPC socket 0.0.0.0:33571 every 8 connection(s)
I20260924 03:09:41.959261 3308 acceptor_pool.cc:254] collecting diagnostics on the listening RPC socket 0.0.0.0:33571 every 8 connection(s)
W20260924 03:09:46.903435 3304 connection.cc:577] server connection from 127.0.0.1:41256: received bad data: 'Corruption: Invalid packet: message had a length of 2147483710, but we only support messages up to 2147483647 bytes
'
[ OK ] Parameters/TestRpc.TestRpcSidecarLimits/SSL_TCP (7499 ms)
[ RUN ] Parameters/TestRpc.TestCallTimeoutDoesntAffectNegotiation/SSL_TCP
I20260924 03:09:47.380424 3332 acceptor_pool.cc:254] collecting diagnostics on the listening RPC socket 0.0.0.0:40573 every 8 connection(s)
I20260924 03:09:47.380673 3333 acceptor_pool.cc:254] collecting diagnostics on the listening RPC socket 0.0.0.0:40573 every 8 connection(s)
W20260924 03:09:47.393386 3328 negotiation.cc:266] Injecting 500ms delay in negotiation
I20260924 03:09:47.443744 3040 rpc-test-base.h:595] status: Timed out: connection negotiation to 0.0.0.0:40573 for RPC Sleep timed out after 0.050s (ON_OUTBOUND_QUEUE), seconds elapsed: 0.0509473
[ OK ] Parameters/TestRpc.TestCallTimeoutDoesntAffectNegotiation/SSL_TCP (541 ms)
[ RUN ] Parameters/TestRpc.TestRpcHandlerLatencyMetric/SSL_TCP
I20260924 03:09:47.929639 3357 acceptor_pool.cc:254] collecting diagnostics on the listening RPC socket 0.0.0.0:45697 every 8 connection(s)
I20260924 03:09:47.929867 3358 acceptor_pool.cc:254] collecting diagnostics on the listening RPC socket 0.0.0.0:45697 every 8 connection(s)
I20260924 03:09:47.968928 3040 rpc-test.cc:1236] Sleep() min lat: 20573
I20260924 03:09:47.969041 3040 rpc-test.cc:1237] Sleep() mean lat: 20573
I20260924 03:09:47.969130 3040 rpc-test.cc:1238] Sleep() max lat: 20573
I20260924 03:09:47.969180 3040 rpc-test.cc:1239] Sleep() #calls: 1
[ OK ] Parameters/TestRpc.TestRpcHandlerLatencyMetric/SSL_TCP (66 ms)
[ RUN ] Parameters/TestRpc.TimedOutOnResponseMetricServiceQueue/SSL_TCP
I20260924 03:09:47.991519 3383 acceptor_pool.cc:254] collecting diagnostics on the listening RPC socket 0.0.0.0:34067 every 8 connection(s)
I20260924 03:09:47.991776 3384 acceptor_pool.cc:254] collecting diagnostics on the listening RPC socket 0.0.0.0:34067 every 8 connection(s)
W20260924 03:09:48.055081 3385 rpcz_store.cc:267] Call kudu.rpc_test.CalculatorService.Sleep from 127.0.0.1:46228 (request call id 2) took 20 ms (client timeout 20 ms). Trace:
W20260924 03:09:48.055251 3385 rpcz_store.cc:269] 0924 03:09:48.034611 (+ 0us) service_pool.cc:170] Inserting onto call queue
0924 03:09:48.054902 (+ 20291us) service_pool.cc:214] Skipping call since client already timed out
0924 03:09:48.054993 (+ 91us) inbound_call.cc:173] Queueing failure response
Metrics: {}
W20260924 03:09:48.056797 3382 connection.cc:441] server connection from 127.0.0.1:46228 torn down before Call kudu.rpc_test.CalculatorService.Sleep from 127.0.0.1:46228 (request call id 2) could send its response
[ OK ] Parameters/TestRpc.TimedOutOnResponseMetricServiceQueue/SSL_TCP (85 ms)
[ RUN ] Parameters/TestRpc.RpcPendingConnectionsMetric/SSL_TCP
I20260924 03:09:48.063896 3406 acceptor_pool.cc:254] collecting diagnostics on the listening RPC socket 0.0.0.0:35823 every 8 connection(s)
I20260924 03:09:48.064109 3407 acceptor_pool.cc:254] collecting diagnostics on the listening RPC socket 0.0.0.0:35823 every 8 connection(s)
W20260924 03:09:48.066052 3402 negotiation.cc:337] Failed RPC negotiation. Trace:
0924 03:09:48.065502 (+ 0us) reactor.cc:625] Submitting negotiation task for server connection from 127.0.0.1:52638 (local address 127.0.0.1:35823)
0924 03:09:48.065628 (+ 126us) server_negotiation.cc:206] Beginning negotiation
0924 03:09:48.065632 (+ 4us) server_negotiation.cc:399] Waiting for connection header
0924 03:09:48.065741 (+ 109us) negotiation.cc:327] Negotiation complete: Network error: Server connection negotiation failed: server connection from 127.0.0.1:52638: BlockingRecv error: recv got EOF from 127.0.0.1:52638 (error 108)
Metrics: {"server-negotiator.queue_time_us":42}
[ OK ] Parameters/TestRpc.RpcPendingConnectionsMetric/SSL_TCP (18 ms)
[ RUN ] Parameters/TestRpc.TestRpcContextClientDeadline/SSL_TCP
I20260924 03:09:48.090926 3422 acceptor_pool.cc:254] collecting diagnostics on the listening RPC socket 0.0.0.0:37125 every 8 connection(s)
I20260924 03:09:48.091153 3423 acceptor_pool.cc:254] collecting diagnostics on the listening RPC socket 0.0.0.0:37125 every 8 connection(s)
[ OK ] Parameters/TestRpc.TestRpcContextClientDeadline/SSL_TCP (58 ms)
[ RUN ] Parameters/TestRpc.TestApplicationFeatureFlagUnsupportedServer/SSL_TCP
I20260924 03:09:48.155465 3447 acceptor_pool.cc:254] collecting diagnostics on the listening RPC socket 0.0.0.0:40985 every 8 connection(s)
I20260924 03:09:48.155715 3448 acceptor_pool.cc:254] collecting diagnostics on the listening RPC socket 0.0.0.0:40985 every 8 connection(s)
[ OK ] Parameters/TestRpc.TestApplicationFeatureFlagUnsupportedServer/SSL_TCP (46 ms)
[ RUN ] Parameters/TestRpc.TestCancellationAsync/SSL_TCP
I20260924 03:09:48.193204 3472 acceptor_pool.cc:254] collecting diagnostics on the listening RPC socket 0.0.0.0:41303 every 8 connection(s)
I20260924 03:09:48.193432 3473 acceptor_pool.cc:254] collecting diagnostics on the listening RPC socket 0.0.0.0:41303 every 8 connection(s)
I20260924 03:09:48.194164 3040 rpc-test.cc:1716] Connecting to 0.0.0.0:41303
I20260924 03:09:48.203135 3040 test_util.cc:268] Using random seed: -290181034
I20260924 03:09:48.239023 3476 rpc-test-base.h:240] got call: sleep_micros: 500 pattern: 4294967295 num_repetitions: 2097152 sidecar_idx: 0
I20260924 03:09:48.263374 3475 rpc-test-base.h:240] got call: sleep_micros: 500 pattern: 4294967295 num_repetitions: 2097152 sidecar_idx: 0
I20260924 03:09:48.287894 3474 rpc-test-base.h:240] got call: sleep_micros: 500 pattern: 4294967295 num_repetitions: 2097152 sidecar_idx: 0
I20260924 03:09:48.316316 3476 rpc-test-base.h:240] got call: sleep_micros: 500 pattern: 4294967295 num_repetitions: 2097152 sidecar_idx: 0
I20260924 03:09:48.346227 3474 rpc-test-base.h:240] got call: sleep_micros: 500 pattern: 4294967295 num_repetitions: 2097152 sidecar_idx: 0
I20260924 03:09:48.373512 3476 rpc-test-base.h:240] got call: sleep_micros: 500 pattern: 4294967295 num_repetitions: 2097152 sidecar_idx: 0
W20260924 03:09:48.399739 3469 connection.cc:698] server connection from 127.0.0.1:58704 send error: Network error: failed to write to TLS socket: Broken pipe
W20260924 03:09:48.399935 3469 connection.cc:441] server connection from 127.0.0.1:58704 torn down before Call kudu.rpc.GenericCalculatorService.SleepWithSidecar from 127.0.0.1:58704 (request call id 9) could send its response
W20260924 03:09:48.400270 3469 connection.cc:196] Error closing socket: Network error: TlsSocket::Close: Success
W20260924 03:09:48.415112 3469 connection.cc:441] server connection from 127.0.0.1:58704 torn down before Call kudu.rpc.GenericCalculatorService.SleepWithSidecar from 127.0.0.1:58704 (request call id 8) could send its response
[ OK ] Parameters/TestRpc.TestCancellationAsync/SSL_TCP (235 ms)
[ RUN ] Parameters/TestRpc.TestPerformanceBySocketType/SSL_TCP
I20260924 03:09:48.438781 3497 acceptor_pool.cc:254] collecting diagnostics on the listening RPC socket 0.0.0.0:46577 every 8 connection(s)
I20260924 03:09:48.439087 3498 acceptor_pool.cc:254] collecting diagnostics on the listening RPC socket 0.0.0.0:46577 every 8 connection(s)
I20260924 03:09:48.440030 3040 rpc-test.cc:1846] Connecting to 0.0.0.0:46577
I20260924 03:09:51.166432 3040 rpc-test.cc:1859] Sending 1024MB via ssl-enabled tcp socket: real 2.710s user 2.395s sys 2.084s
I20260924 03:09:53.913892 3040 rpc-test.cc:1859] Sending 1024MB via ssl-enabled tcp socket: real 2.747s user 2.444s sys 2.166s
I20260924 03:09:56.762359 3040 rpc-test.cc:1859] Sending 1024MB via ssl-enabled tcp socket: real 2.848s user 2.607s sys 2.133s
I20260924 03:09:59.560039 3040 rpc-test.cc:1859] Sending 1024MB via ssl-enabled tcp socket: real 2.798s user 2.501s sys 2.154s
I20260924 03:10:02.288285 3040 rpc-test.cc:1859] Sending 1024MB via ssl-enabled tcp socket: real 2.728s user 2.418s sys 2.097s
[ OK ] Parameters/TestRpc.TestPerformanceBySocketType/SSL_TCP (13876 ms)
[----------] 20 tests from Parameters/TestRpc (46149 ms total)
[----------] 1 test from Parameters/TestRpcSocketTxRxQueue
[ RUN ] Parameters/TestRpcSocketTxRxQueue.OverCapacity/0
W20260924 03:10:02.590164 3523 negotiation.cc:337] Failed RPC negotiation. Trace:
0924 03:10:02.301024 (+ 0us) reactor.cc:625] Submitting negotiation task for client connection to 0.0.0.0:40617 (local address 127.0.0.1:57512)
0924 03:10:02.301238 (+ 214us) negotiation.cc:107] Waiting for socket to connect
0924 03:10:02.301256 (+ 18us) client_negotiation.cc:174] Beginning negotiation
0924 03:10:02.301362 (+ 106us) client_negotiation.cc:252] Sending NEGOTIATE NegotiatePB request
0924 03:10:02.589661 (+288299us) negotiation.cc:327] Negotiation complete: Network error: Client connection negotiation failed: client connection to 0.0.0.0:40617: BlockingRecv error: recv error from unknown peer: Transport endpoint is not connected (error 107)
Metrics: {"client-negotiator.queue_time_us":48}
W20260924 03:10:02.590279 3532 negotiation.cc:337] Failed RPC negotiation. Trace:
0924 03:10:02.303734 (+ 0us) reactor.cc:625] Submitting negotiation task for client connection to 0.0.0.0:40617 (local address 127.0.0.1:57520)
0924 03:10:02.303908 (+ 174us) negotiation.cc:107] Waiting for socket to connect
0924 03:10:02.303936 (+ 28us) client_negotiation.cc:174] Beginning negotiation
0924 03:10:02.304037 (+ 101us) client_negotiation.cc:252] Sending NEGOTIATE NegotiatePB request
0924 03:10:02.589661 (+285624us) negotiation.cc:327] Negotiation complete: Network error: Client connection negotiation failed: client connection to 0.0.0.0:40617: BlockingRecv error: recv error from unknown peer: Transport endpoint is not connected (error 107)
Metrics: {"client-negotiator.queue_time_us":57}
W20260924 03:10:02.590775 3514 negotiation.cc:337] Failed RPC negotiation. Trace:
0924 03:10:02.298616 (+ 0us) reactor.cc:625] Submitting negotiation task for client connection to 0.0.0.0:40617 (local address 127.0.0.1:57510)
0924 03:10:02.298777 (+ 161us) negotiation.cc:107] Waiting for socket to connect
0924 03:10:02.298795 (+ 18us) client_negotiation.cc:174] Beginning negotiation
0924 03:10:02.298903 (+ 108us) client_negotiation.cc:252] Sending NEGOTIATE NegotiatePB request
0924 03:10:02.589576 (+290673us) negotiation.cc:327] Negotiation complete: Network error: Client connection negotiation failed: client connection to 0.0.0.0:40617: BlockingRecv error: recv error from unknown peer: Transport endpoint is not connected (error 107)
Metrics: {"client-negotiator.queue_time_us":36}
W20260924 03:10:02.591174 3550 negotiation.cc:337] Failed RPC negotiation. Trace:
0924 03:10:02.309082 (+ 0us) reactor.cc:625] Submitting negotiation task for client connection to 0.0.0.0:40617 (local address 127.0.0.1:57544)
0924 03:10:02.309262 (+ 180us) negotiation.cc:107] Waiting for socket to connect
0924 03:10:02.309277 (+ 15us) client_negotiation.cc:174] Beginning negotiation
0924 03:10:02.309362 (+ 85us) client_negotiation.cc:252] Sending NEGOTIATE NegotiatePB request
0924 03:10:02.590107 (+280745us) negotiation.cc:327] Negotiation complete: Network error: Client connection negotiation failed: client connection to 0.0.0.0:40617: BlockingRecv error: recv error from unknown peer: Transport endpoint is not connected (error 107)
Metrics: {"client-negotiator.queue_time_us":67}
W20260924 03:10:02.591238 3559 negotiation.cc:337] Failed RPC negotiation. Trace:
0924 03:10:02.311781 (+ 0us) reactor.cc:625] Submitting negotiation task for client connection to 0.0.0.0:40617 (local address 127.0.0.1:57556)
0924 03:10:02.311972 (+ 191us) negotiation.cc:107] Waiting for socket to connect
0924 03:10:02.311988 (+ 16us) client_negotiation.cc:174] Beginning negotiation
0924 03:10:02.312095 (+ 107us) client_negotiation.cc:252] Sending NEGOTIATE NegotiatePB request
0924 03:10:02.590772 (+278677us) negotiation.cc:327] Negotiation complete: Network error: Client connection negotiation failed: client connection to 0.0.0.0:40617: BlockingRecv error: recv error from unknown peer: Transport endpoint is not connected (error 107)
Metrics: {"client-negotiator.queue_time_us":51}
W20260924 03:10:02.592289 3541 negotiation.cc:337] Failed RPC negotiation. Trace:
0924 03:10:02.306418 (+ 0us) reactor.cc:625] Submitting negotiation task for client connection to 0.0.0.0:40617 (local address 127.0.0.1:57530)
0924 03:10:02.306580 (+ 162us) negotiation.cc:107] Waiting for socket to connect
0924 03:10:02.306607 (+ 27us) client_negotiation.cc:174] Beginning negotiation
0924 03:10:02.306702 (+ 95us) client_negotiation.cc:252] Sending NEGOTIATE NegotiatePB request
0924 03:10:02.591403 (+284701us) negotiation.cc:327] Negotiation complete: Network error: Client connection negotiation failed: client connection to 0.0.0.0:40617: BlockingRecv error: recv error from unknown peer: Transport endpoint is not connected (error 107)
Metrics: {"client-negotiator.queue_time_us":63}
[ OK ] Parameters/TestRpcSocketTxRxQueue.OverCapacity/0 (1073 ms)
[----------] 1 test from Parameters/TestRpcSocketTxRxQueue (1073 ms total)
[----------] Global test environment tear-down
[==========] 21 tests from 2 test suites ran. (47223 ms total)
[ PASSED ] 20 tests.
[ FAILED ] 1 test, listed below:
[ FAILED ] Parameters/TestRpc.TestCallWithChainCertAndChainCA/SSL_TCP, where GetParam() = (true, false)
1 FAILED TEST