Diagnosed failure
Parameters/TestRpc.TestCallWithChainCertAndChainCA/SSL_UnixSocket: /data0/somelongdirectorytoavoidrpathissues/src/kudu/src/kudu/rpc/rpc-test.cc:270: Failure
Failed
Bad status: Runtime error: could not verify certificate chain (error with cert: subject=CN = localhost, ST = sadfjas, C = AS, emailAddress = sdflkdsajf, O = lskdfjlsad, OU = sldfkja, issuer=C = AS, ST = ASDfkjdhf, L = lskdjf, O = saldfja, OU = skdjf, CN = localhost, emailAddress = sadjflkadsj): : certificate has expired
Google Test trace:
/data0/somelongdirectorytoavoidrpathissues/src/kudu/src/kudu/rpc/rpc-test.cc:267: Connecting to unix:/tmp/dist-test-taskV7NmEt/test-tmp/rpc-test-7840aaef6e3c4b939d442ae988bb5748.sock
I20260924 14:32:42.188735 26630 test_util.cc:175] -----------------------------------------------
I20260924 14:32:42.188920 26630 test_util.cc:176] Had fatal failures, leaving test files at /tmp/dist-test-taskV7NmEt/test-tmp/rpc-test.6.Parameters_TestRpc.TestCallWithChainCertAndChainCA_SSL_UnixSocket.1790260360898270-26630-0
Full log
Note: This is test shard 7 of 8.
[==========] Running 21 tests from 2 test suites.
[----------] Global test environment set-up.
[----------] 20 tests from Parameters/TestRpc
[ RUN ] Parameters/TestRpc.TestMessengerCreateDestroy/SSL_UnixSocket
WARNING: Logging before InitGoogleLogging() is written to STDERR
I20260924 14:32:41.007086 26630 rpc-test.cc:169] started messenger TestCreateDestroy
[ OK ] Parameters/TestRpc.TestMessengerCreateDestroy/SSL_UnixSocket (1099 ms)
[ RUN ] Parameters/TestRpc.TestNegotiationDeadlock/SSL_UnixSocket
I20260924 14:32:42.074203 26652 acceptor_pool.cc:254] collecting diagnostics on the listening RPC socket unix:/tmp/dist-test-taskV7NmEt/test-tmp/rpc-test-1115899fd5694471a0117aeb7550ef99.sock every 8 connection(s)
I20260924 14:32:42.075519 26653 acceptor_pool.cc:254] collecting diagnostics on the listening RPC socket unix:/tmp/dist-test-taskV7NmEt/test-tmp/rpc-test-1115899fd5694471a0117aeb7550ef99.sock every 8 connection(s)
[ OK ] Parameters/TestRpc.TestNegotiationDeadlock/SSL_UnixSocket (73 ms)
[ RUN ] Parameters/TestRpc.TestCallWithChainCertAndChainCA/SSL_UnixSocket
I20260924 14:32:42.160547 26668 acceptor_pool.cc:254] collecting diagnostics on the listening RPC socket unix:/tmp/dist-test-taskV7NmEt/test-tmp/rpc-test-7840aaef6e3c4b939d442ae988bb5748.sock every 8 connection(s)
I20260924 14:32:42.162626 26669 acceptor_pool.cc:254] collecting diagnostics on the listening RPC socket unix:/tmp/dist-test-taskV7NmEt/test-tmp/rpc-test-7840aaef6e3c4b939d442ae988bb5748.sock every 8 connection(s)
/data0/somelongdirectorytoavoidrpathissues/src/kudu/src/kudu/rpc/rpc-test.cc:270: Failure
Failed
Bad status: Runtime error: could not verify certificate chain (error with cert: subject=CN = localhost, ST = sadfjas, C = AS, emailAddress = sdflkdsajf, O = lskdfjlsad, OU = sldfkja, issuer=C = AS, ST = ASDfkjdhf, L = lskdjf, O = saldfja, OU = skdjf, CN = localhost, emailAddress = sadjflkadsj): : certificate has expired
Google Test trace:
/data0/somelongdirectorytoavoidrpathissues/src/kudu/src/kudu/rpc/rpc-test.cc:267: Connecting to unix:/tmp/dist-test-taskV7NmEt/test-tmp/rpc-test-7840aaef6e3c4b939d442ae988bb5748.sock
I20260924 14:32:42.188735 26630 test_util.cc:175] -----------------------------------------------
I20260924 14:32:42.188920 26630 test_util.cc:176] Had fatal failures, leaving test files at /tmp/dist-test-taskV7NmEt/test-tmp/rpc-test.6.Parameters_TestRpc.TestCallWithChainCertAndChainCA_SSL_UnixSocket.1790260360898270-26630-0
[ FAILED ] Parameters/TestRpc.TestCallWithChainCertAndChainCA/SSL_UnixSocket, where GetParam() = (true, true) (64 ms)
[ RUN ] Parameters/TestRpc.TestCallWithPasswordProtectedKey/SSL_UnixSocket
I20260924 14:32:42.216053 26694 acceptor_pool.cc:254] collecting diagnostics on the listening RPC socket unix:/tmp/dist-test-taskV7NmEt/test-tmp/rpc-test-48dd212873444cc09ab89f5f7eaa9e9f.sock every 8 connection(s)
I20260924 14:32:42.216791 26695 acceptor_pool.cc:254] collecting diagnostics on the listening RPC socket unix:/tmp/dist-test-taskV7NmEt/test-tmp/rpc-test-48dd212873444cc09ab89f5f7eaa9e9f.sock every 8 connection(s)
[ OK ] Parameters/TestRpc.TestCallWithPasswordProtectedKey/SSL_UnixSocket (77 ms)
[ RUN ] Parameters/TestRpc.TestCallToBadServer/SSL_UnixSocket
I20260924 14:32:42.282572 26630 rpc-test.cc:394] Status: Network error: Client connection negotiation failed: client connection to 0.0.0.0:0: connect: Connection refused (error 111)
I20260924 14:32:42.283841 26630 rpc-test.cc:394] Status: Network error: Client connection negotiation failed: client connection to 0.0.0.0:0: connect: Connection refused (error 111)
I20260924 14:32:42.285012 26630 rpc-test.cc:394] Status: Network error: Client connection negotiation failed: client connection to 0.0.0.0:0: connect: Connection refused (error 111)
I20260924 14:32:42.286262 26630 rpc-test.cc:394] Status: Network error: Client connection negotiation failed: client connection to 0.0.0.0:0: connect: Connection refused (error 111)
I20260924 14:32:42.287415 26630 rpc-test.cc:394] Status: Network error: Client connection negotiation failed: client connection to 0.0.0.0:0: connect: Connection refused (error 111)
[ OK ] Parameters/TestRpc.TestCallToBadServer/SSL_UnixSocket (23 ms)
[ RUN ] Parameters/TestRpc.TestWrongService/SSL_UnixSocket
I20260924 14:32:42.315721 26730 acceptor_pool.cc:254] collecting diagnostics on the listening RPC socket unix:/tmp/dist-test-taskV7NmEt/test-tmp/rpc-test-e482af0239734b2db4d1aba9bcf38fea.sock every 8 connection(s)
I20260924 14:32:42.316450 26731 acceptor_pool.cc:254] collecting diagnostics on the listening RPC socket unix:/tmp/dist-test-taskV7NmEt/test-tmp/rpc-test-e482af0239734b2db4d1aba9bcf38fea.sock every 8 connection(s)
I20260924 14:32:42.347115 26727 messenger.cc:345] service WrongServiceName not registered on TestServer
W20260924 14:32:42.349514 26727 connection.cc:196] Error closing socket: Network error: TlsSocket::Close: Broken pipe
[ OK ] Parameters/TestRpc.TestWrongService/SSL_UnixSocket (67 ms)
[ RUN ] Parameters/TestRpc.TestConnectionKeepalive/SSL_UnixSocket
I20260924 14:32:42.384516 26753 acceptor_pool.cc:254] collecting diagnostics on the listening RPC socket unix:/tmp/dist-test-taskV7NmEt/test-tmp/rpc-test-a9db281f1e694786abf17069b72f84cf.sock every 8 connection(s)
I20260924 14:32:42.385336 26754 acceptor_pool.cc:254] collecting diagnostics on the listening RPC socket unix:/tmp/dist-test-taskV7NmEt/test-tmp/rpc-test-a9db281f1e694786abf17069b72f84cf.sock every 8 connection(s)
I20260924 14:32:42.388589 26630 rpc-test.cc:488] Connecting to unix:/tmp/dist-test-taskV7NmEt/test-tmp/rpc-test-a9db281f1e694786abf17069b72f84cf.sock
W20260924 14:32:42.861408 26767 connection.cc:196] Error closing socket: Network error: TlsSocket::Close: Broken pipe
[ OK ] Parameters/TestRpc.TestConnectionKeepalive/SSL_UnixSocket (1074 ms)
[ RUN ] Parameters/TestRpc.TestClientConnectionMetrics/SSL_UnixSocket
I20260924 14:32:43.464787 26779 acceptor_pool.cc:254] collecting diagnostics on the listening RPC socket unix:/tmp/dist-test-taskV7NmEt/test-tmp/rpc-test-b8b72041782744dd820d26b086645d3b.sock every 8 connection(s)
I20260924 14:32:43.465560 26780 acceptor_pool.cc:254] collecting diagnostics on the listening RPC socket unix:/tmp/dist-test-taskV7NmEt/test-tmp/rpc-test-b8b72041782744dd820d26b086645d3b.sock every 8 connection(s)
I20260924 14:32:43.468840 26630 rpc-test.cc:569] Connecting to unix:/tmp/dist-test-taskV7NmEt/test-tmp/rpc-test-b8b72041782744dd820d26b086645d3b.sock
W20260924 14:34:56.569901 26776 connection.cc:196] Error closing socket: Network error: TlsSocket::Close: Broken pipe
[ OK ] Parameters/TestRpc.TestClientConnectionMetrics/SSL_UnixSocket (133145 ms)
[ RUN ] Parameters/TestRpc.TestCredentialsPolicy/SSL_UnixSocket
I20260924 14:34:56.599298 26816 acceptor_pool.cc:254] collecting diagnostics on the listening RPC socket unix:/tmp/dist-test-taskV7NmEt/test-tmp/rpc-test-07bc651c7be94c2f82067fae300f5c99.sock every 8 connection(s)
I20260924 14:34:56.600159 26817 acceptor_pool.cc:254] collecting diagnostics on the listening RPC socket unix:/tmp/dist-test-taskV7NmEt/test-tmp/rpc-test-07bc651c7be94c2f82067fae300f5c99.sock every 8 connection(s)
I20260924 14:34:56.603400 26630 rpc-test.cc:700] Connecting to unix:/tmp/dist-test-taskV7NmEt/test-tmp/rpc-test-07bc651c7be94c2f82067fae300f5c99.sock
W20260924 14:34:56.646531 26815 connection.cc:196] Error closing socket: Network error: TlsSocket::Close: Broken pipe
[ OK ] Parameters/TestRpc.TestCredentialsPolicy/SSL_UnixSocket (89 ms)
[ RUN ] Parameters/TestRpc.TestCallLongerThanKeepalive/SSL_UnixSocket
I20260924 14:34:56.687839 26841 acceptor_pool.cc:254] collecting diagnostics on the listening RPC socket unix:/tmp/dist-test-taskV7NmEt/test-tmp/rpc-test-815ebee45bf048d8a81dac72aaf7a036.sock every 8 connection(s)
I20260924 14:34:56.688567 26842 acceptor_pool.cc:254] collecting diagnostics on the listening RPC socket unix:/tmp/dist-test-taskV7NmEt/test-tmp/rpc-test-815ebee45bf048d8a81dac72aaf7a036.sock every 8 connection(s)
I20260924 14:34:56.754269 26845 rpc-test-base.h:222] got call: sleep_micros: 3000000 deferred: true
I20260924 14:34:59.758982 26845 rpcz_store.cc:275] Call kudu.rpc.GenericCalculatorService.Sleep from unix:<unnamed> (request call id 0) took 3004 ms. Trace:
I20260924 14:34:59.759297 26845 rpcz_store.cc:276] 0924 14:34:56.754077 (+ 0us) service_pool.cc:170] Inserting onto call queue
0924 14:34:56.754196 (+ 119us) service_pool.cc:227] Handling call
0924 14:34:59.758923 (+3004727us) inbound_call.cc:173] Queueing success response
Metrics: {}
W20260924 14:34:59.763190 26838 connection.cc:196] Error closing socket: Network error: TlsSocket::Close: Broken pipe
[ OK ] Parameters/TestRpc.TestCallLongerThanKeepalive/SSL_UnixSocket (3101 ms)
[ RUN ] Parameters/TestRpc.TestRpcSidecar/SSL_UnixSocket
I20260924 14:34:59.806273 26866 acceptor_pool.cc:254] collecting diagnostics on the listening RPC socket unix:/tmp/dist-test-taskV7NmEt/test-tmp/rpc-test-a0d75931c23c40e5bd7f3cc37c5e711a.sock every 8 connection(s)
I20260924 14:34:59.807025 26867 acceptor_pool.cc:254] collecting diagnostics on the listening RPC socket unix:/tmp/dist-test-taskV7NmEt/test-tmp/rpc-test-a0d75931c23c40e5bd7f3cc37c5e711a.sock every 8 connection(s)
W20260924 14:35:00.333422 26863 connection.cc:196] Error closing socket: Network error: TlsSocket::Close: Broken pipe
[ OK ] Parameters/TestRpc.TestRpcSidecar/SSL_UnixSocket (569 ms)
[ RUN ] Parameters/TestRpc.TestRpcSidecarLimits/SSL_UnixSocket
I20260924 14:35:21.757684 26894 acceptor_pool.cc:254] collecting diagnostics on the listening RPC socket unix:/tmp/dist-test-taskV7NmEt/test-tmp/rpc-test-14aeeb1a3d384e4488c03451b9b0f626.sock every 8 connection(s)
I20260924 14:35:21.758361 26895 acceptor_pool.cc:254] collecting diagnostics on the listening RPC socket unix:/tmp/dist-test-taskV7NmEt/test-tmp/rpc-test-14aeeb1a3d384e4488c03451b9b0f626.sock every 8 connection(s)
W20260924 14:35:21.799762 26630 serialization.cc:72] Serialized kudu.rpc_test.PushStringsRequestPB (2147483654 bytes) is larger than the maximum configured RPC message size (52428800 bytes). Sending anyway, but peer may reject the data.
W20260924 14:35:21.810968 26891 connection.cc:535] server connection from unix:<unnamed> recv error: Network error: RPC frame had a length of 2147483714, but we only support messages up to 52428800 bytes long.
W20260924 14:35:21.811496 26891 connection.cc:158] shutting down server connection from unix:<unnamed> with pending inbound data: 4/2147483714 bytes received; last active 0 ns ago: status Network error: RPC frame had a length of 2147483714, but we only support messages up to 52428800 bytes long.
W20260924 14:35:21.812624 26907 connection.cc:196] Error closing socket: Network error: TlsSocket::Close: Broken pipe
[ OK ] Parameters/TestRpc.TestRpcSidecarLimits/SSL_UnixSocket (22073 ms)
[ RUN ] Parameters/TestRpc.TestCallTimeoutDoesntAffectNegotiation/SSL_UnixSocket
I20260924 14:35:22.458316 26921 acceptor_pool.cc:254] collecting diagnostics on the listening RPC socket unix:/tmp/dist-test-taskV7NmEt/test-tmp/rpc-test-c85792d566d5448b9fda26e13601ae02.sock every 8 connection(s)
I20260924 14:35:22.459010 26922 acceptor_pool.cc:254] collecting diagnostics on the listening RPC socket unix:/tmp/dist-test-taskV7NmEt/test-tmp/rpc-test-c85792d566d5448b9fda26e13601ae02.sock every 8 connection(s)
W20260924 14:35:22.491029 26917 negotiation.cc:266] Injecting 500ms delay in negotiation
I20260924 14:35:22.540561 26630 rpc-test-base.h:595] status: Timed out: connection negotiation to unix:/tmp/dist-test-taskV7NmEt/test-tmp/rpc-test-c85792d566d5448b9fda26e13601ae02.sock for RPC Sleep timed out after 0.050s (ON_OUTBOUND_QUEUE), seconds elapsed: 0.0505518
[ OK ] Parameters/TestRpc.TestCallTimeoutDoesntAffectNegotiation/SSL_UnixSocket (593 ms)
[ RUN ] Parameters/TestRpc.TestRpcHandlerLatencyMetric/SSL_UnixSocket
I20260924 14:35:23.032541 26946 acceptor_pool.cc:254] collecting diagnostics on the listening RPC socket unix:/tmp/dist-test-taskV7NmEt/test-tmp/rpc-test-ff2f010d39374722ac888dfb7fa592ba.sock every 8 connection(s)
I20260924 14:35:23.033309 26947 acceptor_pool.cc:254] collecting diagnostics on the listening RPC socket unix:/tmp/dist-test-taskV7NmEt/test-tmp/rpc-test-ff2f010d39374722ac888dfb7fa592ba.sock every 8 connection(s)
I20260924 14:35:23.093914 26630 rpc-test.cc:1236] Sleep() min lat: 21693
I20260924 14:35:23.094125 26630 rpc-test.cc:1237] Sleep() mean lat: 21693
I20260924 14:35:23.094255 26630 rpc-test.cc:1238] Sleep() max lat: 21693
I20260924 14:35:23.094364 26630 rpc-test.cc:1239] Sleep() #calls: 1
W20260924 14:35:23.096725 26943 connection.cc:196] Error closing socket: Network error: TlsSocket::Close: Broken pipe
[ OK ] Parameters/TestRpc.TestRpcHandlerLatencyMetric/SSL_UnixSocket (95 ms)
[ RUN ] Parameters/TestRpc.TimedOutOnResponseMetricServiceQueue/SSL_UnixSocket
I20260924 14:35:23.122663 26972 acceptor_pool.cc:254] collecting diagnostics on the listening RPC socket unix:/tmp/dist-test-taskV7NmEt/test-tmp/rpc-test-20d619cb3a88414f9b4160cbc4dddb69.sock every 8 connection(s)
I20260924 14:35:23.123368 26973 acceptor_pool.cc:254] collecting diagnostics on the listening RPC socket unix:/tmp/dist-test-taskV7NmEt/test-tmp/rpc-test-20d619cb3a88414f9b4160cbc4dddb69.sock every 8 connection(s)
W20260924 14:35:23.197252 26974 rpcz_store.cc:267] Call kudu.rpc_test.CalculatorService.Sleep from unix:<unnamed> (request call id 2) took 20 ms (client timeout 20 ms). Trace:
W20260924 14:35:23.197620 26974 rpcz_store.cc:269] 0924 14:35:23.176655 (+ 0us) service_pool.cc:170] Inserting onto call queue
0924 14:35:23.197041 (+ 20386us) service_pool.cc:214] Skipping call since client already timed out
0924 14:35:23.197157 (+ 116us) inbound_call.cc:173] Queueing failure response
Metrics: {}
W20260924 14:35:23.199805 26969 connection.cc:196] Error closing socket: Network error: TlsSocket::Close: Broken pipe
[ OK ] Parameters/TestRpc.TimedOutOnResponseMetricServiceQueue/SSL_UnixSocket (102 ms)
[ RUN ] Parameters/TestRpc.RpcPendingConnectionsMetric/SSL_UnixSocket
I20260924 14:35:23.214458 26995 acceptor_pool.cc:254] collecting diagnostics on the listening RPC socket 0.0.0.0:33729 every 8 connection(s)
I20260924 14:35:23.215178 26996 acceptor_pool.cc:254] collecting diagnostics on the listening RPC socket 0.0.0.0:33729 every 8 connection(s)
W20260924 14:35:23.220460 26991 negotiation.cc:337] Failed RPC negotiation. Trace:
0924 14:35:23.219170 (+ 0us) reactor.cc:625] Submitting negotiation task for server connection from 127.0.0.1:55972 (local address 127.0.0.1:33729)
0924 14:35:23.219608 (+ 438us) server_negotiation.cc:206] Beginning negotiation
0924 14:35:23.219627 (+ 19us) server_negotiation.cc:399] Waiting for connection header
0924 14:35:23.219867 (+ 240us) negotiation.cc:327] Negotiation complete: Network error: Server connection negotiation failed: server connection from 127.0.0.1:55972: BlockingRecv error: recv got EOF from 127.0.0.1:55972 (error 108)
Metrics: {"server-negotiator.queue_time_us":119}
[ OK ] Parameters/TestRpc.RpcPendingConnectionsMetric/SSL_UnixSocket (29 ms)
[ RUN ] Parameters/TestRpc.TestRpcContextClientDeadline/SSL_UnixSocket
I20260924 14:35:23.258302 27013 acceptor_pool.cc:254] collecting diagnostics on the listening RPC socket unix:/tmp/dist-test-taskV7NmEt/test-tmp/rpc-test-13474cea488d4c289a49bcd547ea86a8.sock every 8 connection(s)
I20260924 14:35:23.258991 27014 acceptor_pool.cc:254] collecting diagnostics on the listening RPC socket unix:/tmp/dist-test-taskV7NmEt/test-tmp/rpc-test-13474cea488d4c289a49bcd547ea86a8.sock every 8 connection(s)
W20260924 14:35:23.312474 27010 connection.cc:196] Error closing socket: Network error: TlsSocket::Close: Broken pipe
[ OK ] Parameters/TestRpc.TestRpcContextClientDeadline/SSL_UnixSocket (83 ms)
[ RUN ] Parameters/TestRpc.TestApplicationFeatureFlagUnsupportedServer/SSL_UnixSocket
I20260924 14:35:23.336419 27038 acceptor_pool.cc:254] collecting diagnostics on the listening RPC socket unix:/tmp/dist-test-taskV7NmEt/test-tmp/rpc-test-5f780e11484044ac93e9445558963956.sock every 8 connection(s)
I20260924 14:35:23.337131 27039 acceptor_pool.cc:254] collecting diagnostics on the listening RPC socket unix:/tmp/dist-test-taskV7NmEt/test-tmp/rpc-test-5f780e11484044ac93e9445558963956.sock every 8 connection(s)
[ OK ] Parameters/TestRpc.TestApplicationFeatureFlagUnsupportedServer/SSL_UnixSocket (57 ms)
[ RUN ] Parameters/TestRpc.TestCancellationAsync/SSL_UnixSocket
I20260924 14:35:23.406550 27064 acceptor_pool.cc:254] collecting diagnostics on the listening RPC socket unix:/tmp/dist-test-taskV7NmEt/test-tmp/rpc-test-09c4a1898ca3442596f72393b973d4a4.sock every 8 connection(s)
I20260924 14:35:23.407233 27065 acceptor_pool.cc:254] collecting diagnostics on the listening RPC socket unix:/tmp/dist-test-taskV7NmEt/test-tmp/rpc-test-09c4a1898ca3442596f72393b973d4a4.sock every 8 connection(s)
I20260924 14:35:23.410596 26630 rpc-test.cc:1716] Connecting to unix:/tmp/dist-test-taskV7NmEt/test-tmp/rpc-test-09c4a1898ca3442596f72393b973d4a4.sock
I20260924 14:35:23.438676 26630 test_util.cc:268] Using random seed: -2104618435
I20260924 14:35:23.661383 27068 rpc-test-base.h:240] got call: sleep_micros: 500 pattern: 4294967295 num_repetitions: 2097152 sidecar_idx: 0
I20260924 14:35:23.876765 27068 rpc-test-base.h:240] got call: sleep_micros: 500 pattern: 4294967295 num_repetitions: 2097152 sidecar_idx: 0
I20260924 14:35:24.070567 27067 rpc-test-base.h:240] got call: sleep_micros: 500 pattern: 4294967295 num_repetitions: 2097152 sidecar_idx: 0
I20260924 14:35:24.288717 27067 rpc-test-base.h:240] got call: sleep_micros: 500 pattern: 4294967295 num_repetitions: 2097152 sidecar_idx: 0
I20260924 14:35:24.494814 27067 rpc-test-base.h:240] got call: sleep_micros: 500 pattern: 4294967295 num_repetitions: 2097152 sidecar_idx: 0
I20260924 14:35:24.705160 27067 rpc-test-base.h:240] got call: sleep_micros: 500 pattern: 4294967295 num_repetitions: 2097152 sidecar_idx: 0
I20260924 14:35:24.914678 27067 rpc-test-base.h:240] got call: sleep_micros: 500 pattern: 4294967295 num_repetitions: 2097152 sidecar_idx: 0
I20260924 14:35:25.110524 27068 rpc-test-base.h:240] got call: sleep_micros: 500 pattern: 4294967295 num_repetitions: 2097152 sidecar_idx: 0
I20260924 14:35:25.305366 27067 rpc-test-base.h:240] got call: sleep_micros: 500 pattern: 4294967295 num_repetitions: 2097152 sidecar_idx: 0
W20260924 14:35:25.331664 27061 connection.cc:196] Error closing socket: Network error: TlsSocket::Close: Broken pipe
W20260924 14:35:25.353931 27061 connection.cc:441] server connection from unix:<unnamed> torn down before Call kudu.rpc.GenericCalculatorService.SleepWithSidecar from unix:<unnamed> (request call id 8) could send its response
W20260924 14:35:25.446201 27061 connection.cc:441] server connection from unix:<unnamed> torn down before Call kudu.rpc.GenericCalculatorService.SleepWithSidecar from unix:<unnamed> (request call id 9) could send its response
[ OK ] Parameters/TestRpc.TestCancellationAsync/SSL_UnixSocket (2080 ms)
[ RUN ] Parameters/TestRpc.TestPerformanceBySocketType/SSL_UnixSocket
I20260924 14:35:25.541565 27089 acceptor_pool.cc:254] collecting diagnostics on the listening RPC socket unix:/tmp/dist-test-taskV7NmEt/test-tmp/rpc-test-90fb04e0860640749d26178766fa64a2.sock every 8 connection(s)
I20260924 14:35:25.542272 27090 acceptor_pool.cc:254] collecting diagnostics on the listening RPC socket unix:/tmp/dist-test-taskV7NmEt/test-tmp/rpc-test-90fb04e0860640749d26178766fa64a2.sock every 8 connection(s)
I20260924 14:35:25.545333 26630 rpc-test.cc:1846] Connecting to unix:/tmp/dist-test-taskV7NmEt/test-tmp/rpc-test-90fb04e0860640749d26178766fa64a2.sock
I20260924 14:35:47.078382 26630 rpc-test.cc:1859] Sending 1024MB via ssl-enabled unix socket: real 21.515s user 19.879s sys 12.782s
I20260924 14:36:08.428567 26630 rpc-test.cc:1859] Sending 1024MB via ssl-enabled unix socket: real 21.350s user 19.359s sys 12.893s
I20260924 14:36:29.794992 26630 rpc-test.cc:1859] Sending 1024MB via ssl-enabled unix socket: real 21.366s user 19.421s sys 12.859s
I20260924 14:36:51.793578 26630 rpc-test.cc:1859] Sending 1024MB via ssl-enabled unix socket: real 21.998s user 20.257s sys 13.359s
I20260924 14:37:13.634016 26630 rpc-test.cc:1859] Sending 1024MB via ssl-enabled unix socket: real 21.840s user 20.163s sys 13.274s
W20260924 14:37:13.642187 27086 connection.cc:196] Error closing socket: Network error: TlsSocket::Close: Broken pipe
[ OK ] Parameters/TestRpc.TestPerformanceBySocketType/SSL_UnixSocket (108198 ms)
[----------] 20 tests from Parameters/TestRpc (272703 ms total)
[----------] 1 test from Parameters/TestRpcSocketTxRxQueue
[ RUN ] Parameters/TestRpcSocketTxRxQueue.AcceptorRxQueueSizeMetric/0
I20260924 14:37:13.673332 27126 acceptor_pool.cc:254] collecting diagnostics on the listening RPC socket 0.0.0.0:43267 every 1 connection(s)
I20260924 14:37:13.674175 27127 acceptor_pool.cc:254] collecting diagnostics on the listening RPC socket 0.0.0.0:43267 every 1 connection(s)
W20260924 14:37:13.679966 27122 negotiation.cc:337] Failed RPC negotiation. Trace:
0924 14:37:13.678254 (+ 0us) reactor.cc:625] Submitting negotiation task for server connection from 127.0.0.1:43016 (local address 127.0.0.1:43267)
0924 14:37:13.678753 (+ 499us) server_negotiation.cc:206] Beginning negotiation
0924 14:37:13.678778 (+ 25us) server_negotiation.cc:399] Waiting for connection header
0924 14:37:13.679032 (+ 254us) negotiation.cc:327] Negotiation complete: Network error: Server connection negotiation failed: server connection from 127.0.0.1:43016: BlockingRecv error: recv got EOF from 127.0.0.1:43016 (error 108)
Metrics: {"server-negotiator.queue_time_us":139}
[ OK ] Parameters/TestRpcSocketTxRxQueue.AcceptorRxQueueSizeMetric/0 (32 ms)
[----------] 1 test from Parameters/TestRpcSocketTxRxQueue (32 ms total)
[----------] Global test environment tear-down
[==========] 21 tests from 2 test suites ran. (272736 ms total)
[ PASSED ] 20 tests.
[ FAILED ] 1 test, listed below:
[ FAILED ] Parameters/TestRpc.TestCallWithChainCertAndChainCA/SSL_UnixSocket, where GetParam() = (true, true)
1 FAILED TEST