Parameters/TestRpc.TestCallWithChainCertAndRootCA/SSL_TCP: /data0/somelongdirectorytoavoidrpathissues/src/kudu/src/kudu/rpc/rpc-test.cc:303: Failure
Failed
Bad status: Runtime error: could not verify certificate chain (error with cert: subject=CN = localhost, ST = sadfjas, C = AS, emailAddress = sdflkdsajf, O = lskdfjlsad, OU = sldfkja, issuer=C = AS, ST = ASDfkjdhf, L = lskdjf, O = saldfja, OU = skdjf, CN = localhost, emailAddress = sadjflkadsj): : certificate has expired
Google Test trace:
/data0/somelongdirectorytoavoidrpathissues/src/kudu/src/kudu/rpc/rpc-test.cc:300: Connecting to 0.0.0.0:43465
I20260925 06:28:40.652871 390 test_util.cc:175] -----------------------------------------------
I20260925 06:28:40.653066 390 test_util.cc:176] Had fatal failures, leaving test files at /tmp/dist-test-taskx8M6bL/test-tmp/rpc-test.1.Parameters_TestRpc.TestCallWithChainCertAndRootCA_SSL_TCP.1790317719228936-390-0
Note: This is test shard 2 of 8.
[==========] Running 21 tests from 2 test suites.
[----------] Global test environment set-up.
[----------] 1 test from TestRpc
[ RUN ] TestRpc.TestMethodsByName
[ OK ] TestRpc.TestMethodsByName (6 ms)
[----------] 1 test from TestRpc (6 ms total)
[----------] 20 tests from Parameters/TestRpc
[ RUN ] Parameters/TestRpc.TestAcceptorPoolStartStop/SSL_TCP
WARNING: Logging before InitGoogleLogging() is written to STDERR
I20260925 06:28:39.335383 405 acceptor_pool.cc:254] collecting diagnostics on the listening RPC socket 0.0.0.0:38287 every 8 connection(s)
I20260925 06:28:39.336880 406 acceptor_pool.cc:254] collecting diagnostics on the listening RPC socket 0.0.0.0:38287 every 8 connection(s)
I20260925 06:28:40.416112 417 acceptor_pool.cc:254] collecting diagnostics on the listening RPC socket 0.0.0.0:41199 every 8 connection(s)
I20260925 06:28:40.417984 418 acceptor_pool.cc:254] collecting diagnostics on the listening RPC socket 0.0.0.0:41199 every 8 connection(s)
I20260925 06:28:40.450317 428 acceptor_pool.cc:254] collecting diagnostics on the listening RPC socket 0.0.0.0:37053 every 8 connection(s)
I20260925 06:28:40.451526 429 acceptor_pool.cc:254] collecting diagnostics on the listening RPC socket 0.0.0.0:37053 every 8 connection(s)
I20260925 06:28:40.472139 439 acceptor_pool.cc:254] collecting diagnostics on the listening RPC socket 0.0.0.0:38707 every 8 connection(s)
I20260925 06:28:40.472817 440 acceptor_pool.cc:254] collecting diagnostics on the listening RPC socket 0.0.0.0:38707 every 8 connection(s)
I20260925 06:28:40.504853 450 acceptor_pool.cc:254] collecting diagnostics on the listening RPC socket 0.0.0.0:37701 every 8 connection(s)
I20260925 06:28:40.505553 451 acceptor_pool.cc:254] collecting diagnostics on the listening RPC socket 0.0.0.0:37701 every 8 connection(s)
[ OK ] Parameters/TestRpc.TestAcceptorPoolStartStop/SSL_TCP (1226 ms)
[ RUN ] Parameters/TestRpc.TestCall/SSL_TCP
I20260925 06:28:40.534929 463 acceptor_pool.cc:254] collecting diagnostics on the listening RPC socket 0.0.0.0:36943 every 8 connection(s)
I20260925 06:28:40.537307 464 acceptor_pool.cc:254] collecting diagnostics on the listening RPC socket 0.0.0.0:36943 every 8 connection(s)
I20260925 06:28:40.542455 390 rpc-test.cc:234] Connecting to 0.0.0.0:36943
[ OK ] Parameters/TestRpc.TestCall/SSL_TCP (97 ms)
[ RUN ] Parameters/TestRpc.TestCallWithChainCertAndRootCA/SSL_TCP
I20260925 06:28:40.632953 488 acceptor_pool.cc:254] collecting diagnostics on the listening RPC socket 0.0.0.0:43465 every 8 connection(s)
I20260925 06:28:40.633565 489 acceptor_pool.cc:254] collecting diagnostics on the listening RPC socket 0.0.0.0:43465 every 8 connection(s)
/data0/somelongdirectorytoavoidrpathissues/src/kudu/src/kudu/rpc/rpc-test.cc:303: Failure
Failed
Bad status: Runtime error: could not verify certificate chain (error with cert: subject=CN = localhost, ST = sadfjas, C = AS, emailAddress = sdflkdsajf, O = lskdfjlsad, OU = sldfkja, issuer=C = AS, ST = ASDfkjdhf, L = lskdjf, O = saldfja, OU = skdjf, CN = localhost, emailAddress = sadjflkadsj): : certificate has expired
Google Test trace:
/data0/somelongdirectorytoavoidrpathissues/src/kudu/src/kudu/rpc/rpc-test.cc:300: Connecting to 0.0.0.0:43465
I20260925 06:28:40.652871 390 test_util.cc:175] -----------------------------------------------
I20260925 06:28:40.653066 390 test_util.cc:176] Had fatal failures, leaving test files at /tmp/dist-test-taskx8M6bL/test-tmp/rpc-test.1.Parameters_TestRpc.TestCallWithChainCertAndRootCA_SSL_TCP.1790317719228936-390-0
[ FAILED ] Parameters/TestRpc.TestCallWithChainCertAndRootCA/SSL_TCP, where GetParam() = (true, false) (41 ms)
[ RUN ] Parameters/TestRpc.TestCallWithBadPasswordProtectedKey/SSL_TCP
[ OK ] Parameters/TestRpc.TestCallWithBadPasswordProtectedKey/SSL_TCP (29 ms)
[ RUN ] Parameters/TestRpc.TestInvalidMethodCall/SSL_TCP
I20260925 06:28:40.713719 525 acceptor_pool.cc:254] collecting diagnostics on the listening RPC socket 0.0.0.0:33753 every 8 connection(s)
I20260925 06:28:40.714495 526 acceptor_pool.cc:254] collecting diagnostics on the listening RPC socket 0.0.0.0:33753 every 8 connection(s)
I20260925 06:28:40.717760 390 rpc-test.cc:406] Connecting to 0.0.0.0:33753
[ OK ] Parameters/TestRpc.TestInvalidMethodCall/SSL_TCP (83 ms)
[ RUN ] Parameters/TestRpc.TestHighFDs/SSL_TCP
I20260925 06:28:40.989014 550 acceptor_pool.cc:254] collecting diagnostics on the listening RPC socket 0.0.0.0:37079 every 8 connection(s)
I20260925 06:28:40.989718 551 acceptor_pool.cc:254] collecting diagnostics on the listening RPC socket 0.0.0.0:37079 every 8 connection(s)
[ OK ] Parameters/TestRpc.TestHighFDs/SSL_TCP (270 ms)
[ RUN ] Parameters/TestRpc.TestConnectionAlwaysKeepalive/SSL_TCP
I20260925 06:28:41.060274 573 acceptor_pool.cc:254] collecting diagnostics on the listening RPC socket 0.0.0.0:36195 every 8 connection(s)
I20260925 06:28:41.060943 574 acceptor_pool.cc:254] collecting diagnostics on the listening RPC socket 0.0.0.0:36195 every 8 connection(s)
I20260925 06:28:41.064080 390 rpc-test.cc:532] Connecting to 0.0.0.0:36195
[ OK ] Parameters/TestRpc.TestConnectionAlwaysKeepalive/SSL_TCP (3061 ms)
[ RUN ] Parameters/TestRpc.TestReopenOutboundConnections/SSL_TCP
I20260925 06:28:44.125689 596 acceptor_pool.cc:254] collecting diagnostics on the listening RPC socket 0.0.0.0:33613 every 8 connection(s)
I20260925 06:28:44.126376 597 acceptor_pool.cc:254] collecting diagnostics on the listening RPC socket 0.0.0.0:33613 every 8 connection(s)
I20260925 06:28:44.129367 390 rpc-test.cc:658] Connecting to 0.0.0.0:33613
[ OK ] Parameters/TestRpc.TestReopenOutboundConnections/SSL_TCP (396 ms)
[ RUN ] Parameters/TestRpc.TestConnectionNetworkPlane/SSL_TCP
I20260925 06:28:44.528697 619 acceptor_pool.cc:254] collecting diagnostics on the listening RPC socket 0.0.0.0:34785 every 8 connection(s)
I20260925 06:28:44.529474 620 acceptor_pool.cc:254] collecting diagnostics on the listening RPC socket 0.0.0.0:34785 every 8 connection(s)
I20260925 06:28:44.532593 390 rpc-test.cc:772] Connecting to 0.0.0.0:34785
[ OK ] Parameters/TestRpc.TestConnectionNetworkPlane/SSL_TCP (120 ms)
[ RUN ] Parameters/TestRpc.TestTCPKeepalive/SSL_TCP
I20260925 06:28:44.632194 644 acceptor_pool.cc:254] collecting diagnostics on the listening RPC socket 0.0.0.0:38213 every 8 connection(s)
I20260925 06:28:44.632887 645 acceptor_pool.cc:254] collecting diagnostics on the listening RPC socket 0.0.0.0:38213 every 8 connection(s)
I20260925 06:28:44.675313 648 rpc-test-base.h:222] got call: sleep_micros: 8000000 deferred: true
I20260925 06:28:52.679286 648 rpcz_store.cc:275] Call kudu.rpc.GenericCalculatorService.Sleep from 127.0.0.1:60464 (request call id 0) took 8004 ms. Trace:
I20260925 06:28:52.679684 648 rpcz_store.cc:276] 0925 06:28:44.675058 (+ 0us) service_pool.cc:170] Inserting onto call queue
0925 06:28:44.675160 (+ 102us) service_pool.cc:227] Handling call
0925 06:28:52.679112 (+8003952us) inbound_call.cc:173] Queueing success response
Metrics: {}
[ OK ] Parameters/TestRpc.TestTCPKeepalive/SSL_TCP (8076 ms)
[ RUN ] Parameters/TestRpc.TestMaxSmallSidecars/SSL_TCP
I20260925 06:28:52.716501 670 acceptor_pool.cc:254] collecting diagnostics on the listening RPC socket 0.0.0.0:42239 every 8 connection(s)
I20260925 06:28:52.717175 671 acceptor_pool.cc:254] collecting diagnostics on the listening RPC socket 0.0.0.0:42239 every 8 connection(s)
[ OK ] Parameters/TestRpc.TestMaxSmallSidecars/SSL_TCP (191 ms)
[ RUN ] Parameters/TestRpc.TestCallTimeout/SSL_TCP
I20260925 06:28:52.899127 695 acceptor_pool.cc:254] collecting diagnostics on the listening RPC socket 0.0.0.0:35701 every 8 connection(s)
I20260925 06:28:52.899797 696 acceptor_pool.cc:254] collecting diagnostics on the listening RPC socket 0.0.0.0:35701 every 8 connection(s)
I20260925 06:28:52.928360 390 rpc-test-base.h:595] status: Timed out: connection negotiation to 0.0.0.0:35701 for RPC Sleep timed out after 0.000s (ON_OUTBOUND_QUEUE), seconds elapsed: 0.00258355
I20260925 06:28:52.935732 699 rpc-test-base.h:222] got call: sleep_micros: 700000
I20260925 06:28:53.129616 390 rpc-test-base.h:595] status: Timed out: Sleep RPC to 0.0.0.0:35701 timed out after 0.200s (SENT), seconds elapsed: 0.200897
I20260925 06:28:53.131150 698 rpc-test-base.h:222] got call: sleep_micros: 2000000
W20260925 06:28:53.636389 699 rpcz_store.cc:267] Call kudu.rpc.GenericCalculatorService.Sleep from 127.0.0.1:40872 (request call id 1) took 700 ms (client timeout 200 ms). Trace:
W20260925 06:28:53.636727 699 rpcz_store.cc:269] 0925 06:28:52.935583 (+ 0us) service_pool.cc:170] Inserting onto call queue
0925 06:28:52.935677 (+ 94us) service_pool.cc:227] Handling call
0925 06:28:53.636321 (+700644us) inbound_call.cc:173] Queueing success response
Metrics: {}
I20260925 06:28:54.631953 390 rpc-test-base.h:595] status: Timed out: Sleep RPC to 0.0.0.0:35701 timed out after 1.500s (SENT), seconds elapsed: 1.50197
W20260925 06:28:55.131767 698 rpcz_store.cc:267] Call kudu.rpc.GenericCalculatorService.Sleep from 127.0.0.1:40872 (request call id 2) took 2000 ms (client timeout 1500 ms). Trace:
W20260925 06:28:55.132087 698 rpcz_store.cc:269] 0925 06:28:53.130857 (+ 0us) service_pool.cc:170] Inserting onto call queue
0925 06:28:53.131002 (+ 145us) service_pool.cc:227] Handling call
0925 06:28:55.131716 (+2000714us) inbound_call.cc:173] Queueing success response
Metrics: {}
W20260925 06:28:55.132761 692 connection.cc:441] server connection from 127.0.0.1:40872 torn down before Call kudu.rpc.GenericCalculatorService.Sleep from 127.0.0.1:40872 (request call id 2) could send its response
[ OK ] Parameters/TestRpc.TestCallTimeout/SSL_TCP (2254 ms)
[ RUN ] Parameters/TestRpc.TestServerShutsDown/SSL_TCP
I20260925 06:28:55.139262 390 rpc-test.cc:1125] Connecting to 0.0.0.0:33329
W20260925 06:28:55.147765 712 negotiation.cc:337] Failed RPC negotiation. Trace:
0925 06:28:55.146228 (+ 0us) reactor.cc:625] Submitting negotiation task for client connection to 0.0.0.0:33329 (local address 127.0.0.1:41540)
0925 06:28:55.146670 (+ 442us) negotiation.cc:107] Waiting for socket to connect
0925 06:28:55.146702 (+ 32us) client_negotiation.cc:174] Beginning negotiation
0925 06:28:55.146931 (+ 229us) client_negotiation.cc:252] Sending NEGOTIATE NegotiatePB request
0925 06:28:55.147168 (+ 237us) negotiation.cc:327] Negotiation complete: Network error: Client connection negotiation failed: client connection to 0.0.0.0:33329: BlockingWrite error: write error: Broken pipe (error 32)
Metrics: {"client-negotiator.queue_time_us":116}
[ OK ] Parameters/TestRpc.TestServerShutsDown/SSL_TCP (12 ms)
[ RUN ] Parameters/TestRpc.TimedOutOnResponseMetric/SSL_TCP
I20260925 06:28:55.170902 729 acceptor_pool.cc:254] collecting diagnostics on the listening RPC socket 0.0.0.0:43811 every 8 connection(s)
I20260925 06:28:55.171550 730 acceptor_pool.cc:254] collecting diagnostics on the listening RPC socket 0.0.0.0:43811 every 8 connection(s)
W20260925 06:28:55.424878 733 rpcz_store.cc:267] Call kudu.rpc_test.CalculatorService.Sleep from 127.0.0.1:60602 (request call id 3) took 50 ms (client timeout 25 ms). Trace:
W20260925 06:28:55.425179 733 rpcz_store.cc:269] 0925 06:28:55.374237 (+ 0us) service_pool.cc:170] Inserting onto call queue
0925 06:28:55.374364 (+ 127us) service_pool.cc:227] Handling call
0925 06:28:55.424808 (+ 50444us) inbound_call.cc:173] Queueing success response
Related trace 'test_child':
Metrics: {"test_sleep_us":50000,"child_traces":[["test_child",{"related_trace_metric":1}]]}
W20260925 06:28:55.484371 733 rpcz_store.cc:267] Call kudu.rpc_test.CalculatorService.Sleep from 127.0.0.1:60602 (request call id 4) took 50 ms (client timeout 50 ms). Trace:
W20260925 06:28:55.484732 733 rpcz_store.cc:269] 0925 06:28:55.433747 (+ 0us) service_pool.cc:170] Inserting onto call queue
0925 06:28:55.433883 (+ 136us) service_pool.cc:227] Handling call
0925 06:28:55.484295 (+ 50412us) inbound_call.cc:173] Queueing success response
Related trace 'test_child':
Metrics: {"test_sleep_us":50000,"child_traces":[["test_child",{"related_trace_metric":1}]]}
[ OK ] Parameters/TestRpc.TimedOutOnResponseMetric/SSL_TCP (342 ms)
[ RUN ] Parameters/TestRpc.AcceptorDispatchingTimesMetric/SSL_TCP
I20260925 06:28:55.504704 754 acceptor_pool.cc:254] collecting diagnostics on the listening RPC socket 0.0.0.0:35157 every 8 connection(s)
I20260925 06:28:55.505302 755 acceptor_pool.cc:254] collecting diagnostics on the listening RPC socket 0.0.0.0:35157 every 8 connection(s)
W20260925 06:28:55.509812 750 negotiation.cc:337] Failed RPC negotiation. Trace:
0925 06:28:55.508778 (+ 0us) reactor.cc:625] Submitting negotiation task for server connection from 127.0.0.1:52360 (local address 127.0.0.1:35157)
0925 06:28:55.509153 (+ 375us) server_negotiation.cc:206] Beginning negotiation
0925 06:28:55.509170 (+ 17us) server_negotiation.cc:399] Waiting for connection header
0925 06:28:55.509393 (+ 223us) negotiation.cc:327] Negotiation complete: Network error: Server connection negotiation failed: server connection from 127.0.0.1:52360: BlockingRecv error: recv got EOF from 127.0.0.1:52360 (error 108)
Metrics: {"server-negotiator.queue_time_us":99}
[ OK ] Parameters/TestRpc.AcceptorDispatchingTimesMetric/SSL_TCP (21 ms)
[ RUN ] Parameters/TestRpc.TestRpcCallbackDestroysMessenger/SSL_TCP
[ OK ] Parameters/TestRpc.TestRpcCallbackDestroysMessenger/SSL_TCP (34 ms)
[ RUN ] Parameters/TestRpc.TestApplicationFeatureFlag/SSL_TCP
I20260925 06:28:55.571803 779 acceptor_pool.cc:254] collecting diagnostics on the listening RPC socket 0.0.0.0:36237 every 8 connection(s)
I20260925 06:28:55.572552 780 acceptor_pool.cc:254] collecting diagnostics on the listening RPC socket 0.0.0.0:36237 every 8 connection(s)
W20260925 06:28:55.600739 776 messenger.cc:357] Unable to handle RPC call: Not implemented: call requires unsupported application feature flags: 99
[ OK ] Parameters/TestRpc.TestApplicationFeatureFlag/SSL_TCP (58 ms)
[ RUN ] Parameters/TestRpc.TestCancellation/SSL_TCP
I20260925 06:28:55.622398 804 acceptor_pool.cc:254] collecting diagnostics on the listening RPC socket 0.0.0.0:43745 every 8 connection(s)
I20260925 06:28:55.623066 805 acceptor_pool.cc:254] collecting diagnostics on the listening RPC socket 0.0.0.0:43745 every 8 connection(s)
I20260925 06:28:55.626044 390 rpc-test.cc:1648] Connecting to 0.0.0.0:43745
I20260925 06:28:55.724574 390 rpc-test-base.h:595] status: Aborted: Sleep RPC to 0.0.0.0:43745 is cancelled in state READY, seconds elapsed: 0.000364198
I20260925 06:28:55.861083 390 rpc-test-base.h:595] status: Aborted: Sleep RPC to 0.0.0.0:43745 is cancelled in state SENT, seconds elapsed: 0.000995043
I20260925 06:28:55.904498 807 rpc-test-base.h:222] got call: sleep_micros: 510000
I20260925 06:28:56.017628 390 rpc-test-base.h:595] status: Aborted: Sleep RPC to 0.0.0.0:43745 is cancelled in state SENT, seconds elapsed: 0.00084913
I20260925 06:28:56.058074 806 rpc-test-base.h:222] got call: sleep_micros: 510000
I20260925 06:28:56.174692 390 rpc-test-base.h:595] status: Aborted: Sleep RPC to 0.0.0.0:43745 is cancelled in state SENT, seconds elapsed: 0.000883207
W20260925 06:28:56.213323 808 rpcz_store.cc:267] Call kudu.rpc.GenericCalculatorService.Sleep from 127.0.0.1:49860 (request call id 11) took 14 ms (client timeout 10 ms). Trace:
W20260925 06:28:56.213614 808 rpcz_store.cc:269] 0925 06:28:56.198515 (+ 0us) service_pool.cc:170] Inserting onto call queue
0925 06:28:56.213042 (+ 14527us) service_pool.cc:214] Skipping call since client already timed out
0925 06:28:56.213153 (+ 111us) inbound_call.cc:173] Queueing failure response
Metrics: {}
I20260925 06:28:56.214119 808 rpc-test-base.h:222] got call: sleep_micros: 1500000
W20260925 06:28:56.415145 807 rpcz_store.cc:267] Call kudu.rpc.GenericCalculatorService.Sleep from 127.0.0.1:49860 (request call id 3) took 511 ms (client timeout 10 ms). Trace:
W20260925 06:28:56.415438 807 rpcz_store.cc:269] 0925 06:28:55.904246 (+ 0us) service_pool.cc:170] Inserting onto call queue
0925 06:28:55.904425 (+ 179us) service_pool.cc:227] Handling call
0925 06:28:56.415093 (+510668us) inbound_call.cc:173] Queueing success response
Metrics: {}
W20260925 06:28:56.568748 806 rpcz_store.cc:267] Call kudu.rpc.GenericCalculatorService.Sleep from 127.0.0.1:49860 (request call id 7) took 511 ms (client timeout 10 ms). Trace:
W20260925 06:28:56.569043 806 rpcz_store.cc:269] 0925 06:28:56.057828 (+ 0us) service_pool.cc:170] Inserting onto call queue
0925 06:28:56.058006 (+ 178us) service_pool.cc:227] Handling call
0925 06:28:56.568699 (+510693us) inbound_call.cc:173] Queueing success response
Metrics: {}
I20260925 06:28:57.176942 390 rpc-test-base.h:595] status: Timed out: Sleep RPC to 0.0.0.0:43745 timed out after 1.000s (SENT), seconds elapsed: 1.00189
I20260925 06:28:57.178267 806 rpc-test-base.h:222] got call: sleep_micros: 1500000
W20260925 06:28:57.714635 808 rpcz_store.cc:267] Call kudu.rpc.GenericCalculatorService.Sleep from 127.0.0.1:49860 (request call id 12) took 1515 ms (client timeout 1000 ms). Trace:
W20260925 06:28:57.714948 808 rpcz_store.cc:269] 0925 06:28:56.198849 (+ 0us) service_pool.cc:170] Inserting onto call queue
0925 06:28:56.214087 (+ 15238us) service_pool.cc:227] Handling call
0925 06:28:57.714508 (+1500421us) inbound_call.cc:173] Queueing success response
Metrics: {}
I20260925 06:28:58.179436 390 rpc-test-base.h:595] status: Timed out: Sleep RPC to 0.0.0.0:43745 timed out after 1.000s (SENT), seconds elapsed: 1.00218
W20260925 06:28:58.180998 803 messenger.cc:357] Unable to handle RPC call: Not implemented: call requires unsupported application feature flags: 99, 1
W20260925 06:28:58.182391 803 messenger.cc:357] Unable to handle RPC call: Not implemented: call requires unsupported application feature flags: 99, 1
W20260925 06:28:58.678737 806 rpcz_store.cc:267] Call kudu.rpc.GenericCalculatorService.Sleep from 127.0.0.1:49860 (request call id 13) took 1500 ms (client timeout 1000 ms). Trace:
W20260925 06:28:58.679075 806 rpcz_store.cc:269] 0925 06:28:57.178071 (+ 0us) service_pool.cc:170] Inserting onto call queue
0925 06:28:57.178222 (+ 151us) service_pool.cc:227] Handling call
0925 06:28:58.678686 (+1500464us) inbound_call.cc:173] Queueing success response
Metrics: {}
W20260925 06:28:58.679641 803 connection.cc:441] server connection from 127.0.0.1:49860 torn down before Call kudu.rpc.GenericCalculatorService.Sleep from 127.0.0.1:49860 (request call id 13) could send its response
[ OK ] Parameters/TestRpc.TestCancellation/SSL_TCP (3077 ms)
[ RUN ] Parameters/TestRpc.TestCancellationMultiThreads/SSL_TCP
I20260925 06:28:58.719450 829 acceptor_pool.cc:254] collecting diagnostics on the listening RPC socket 0.0.0.0:43171 every 8 connection(s)
I20260925 06:28:58.720103 830 acceptor_pool.cc:254] collecting diagnostics on the listening RPC socket 0.0.0.0:43171 every 8 connection(s)
I20260925 06:28:58.723114 390 rpc-test.cc:1808] Connecting to 0.0.0.0:43171
I20260925 06:28:58.860985 843 test_util.cc:268] Using random seed: -723770977
I20260925 06:28:58.862435 844 test_util.cc:268] Using random seed: -723769531
I20260925 06:28:58.863734 845 test_util.cc:268] Using random seed: -723768225
I20260925 06:28:58.864998 846 test_util.cc:268] Using random seed: -723766980
I20260925 06:28:58.866716 847 test_util.cc:268] Using random seed: -723765375
I20260925 06:28:58.867929 848 test_util.cc:268] Using random seed: -723764152
I20260925 06:28:58.869349 849 test_util.cc:268] Using random seed: -723762743
I20260925 06:28:58.871407 850 test_util.cc:268] Using random seed: -723761296
I20260925 06:28:58.873015 851 test_util.cc:268] Using random seed: -723759086
I20260925 06:28:58.874761 852 test_util.cc:268] Using random seed: -723757542
I20260925 06:28:58.876227 853 test_util.cc:268] Using random seed: -723756264
I20260925 06:28:58.877375 854 test_util.cc:268] Using random seed: -723754695
I20260925 06:28:58.879186 855 test_util.cc:268] Using random seed: -723752896
I20260925 06:28:58.881995 856 test_util.cc:268] Using random seed: -723750082
I20260925 06:28:58.884117 857 test_util.cc:268] Using random seed: -723747978
I20260925 06:28:58.886566 858 test_util.cc:268] Using random seed: -723745547
I20260925 06:28:58.888638 859 test_util.cc:268] Using random seed: -723743440
I20260925 06:28:58.891153 860 test_util.cc:268] Using random seed: -723741460
I20260925 06:28:58.893265 861 test_util.cc:268] Using random seed: -723739313
I20260925 06:28:58.894796 862 test_util.cc:268] Using random seed: -723737304
I20260925 06:28:58.897851 863 test_util.cc:268] Using random seed: -723734300
I20260925 06:28:58.899434 864 test_util.cc:268] Using random seed: -723732697
I20260925 06:28:58.901428 865 test_util.cc:268] Using random seed: -723730708
I20260925 06:28:58.904021 866 test_util.cc:268] Using random seed: -723728125
I20260925 06:28:58.906486 867 test_util.cc:268] Using random seed: -723725650
I20260925 06:28:58.909019 868 test_util.cc:268] Using random seed: -723723108
I20260925 06:28:58.911020 869 test_util.cc:268] Using random seed: -723721108
I20260925 06:28:58.913316 870 test_util.cc:268] Using random seed: -723718793
I20260925 06:28:58.916940 871 test_util.cc:268] Using random seed: -723715160
I20260925 06:28:58.919127 872 test_util.cc:268] Using random seed: -723713007
[ OK ] Parameters/TestRpc.TestCancellationMultiThreads/SSL_TCP (17193 ms)
[ RUN ] Parameters/TestRpc.TestCallId/SSL_TCP
I20260925 06:29:15.897187 886 acceptor_pool.cc:254] collecting diagnostics on the listening RPC socket 0.0.0.0:44241 every 8 connection(s)
I20260925 06:29:15.897890 887 acceptor_pool.cc:254] collecting diagnostics on the listening RPC socket 0.0.0.0:44241 every 8 connection(s)
[ OK ] Parameters/TestRpc.TestCallId/SSL_TCP (88 ms)
[----------] 20 tests from Parameters/TestRpc (36681 ms total)
[----------] Global test environment tear-down
[==========] 21 tests from 2 test suites ran. (36688 ms total)
[ PASSED ] 20 tests.
[ FAILED ] 1 test, listed below:
[ FAILED ] Parameters/TestRpc.TestCallWithChainCertAndRootCA/SSL_TCP, where GetParam() = (true, false)
1 FAILED TEST