Diagnosed failure
Parameters/TestRpc.TestCallWithChainCertAndChainCA/SSL_UnixSocket: /data0/somelongdirectorytoavoidrpathissues/src/kudu/src/kudu/rpc/rpc-test.cc:270: Failure
Failed
Bad status: Runtime error: could not verify certificate chain (error with cert: subject=CN = localhost, ST = sadfjas, C = AS, emailAddress = sdflkdsajf, O = lskdfjlsad, OU = sldfkja, issuer=C = AS, ST = ASDfkjdhf, L = lskdjf, O = saldfja, OU = skdjf, CN = localhost, emailAddress = sadjflkadsj): : certificate has expired
Google Test trace:
/data0/somelongdirectorytoavoidrpathissues/src/kudu/src/kudu/rpc/rpc-test.cc:267: Connecting to unix:/tmp/dist-test-taskIrsq91/test-tmp/rpc-test-d5cff0e0d0134fb2a35e9fc2012a8e98.sock
I20260928 02:57:17.155577 16508 test_util.cc:175] -----------------------------------------------
I20260928 02:57:17.155660 16508 test_util.cc:176] Had fatal failures, leaving test files at /tmp/dist-test-taskIrsq91/test-tmp/rpc-test.6.Parameters_TestRpc.TestCallWithChainCertAndChainCA_SSL_UnixSocket.1790564237047573-16508-0
Full log
Note: This is test shard 7 of 8.
[==========] Running 21 tests from 2 test suites.
[----------] Global test environment set-up.
[----------] 20 tests from Parameters/TestRpc
[ RUN ] Parameters/TestRpc.TestMessengerCreateDestroy/SSL_UnixSocket
WARNING: Logging before InitGoogleLogging() is written to STDERR
I20260928 02:57:17.096349 16508 rpc-test.cc:169] started messenger TestCreateDestroy
[ OK ] Parameters/TestRpc.TestMessengerCreateDestroy/SSL_UnixSocket (29 ms)
[ RUN ] Parameters/TestRpc.TestNegotiationDeadlock/SSL_UnixSocket
I20260928 02:57:17.108610 16528 acceptor_pool.cc:254] collecting diagnostics on the listening RPC socket unix:/tmp/dist-test-taskIrsq91/test-tmp/rpc-test-fcc713e4d5c44d24aa6049e8c81da663.sock every 8 connection(s)
I20260928 02:57:17.108922 16529 acceptor_pool.cc:254] collecting diagnostics on the listening RPC socket unix:/tmp/dist-test-taskIrsq91/test-tmp/rpc-test-fcc713e4d5c44d24aa6049e8c81da663.sock every 8 connection(s)
[ OK ] Parameters/TestRpc.TestNegotiationDeadlock/SSL_UnixSocket (28 ms)
[ RUN ] Parameters/TestRpc.TestCallWithChainCertAndChainCA/SSL_UnixSocket
I20260928 02:57:17.144271 16544 acceptor_pool.cc:254] collecting diagnostics on the listening RPC socket unix:/tmp/dist-test-taskIrsq91/test-tmp/rpc-test-d5cff0e0d0134fb2a35e9fc2012a8e98.sock every 8 connection(s)
I20260928 02:57:17.144615 16545 acceptor_pool.cc:254] collecting diagnostics on the listening RPC socket unix:/tmp/dist-test-taskIrsq91/test-tmp/rpc-test-d5cff0e0d0134fb2a35e9fc2012a8e98.sock every 8 connection(s)
/data0/somelongdirectorytoavoidrpathissues/src/kudu/src/kudu/rpc/rpc-test.cc:270: Failure
Failed
Bad status: Runtime error: could not verify certificate chain (error with cert: subject=CN = localhost, ST = sadfjas, C = AS, emailAddress = sdflkdsajf, O = lskdfjlsad, OU = sldfkja, issuer=C = AS, ST = ASDfkjdhf, L = lskdjf, O = saldfja, OU = skdjf, CN = localhost, emailAddress = sadjflkadsj): : certificate has expired
Google Test trace:
/data0/somelongdirectorytoavoidrpathissues/src/kudu/src/kudu/rpc/rpc-test.cc:267: Connecting to unix:/tmp/dist-test-taskIrsq91/test-tmp/rpc-test-d5cff0e0d0134fb2a35e9fc2012a8e98.sock
I20260928 02:57:17.155577 16508 test_util.cc:175] -----------------------------------------------
I20260928 02:57:17.155660 16508 test_util.cc:176] Had fatal failures, leaving test files at /tmp/dist-test-taskIrsq91/test-tmp/rpc-test.6.Parameters_TestRpc.TestCallWithChainCertAndChainCA_SSL_UnixSocket.1790564237047573-16508-0
[ FAILED ] Parameters/TestRpc.TestCallWithChainCertAndChainCA/SSL_UnixSocket, where GetParam() = (true, true) (27 ms)
[ RUN ] Parameters/TestRpc.TestCallWithPasswordProtectedKey/SSL_UnixSocket
I20260928 02:57:17.183564 16569 acceptor_pool.cc:254] collecting diagnostics on the listening RPC socket unix:/tmp/dist-test-taskIrsq91/test-tmp/rpc-test-bd8c0a150f29487a99ba4cdcb26ad7a8.sock every 8 connection(s)
I20260928 02:57:17.183786 16570 acceptor_pool.cc:254] collecting diagnostics on the listening RPC socket unix:/tmp/dist-test-taskIrsq91/test-tmp/rpc-test-bd8c0a150f29487a99ba4cdcb26ad7a8.sock every 8 connection(s)
W20260928 02:57:17.214099 16566 connection.cc:196] Error closing socket: Network error: TlsSocket::Close: Broken pipe
[ OK ] Parameters/TestRpc.TestCallWithPasswordProtectedKey/SSL_UnixSocket (62 ms)
[ RUN ] Parameters/TestRpc.TestCallToBadServer/SSL_UnixSocket
I20260928 02:57:17.233103 16508 rpc-test.cc:394] Status: Network error: Client connection negotiation failed: client connection to 0.0.0.0:0: connect: Connection refused (error 111)
I20260928 02:57:17.233879 16508 rpc-test.cc:394] Status: Network error: Client connection negotiation failed: client connection to 0.0.0.0:0: connect: Connection refused (error 111)
I20260928 02:57:17.234578 16508 rpc-test.cc:394] Status: Network error: Client connection negotiation failed: client connection to 0.0.0.0:0: connect: Connection refused (error 111)
I20260928 02:57:17.235146 16508 rpc-test.cc:394] Status: Network error: Client connection negotiation failed: client connection to 0.0.0.0:0: connect: Connection refused (error 111)
I20260928 02:57:17.235896 16508 rpc-test.cc:394] Status: Network error: Client connection negotiation failed: client connection to 0.0.0.0:0: connect: Connection refused (error 111)
[ OK ] Parameters/TestRpc.TestCallToBadServer/SSL_UnixSocket (19 ms)
[ RUN ] Parameters/TestRpc.TestWrongService/SSL_UnixSocket
I20260928 02:57:17.275128 16604 acceptor_pool.cc:254] collecting diagnostics on the listening RPC socket unix:/tmp/dist-test-taskIrsq91/test-tmp/rpc-test-c8aed9e4dc644e67a9e2b67e02bde6ef.sock every 8 connection(s)
I20260928 02:57:17.275547 16605 acceptor_pool.cc:254] collecting diagnostics on the listening RPC socket unix:/tmp/dist-test-taskIrsq91/test-tmp/rpc-test-c8aed9e4dc644e67a9e2b67e02bde6ef.sock every 8 connection(s)
I20260928 02:57:17.299685 16601 messenger.cc:345] service WrongServiceName not registered on TestServer
[ OK ] Parameters/TestRpc.TestWrongService/SSL_UnixSocket (66 ms)
[ RUN ] Parameters/TestRpc.TestConnectionKeepalive/SSL_UnixSocket
I20260928 02:57:17.346345 16627 acceptor_pool.cc:254] collecting diagnostics on the listening RPC socket unix:/tmp/dist-test-taskIrsq91/test-tmp/rpc-test-973c957c251a495eacfb3836742e527e.sock every 8 connection(s)
I20260928 02:57:17.346604 16628 acceptor_pool.cc:254] collecting diagnostics on the listening RPC socket unix:/tmp/dist-test-taskIrsq91/test-tmp/rpc-test-973c957c251a495eacfb3836742e527e.sock every 8 connection(s)
I20260928 02:57:17.347589 16508 rpc-test.cc:488] Connecting to unix:/tmp/dist-test-taskIrsq91/test-tmp/rpc-test-973c957c251a495eacfb3836742e527e.sock
W20260928 02:57:17.806743 16640 connection.cc:196] Error closing socket: Network error: TlsSocket::Close: Broken pipe
[ OK ] Parameters/TestRpc.TestConnectionKeepalive/SSL_UnixSocket (1071 ms)
[ RUN ] Parameters/TestRpc.TestClientConnectionMetrics/SSL_UnixSocket
I20260928 02:57:18.386706 16652 acceptor_pool.cc:254] collecting diagnostics on the listening RPC socket unix:/tmp/dist-test-taskIrsq91/test-tmp/rpc-test-112f69616cf941f9806f1a5fdb348cc7.sock every 8 connection(s)
I20260928 02:57:18.387024 16653 acceptor_pool.cc:254] collecting diagnostics on the listening RPC socket unix:/tmp/dist-test-taskIrsq91/test-tmp/rpc-test-112f69616cf941f9806f1a5fdb348cc7.sock every 8 connection(s)
I20260928 02:57:18.388003 16508 rpc-test.cc:569] Connecting to unix:/tmp/dist-test-taskIrsq91/test-tmp/rpc-test-112f69616cf941f9806f1a5fdb348cc7.sock
[ OK ] Parameters/TestRpc.TestClientConnectionMetrics/SSL_UnixSocket (21665 ms)
[ RUN ] Parameters/TestRpc.TestCredentialsPolicy/SSL_UnixSocket
I20260928 02:57:40.060009 16675 acceptor_pool.cc:254] collecting diagnostics on the listening RPC socket unix:/tmp/dist-test-taskIrsq91/test-tmp/rpc-test-f8a70a64410449c4ac196cd770020552.sock every 8 connection(s)
I20260928 02:57:40.060256 16676 acceptor_pool.cc:254] collecting diagnostics on the listening RPC socket unix:/tmp/dist-test-taskIrsq91/test-tmp/rpc-test-f8a70a64410449c4ac196cd770020552.sock every 8 connection(s)
I20260928 02:57:40.061200 16508 rpc-test.cc:700] Connecting to unix:/tmp/dist-test-taskIrsq91/test-tmp/rpc-test-f8a70a64410449c4ac196cd770020552.sock
W20260928 02:57:40.087363 16674 connection.cc:196] Error closing socket: Network error: TlsSocket::Close: Broken pipe
W20260928 02:57:40.094691 16674 connection.cc:196] Error closing socket: Network error: TlsSocket::Close: Broken pipe
[ OK ] Parameters/TestRpc.TestCredentialsPolicy/SSL_UnixSocket (55 ms)
[ RUN ] Parameters/TestRpc.TestCallLongerThanKeepalive/SSL_UnixSocket
I20260928 02:57:40.109354 16700 acceptor_pool.cc:254] collecting diagnostics on the listening RPC socket unix:/tmp/dist-test-taskIrsq91/test-tmp/rpc-test-eec0c686e60f42bea67b635e414f56bb.sock every 8 connection(s)
I20260928 02:57:40.109586 16701 acceptor_pool.cc:254] collecting diagnostics on the listening RPC socket unix:/tmp/dist-test-taskIrsq91/test-tmp/rpc-test-eec0c686e60f42bea67b635e414f56bb.sock every 8 connection(s)
I20260928 02:57:40.128481 16704 rpc-test-base.h:222] got call: sleep_micros: 3000000 deferred: true
I20260928 02:57:43.130137 16704 rpcz_store.cc:275] Call kudu.rpc.GenericCalculatorService.Sleep from unix:<unnamed> (request call id 0) took 3001 ms. Trace:
I20260928 02:57:43.130303 16704 rpcz_store.cc:276] 0928 02:57:40.128376 (+ 0us) service_pool.cc:170] Inserting onto call queue
0928 02:57:40.128433 (+ 57us) service_pool.cc:227] Handling call
0928 02:57:43.130082 (+3001649us) inbound_call.cc:173] Queueing success response
Metrics: {}
[ OK ] Parameters/TestRpc.TestCallLongerThanKeepalive/SSL_UnixSocket (3039 ms)
[ RUN ] Parameters/TestRpc.TestRpcSidecar/SSL_UnixSocket
I20260928 02:57:43.151921 16725 acceptor_pool.cc:254] collecting diagnostics on the listening RPC socket unix:/tmp/dist-test-taskIrsq91/test-tmp/rpc-test-952d8f3239254f01a5431d646412c58f.sock every 8 connection(s)
I20260928 02:57:43.152138 16726 acceptor_pool.cc:254] collecting diagnostics on the listening RPC socket unix:/tmp/dist-test-taskIrsq91/test-tmp/rpc-test-952d8f3239254f01a5431d646412c58f.sock every 8 connection(s)
W20260928 02:57:43.241353 16722 connection.cc:196] Error closing socket: Network error: TlsSocket::Close: Broken pipe
[ OK ] Parameters/TestRpc.TestRpcSidecar/SSL_UnixSocket (108 ms)
[ RUN ] Parameters/TestRpc.TestRpcSidecarLimits/SSL_UnixSocket
I20260928 02:57:45.221485 16750 acceptor_pool.cc:254] collecting diagnostics on the listening RPC socket unix:/tmp/dist-test-taskIrsq91/test-tmp/rpc-test-eaaa9ab60043458fbab71a2f8ac98c4a.sock every 8 connection(s)
I20260928 02:57:45.221763 16751 acceptor_pool.cc:254] collecting diagnostics on the listening RPC socket unix:/tmp/dist-test-taskIrsq91/test-tmp/rpc-test-eaaa9ab60043458fbab71a2f8ac98c4a.sock every 8 connection(s)
W20260928 02:57:45.249732 16508 serialization.cc:72] Serialized kudu.rpc_test.PushStringsRequestPB (2147483654 bytes) is larger than the maximum configured RPC message size (52428800 bytes). Sending anyway, but peer may reject the data.
W20260928 02:57:45.256593 16747 connection.cc:535] server connection from unix:<unnamed> recv error: Network error: RPC frame had a length of 2147483714, but we only support messages up to 52428800 bytes long.
W20260928 02:57:45.256752 16747 connection.cc:158] shutting down server connection from unix:<unnamed> with pending inbound data: 4/2147483714 bytes received; last active 0 ns ago: status Network error: RPC frame had a length of 2147483714, but we only support messages up to 52428800 bytes long.
W20260928 02:57:45.257242 16763 connection.cc:196] Error closing socket: Network error: TlsSocket::Close: Broken pipe
I20260928 02:57:45.285624 16775 acceptor_pool.cc:254] collecting diagnostics on the listening RPC socket unix:/tmp/dist-test-taskIrsq91/test-tmp/rpc-test-eaaa9ab60043458fbab71a2f8ac98c4a.sock every 8 connection(s)
I20260928 02:57:45.285840 16776 acceptor_pool.cc:254] collecting diagnostics on the listening RPC socket unix:/tmp/dist-test-taskIrsq91/test-tmp/rpc-test-eaaa9ab60043458fbab71a2f8ac98c4a.sock every 8 connection(s)
W20260928 02:57:50.967329 16772 connection.cc:577] server connection from unix:<unnamed>: received bad data: 'Corruption: Invalid packet: message had a length of 2147483710, but we only support messages up to 2147483647 bytes
'
W20260928 02:57:50.967981 16788 connection.cc:196] Error closing socket: Network error: TlsSocket::Close: Broken pipe
[ OK ] Parameters/TestRpc.TestRpcSidecarLimits/SSL_UnixSocket (8182 ms)
[ RUN ] Parameters/TestRpc.TestCallTimeoutDoesntAffectNegotiation/SSL_UnixSocket
I20260928 02:57:51.451397 16800 acceptor_pool.cc:254] collecting diagnostics on the listening RPC socket unix:/tmp/dist-test-taskIrsq91/test-tmp/rpc-test-3a5c15729e2442cdb638672d2e6f2038.sock every 8 connection(s)
I20260928 02:57:51.451675 16801 acceptor_pool.cc:254] collecting diagnostics on the listening RPC socket unix:/tmp/dist-test-taskIrsq91/test-tmp/rpc-test-3a5c15729e2442cdb638672d2e6f2038.sock every 8 connection(s)
W20260928 02:57:51.468070 16796 negotiation.cc:266] Injecting 500ms delay in negotiation
I20260928 02:57:51.518481 16508 rpc-test-base.h:595] status: Timed out: connection negotiation to unix:/tmp/dist-test-taskIrsq91/test-tmp/rpc-test-3a5c15729e2442cdb638672d2e6f2038.sock for RPC Sleep timed out after 0.050s (ON_OUTBOUND_QUEUE), seconds elapsed: 0.0509814
[ OK ] Parameters/TestRpc.TestCallTimeoutDoesntAffectNegotiation/SSL_UnixSocket (551 ms)
[ RUN ] Parameters/TestRpc.TestRpcHandlerLatencyMetric/SSL_UnixSocket
I20260928 02:57:51.993745 16825 acceptor_pool.cc:254] collecting diagnostics on the listening RPC socket unix:/tmp/dist-test-taskIrsq91/test-tmp/rpc-test-3ecdaff6b4664d69beb8aad02a64b771.sock every 8 connection(s)
I20260928 02:57:51.993947 16826 acceptor_pool.cc:254] collecting diagnostics on the listening RPC socket unix:/tmp/dist-test-taskIrsq91/test-tmp/rpc-test-3ecdaff6b4664d69beb8aad02a64b771.sock every 8 connection(s)
I20260928 02:57:52.035357 16508 rpc-test.cc:1236] Sleep() min lat: 20607
I20260928 02:57:52.035466 16508 rpc-test.cc:1237] Sleep() mean lat: 20607
I20260928 02:57:52.035507 16508 rpc-test.cc:1238] Sleep() max lat: 20607
I20260928 02:57:52.035526 16508 rpc-test.cc:1239] Sleep() #calls: 1
W20260928 02:57:52.037173 16822 connection.cc:196] Error closing socket: Network error: TlsSocket::Close: Broken pipe
[ OK ] Parameters/TestRpc.TestRpcHandlerLatencyMetric/SSL_UnixSocket (61 ms)
[ RUN ] Parameters/TestRpc.TimedOutOnResponseMetricServiceQueue/SSL_UnixSocket
I20260928 02:57:52.066228 16851 acceptor_pool.cc:254] collecting diagnostics on the listening RPC socket unix:/tmp/dist-test-taskIrsq91/test-tmp/rpc-test-f1abbe3881e74cc5a83b7f7ca311f592.sock every 8 connection(s)
I20260928 02:57:52.066459 16852 acceptor_pool.cc:254] collecting diagnostics on the listening RPC socket unix:/tmp/dist-test-taskIrsq91/test-tmp/rpc-test-f1abbe3881e74cc5a83b7f7ca311f592.sock every 8 connection(s)
W20260928 02:57:52.123636 16853 rpcz_store.cc:267] Call kudu.rpc_test.CalculatorService.Sleep from unix:<unnamed> (request call id 2) took 20 ms (client timeout 20 ms). Trace:
W20260928 02:57:52.123808 16853 rpcz_store.cc:269] 0928 02:57:52.103291 (+ 0us) service_pool.cc:170] Inserting onto call queue
0928 02:57:52.123585 (+ 20294us) service_pool.cc:214] Skipping call since client already timed out
0928 02:57:52.123621 (+ 36us) inbound_call.cc:173] Queueing failure response
Metrics: {}
[ OK ] Parameters/TestRpc.TimedOutOnResponseMetricServiceQueue/SSL_UnixSocket (87 ms)
[ RUN ] Parameters/TestRpc.RpcPendingConnectionsMetric/SSL_UnixSocket
I20260928 02:57:52.132534 16874 acceptor_pool.cc:254] collecting diagnostics on the listening RPC socket 0.0.0.0:35781 every 8 connection(s)
I20260928 02:57:52.132753 16875 acceptor_pool.cc:254] collecting diagnostics on the listening RPC socket 0.0.0.0:35781 every 8 connection(s)
W20260928 02:57:52.134619 16870 negotiation.cc:337] Failed RPC negotiation. Trace:
0928 02:57:52.134060 (+ 0us) reactor.cc:625] Submitting negotiation task for server connection from 127.0.0.1:50448 (local address 127.0.0.1:35781)
0928 02:57:52.134224 (+ 164us) server_negotiation.cc:206] Beginning negotiation
0928 02:57:52.134228 (+ 4us) server_negotiation.cc:399] Waiting for connection header
0928 02:57:52.134355 (+ 127us) negotiation.cc:327] Negotiation complete: Network error: Server connection negotiation failed: server connection from 127.0.0.1:50448: BlockingRecv error: recv got EOF from 127.0.0.1:50448 (error 108)
Metrics: {"server-negotiator.queue_time_us":54}
[ OK ] Parameters/TestRpc.RpcPendingConnectionsMetric/SSL_UnixSocket (18 ms)
[ RUN ] Parameters/TestRpc.TestRpcContextClientDeadline/SSL_UnixSocket
I20260928 02:57:52.172502 16890 acceptor_pool.cc:254] collecting diagnostics on the listening RPC socket unix:/tmp/dist-test-taskIrsq91/test-tmp/rpc-test-c89928b688224edf805a9fecadbef4f9.sock every 8 connection(s)
I20260928 02:57:52.172804 16891 acceptor_pool.cc:254] collecting diagnostics on the listening RPC socket unix:/tmp/dist-test-taskIrsq91/test-tmp/rpc-test-c89928b688224edf805a9fecadbef4f9.sock every 8 connection(s)
[ OK ] Parameters/TestRpc.TestRpcContextClientDeadline/SSL_UnixSocket (81 ms)
[ RUN ] Parameters/TestRpc.TestApplicationFeatureFlagUnsupportedServer/SSL_UnixSocket
I20260928 02:57:52.246758 16915 acceptor_pool.cc:254] collecting diagnostics on the listening RPC socket unix:/tmp/dist-test-taskIrsq91/test-tmp/rpc-test-5d95eb19901b4649af8accb08e185a1f.sock every 8 connection(s)
I20260928 02:57:52.246963 16916 acceptor_pool.cc:254] collecting diagnostics on the listening RPC socket unix:/tmp/dist-test-taskIrsq91/test-tmp/rpc-test-5d95eb19901b4649af8accb08e185a1f.sock every 8 connection(s)
[ OK ] Parameters/TestRpc.TestApplicationFeatureFlagUnsupportedServer/SSL_UnixSocket (46 ms)
[ RUN ] Parameters/TestRpc.TestCancellationAsync/SSL_UnixSocket
I20260928 02:57:52.295640 16940 acceptor_pool.cc:254] collecting diagnostics on the listening RPC socket unix:/tmp/dist-test-taskIrsq91/test-tmp/rpc-test-cddecb28950d4e929399a57364c3c3cb.sock every 8 connection(s)
I20260928 02:57:52.295878 16941 acceptor_pool.cc:254] collecting diagnostics on the listening RPC socket unix:/tmp/dist-test-taskIrsq91/test-tmp/rpc-test-cddecb28950d4e929399a57364c3c3cb.sock every 8 connection(s)
I20260928 02:57:52.296792 16508 rpc-test.cc:1716] Connecting to unix:/tmp/dist-test-taskIrsq91/test-tmp/rpc-test-cddecb28950d4e929399a57364c3c3cb.sock
I20260928 02:57:52.311620 16508 test_util.cc:268] Using random seed: 996543793
I20260928 02:57:52.355326 16944 rpc-test-base.h:240] got call: sleep_micros: 500 pattern: 4294967295 num_repetitions: 2097152 sidecar_idx: 0
I20260928 02:57:52.387217 16944 rpc-test-base.h:240] got call: sleep_micros: 500 pattern: 4294967295 num_repetitions: 2097152 sidecar_idx: 0
I20260928 02:57:52.419234 16944 rpc-test-base.h:240] got call: sleep_micros: 500 pattern: 4294967295 num_repetitions: 2097152 sidecar_idx: 0
I20260928 02:57:52.450950 16944 rpc-test-base.h:240] got call: sleep_micros: 500 pattern: 4294967295 num_repetitions: 2097152 sidecar_idx: 0
I20260928 02:57:52.483881 16944 rpc-test-base.h:240] got call: sleep_micros: 500 pattern: 4294967295 num_repetitions: 2097152 sidecar_idx: 0
I20260928 02:57:52.515750 16943 rpc-test-base.h:240] got call: sleep_micros: 500 pattern: 4294967295 num_repetitions: 2097152 sidecar_idx: 0
I20260928 02:57:52.538889 16944 rpc-test-base.h:240] got call: sleep_micros: 500 pattern: 4294967295 num_repetitions: 2097152 sidecar_idx: 0
W20260928 02:57:52.541184 16937 connection.cc:196] Error closing socket: Network error: TlsSocket::Close: Broken pipe
W20260928 02:57:52.559278 16937 connection.cc:441] server connection from unix:<unnamed> torn down before Call kudu.rpc.GenericCalculatorService.SleepWithSidecar from unix:<unnamed> (request call id 8) could send its response
W20260928 02:57:52.572218 16937 connection.cc:441] server connection from unix:<unnamed> torn down before Call kudu.rpc.GenericCalculatorService.SleepWithSidecar from unix:<unnamed> (request call id 9) could send its response
[ OK ] Parameters/TestRpc.TestCancellationAsync/SSL_UnixSocket (300 ms)
[ RUN ] Parameters/TestRpc.TestPerformanceBySocketType/SSL_UnixSocket
I20260928 02:57:52.616052 16965 acceptor_pool.cc:254] collecting diagnostics on the listening RPC socket unix:/tmp/dist-test-taskIrsq91/test-tmp/rpc-test-536cbe5493394df0827694f5ee6967fd.sock every 8 connection(s)
I20260928 02:57:52.616359 16966 acceptor_pool.cc:254] collecting diagnostics on the listening RPC socket unix:/tmp/dist-test-taskIrsq91/test-tmp/rpc-test-536cbe5493394df0827694f5ee6967fd.sock every 8 connection(s)
I20260928 02:57:52.617319 16508 rpc-test.cc:1846] Connecting to unix:/tmp/dist-test-taskIrsq91/test-tmp/rpc-test-536cbe5493394df0827694f5ee6967fd.sock
I20260928 02:57:55.711329 16508 rpc-test.cc:1859] Sending 1024MB via ssl-enabled unix socket: real 3.083s user 3.017s sys 2.223s
I20260928 02:57:58.785221 16508 rpc-test.cc:1859] Sending 1024MB via ssl-enabled unix socket: real 3.074s user 2.852s sys 2.347s
I20260928 02:58:01.857049 16508 rpc-test.cc:1859] Sending 1024MB via ssl-enabled unix socket: real 3.072s user 2.909s sys 2.280s
I20260928 02:58:04.847828 16508 rpc-test.cc:1859] Sending 1024MB via ssl-enabled unix socket: real 2.991s user 2.982s sys 2.087s
I20260928 02:58:07.901994 16508 rpc-test.cc:1859] Sending 1024MB via ssl-enabled unix socket: real 3.054s user 2.992s sys 2.184s
[ OK ] Parameters/TestRpc.TestPerformanceBySocketType/SSL_UnixSocket (15335 ms)
[----------] 20 tests from Parameters/TestRpc (50840 ms total)
[----------] 1 test from Parameters/TestRpcSocketTxRxQueue
[ RUN ] Parameters/TestRpcSocketTxRxQueue.AcceptorRxQueueSizeMetric/0
I20260928 02:58:07.915172 16990 acceptor_pool.cc:254] collecting diagnostics on the listening RPC socket 0.0.0.0:45483 every 1 connection(s)
I20260928 02:58:07.915409 16991 acceptor_pool.cc:254] collecting diagnostics on the listening RPC socket 0.0.0.0:45483 every 1 connection(s)
W20260928 02:58:07.917220 16986 negotiation.cc:337] Failed RPC negotiation. Trace:
0928 02:58:07.916847 (+ 0us) reactor.cc:625] Submitting negotiation task for server connection from 127.0.0.1:50474 (local address 127.0.0.1:45483)
0928 02:58:07.916992 (+ 145us) server_negotiation.cc:206] Beginning negotiation
0928 02:58:07.916996 (+ 4us) server_negotiation.cc:399] Waiting for connection header
0928 02:58:07.917117 (+ 121us) negotiation.cc:327] Negotiation complete: Network error: Server connection negotiation failed: server connection from 127.0.0.1:50474: BlockingRecv error: recv got EOF from 127.0.0.1:50474 (error 108)
Metrics: {"server-negotiator.queue_time_us":44}
[ OK ] Parameters/TestRpcSocketTxRxQueue.AcceptorRxQueueSizeMetric/0 (10 ms)
[----------] 1 test from Parameters/TestRpcSocketTxRxQueue (10 ms total)
[----------] Global test environment tear-down
[==========] 21 tests from 2 test suites ran. (50851 ms total)
[ PASSED ] 20 tests.
[ FAILED ] 1 test, listed below:
[ FAILED ] Parameters/TestRpc.TestCallWithChainCertAndChainCA/SSL_UnixSocket, where GetParam() = (true, true)
1 FAILED TEST