Diagnosed failure

Parameters/TestRpc.TestCallWithChainCertAndChainCA/SSL_UnixSocket: /data0/somelongdirectorytoavoidrpathissues/src/kudu/src/kudu/rpc/rpc-test.cc:270: Failure
Failed
Bad status: Runtime error: could not verify certificate chain (error with cert: subject=CN = localhost, ST = sadfjas, C = AS, emailAddress = sdflkdsajf, O = lskdfjlsad, OU = sldfkja, issuer=C = AS, ST = ASDfkjdhf, L = lskdjf, O = saldfja, OU = skdjf, CN = localhost, emailAddress = sadjflkadsj): : certificate has expired
Google Test trace:
/data0/somelongdirectorytoavoidrpathissues/src/kudu/src/kudu/rpc/rpc-test.cc:267: Connecting to unix:/tmp/dist-test-taskNF36PX/test-tmp/rpc-test-4b42d785f6034b9b8ef9df01388914ab.sock
I20260929 06:30:49.586136   804 test_util.cc:175] -----------------------------------------------
I20260929 06:30:49.586220   804 test_util.cc:176] Had fatal failures, leaving test files at /tmp/dist-test-taskNF36PX/test-tmp/rpc-test.6.Parameters_TestRpc.TestCallWithChainCertAndChainCA_SSL_UnixSocket.1790663449466134-804-0

Full log

Note: This is test shard 7 of 8.
[==========] Running 21 tests from 2 test suites.
[----------] Global test environment set-up.
[----------] 20 tests from Parameters/TestRpc
[ RUN      ] Parameters/TestRpc.TestMessengerCreateDestroy/SSL_UnixSocket
WARNING: Logging before InitGoogleLogging() is written to STDERR
I20260929 06:30:49.517675   804 rpc-test.cc:169] started messenger TestCreateDestroy
[       OK ] Parameters/TestRpc.TestMessengerCreateDestroy/SSL_UnixSocket (34 ms)
[ RUN      ] Parameters/TestRpc.TestNegotiationDeadlock/SSL_UnixSocket
I20260929 06:30:49.531392   824 acceptor_pool.cc:254] collecting diagnostics on the listening RPC socket unix:/tmp/dist-test-taskNF36PX/test-tmp/rpc-test-5ac737729ebc4f07b82bb648fd4529c2.sock every 8 connection(s)
I20260929 06:30:49.531749   825 acceptor_pool.cc:254] collecting diagnostics on the listening RPC socket unix:/tmp/dist-test-taskNF36PX/test-tmp/rpc-test-5ac737729ebc4f07b82bb648fd4529c2.sock every 8 connection(s)
[       OK ] Parameters/TestRpc.TestNegotiationDeadlock/SSL_UnixSocket (29 ms)
[ RUN      ] Parameters/TestRpc.TestCallWithChainCertAndChainCA/SSL_UnixSocket
I20260929 06:30:49.574090   840 acceptor_pool.cc:254] collecting diagnostics on the listening RPC socket unix:/tmp/dist-test-taskNF36PX/test-tmp/rpc-test-4b42d785f6034b9b8ef9df01388914ab.sock every 8 connection(s)
I20260929 06:30:49.574427   841 acceptor_pool.cc:254] collecting diagnostics on the listening RPC socket unix:/tmp/dist-test-taskNF36PX/test-tmp/rpc-test-4b42d785f6034b9b8ef9df01388914ab.sock every 8 connection(s)
/data0/somelongdirectorytoavoidrpathissues/src/kudu/src/kudu/rpc/rpc-test.cc:270: Failure
Failed
Bad status: Runtime error: could not verify certificate chain (error with cert: subject=CN = localhost, ST = sadfjas, C = AS, emailAddress = sdflkdsajf, O = lskdfjlsad, OU = sldfkja, issuer=C = AS, ST = ASDfkjdhf, L = lskdjf, O = saldfja, OU = skdjf, CN = localhost, emailAddress = sadjflkadsj): : certificate has expired
Google Test trace:
/data0/somelongdirectorytoavoidrpathissues/src/kudu/src/kudu/rpc/rpc-test.cc:267: Connecting to unix:/tmp/dist-test-taskNF36PX/test-tmp/rpc-test-4b42d785f6034b9b8ef9df01388914ab.sock
I20260929 06:30:49.586136   804 test_util.cc:175] -----------------------------------------------
I20260929 06:30:49.586220   804 test_util.cc:176] Had fatal failures, leaving test files at /tmp/dist-test-taskNF36PX/test-tmp/rpc-test.6.Parameters_TestRpc.TestCallWithChainCertAndChainCA_SSL_UnixSocket.1790663449466134-804-0
[  FAILED  ] Parameters/TestRpc.TestCallWithChainCertAndChainCA/SSL_UnixSocket, where GetParam() = (true, true) (35 ms)
[ RUN      ] Parameters/TestRpc.TestCallWithPasswordProtectedKey/SSL_UnixSocket
I20260929 06:30:49.600575   865 acceptor_pool.cc:254] collecting diagnostics on the listening RPC socket unix:/tmp/dist-test-taskNF36PX/test-tmp/rpc-test-62a8a12fb7734d7698b70fca502a4453.sock every 8 connection(s)
I20260929 06:30:49.600816   866 acceptor_pool.cc:254] collecting diagnostics on the listening RPC socket unix:/tmp/dist-test-taskNF36PX/test-tmp/rpc-test-62a8a12fb7734d7698b70fca502a4453.sock every 8 connection(s)
[       OK ] Parameters/TestRpc.TestCallWithPasswordProtectedKey/SSL_UnixSocket (48 ms)
[ RUN      ] Parameters/TestRpc.TestCallToBadServer/SSL_UnixSocket
I20260929 06:30:49.650252   804 rpc-test.cc:394] Status: Network error: Client connection negotiation failed: client connection to 0.0.0.0:0: connect: Connection refused (error 111)
I20260929 06:30:49.650871   804 rpc-test.cc:394] Status: Network error: Client connection negotiation failed: client connection to 0.0.0.0:0: connect: Connection refused (error 111)
I20260929 06:30:49.651461   804 rpc-test.cc:394] Status: Network error: Client connection negotiation failed: client connection to 0.0.0.0:0: connect: Connection refused (error 111)
I20260929 06:30:49.652040   804 rpc-test.cc:394] Status: Network error: Client connection negotiation failed: client connection to 0.0.0.0:0: connect: Connection refused (error 111)
I20260929 06:30:49.652691   804 rpc-test.cc:394] Status: Network error: Client connection negotiation failed: client connection to 0.0.0.0:0: connect: Connection refused (error 111)
[       OK ] Parameters/TestRpc.TestCallToBadServer/SSL_UnixSocket (19 ms)
[ RUN      ] Parameters/TestRpc.TestWrongService/SSL_UnixSocket
I20260929 06:30:49.665298   900 acceptor_pool.cc:254] collecting diagnostics on the listening RPC socket unix:/tmp/dist-test-taskNF36PX/test-tmp/rpc-test-186eae7ac62444f38f42cb348fe8fc64.sock every 8 connection(s)
I20260929 06:30:49.665536   901 acceptor_pool.cc:254] collecting diagnostics on the listening RPC socket unix:/tmp/dist-test-taskNF36PX/test-tmp/rpc-test-186eae7ac62444f38f42cb348fe8fc64.sock every 8 connection(s)
I20260929 06:30:49.681834   897 messenger.cc:345] service WrongServiceName not registered on TestServer
[       OK ] Parameters/TestRpc.TestWrongService/SSL_UnixSocket (32 ms)
[ RUN      ] Parameters/TestRpc.TestConnectionKeepalive/SSL_UnixSocket
I20260929 06:30:49.695564   923 acceptor_pool.cc:254] collecting diagnostics on the listening RPC socket unix:/tmp/dist-test-taskNF36PX/test-tmp/rpc-test-68c3e9e2905544ed9b840cb6fc19e678.sock every 8 connection(s)
I20260929 06:30:49.695829   924 acceptor_pool.cc:254] collecting diagnostics on the listening RPC socket unix:/tmp/dist-test-taskNF36PX/test-tmp/rpc-test-68c3e9e2905544ed9b840cb6fc19e678.sock every 8 connection(s)
I20260929 06:30:49.696712   804 rpc-test.cc:488] Connecting to unix:/tmp/dist-test-taskNF36PX/test-tmp/rpc-test-68c3e9e2905544ed9b840cb6fc19e678.sock
W20260929 06:30:50.188957   936 connection.cc:196] Error closing socket: Network error: TlsSocket::Close: Broken pipe
[       OK ] Parameters/TestRpc.TestConnectionKeepalive/SSL_UnixSocket (1035 ms)
[ RUN      ] Parameters/TestRpc.TestClientConnectionMetrics/SSL_UnixSocket
I20260929 06:30:50.735247   948 acceptor_pool.cc:254] collecting diagnostics on the listening RPC socket unix:/tmp/dist-test-taskNF36PX/test-tmp/rpc-test-34b99aef16bd4ee58ae34885c7abed75.sock every 8 connection(s)
I20260929 06:30:50.735457   949 acceptor_pool.cc:254] collecting diagnostics on the listening RPC socket unix:/tmp/dist-test-taskNF36PX/test-tmp/rpc-test-34b99aef16bd4ee58ae34885c7abed75.sock every 8 connection(s)
I20260929 06:30:50.736382   804 rpc-test.cc:569] Connecting to unix:/tmp/dist-test-taskNF36PX/test-tmp/rpc-test-34b99aef16bd4ee58ae34885c7abed75.sock
W20260929 06:31:12.214232   945 connection.cc:196] Error closing socket: Network error: TlsSocket::Close: Broken pipe
[       OK ] Parameters/TestRpc.TestClientConnectionMetrics/SSL_UnixSocket (21499 ms)
[ RUN      ] Parameters/TestRpc.TestCredentialsPolicy/SSL_UnixSocket
I20260929 06:31:12.254565   971 acceptor_pool.cc:254] collecting diagnostics on the listening RPC socket unix:/tmp/dist-test-taskNF36PX/test-tmp/rpc-test-e8402e25c7b3437eaff3d3d09ea1b27b.sock every 8 connection(s)
I20260929 06:31:12.254813   972 acceptor_pool.cc:254] collecting diagnostics on the listening RPC socket unix:/tmp/dist-test-taskNF36PX/test-tmp/rpc-test-e8402e25c7b3437eaff3d3d09ea1b27b.sock every 8 connection(s)
I20260929 06:31:12.255731   804 rpc-test.cc:700] Connecting to unix:/tmp/dist-test-taskNF36PX/test-tmp/rpc-test-e8402e25c7b3437eaff3d3d09ea1b27b.sock
W20260929 06:31:12.278120   970 connection.cc:196] Error closing socket: Network error: TlsSocket::Close: Broken pipe
W20260929 06:31:12.286000   970 connection.cc:196] Error closing socket: Network error: TlsSocket::Close: Broken pipe
[       OK ] Parameters/TestRpc.TestCredentialsPolicy/SSL_UnixSocket (66 ms)
[ RUN      ] Parameters/TestRpc.TestCallLongerThanKeepalive/SSL_UnixSocket
I20260929 06:31:12.316220   996 acceptor_pool.cc:254] collecting diagnostics on the listening RPC socket unix:/tmp/dist-test-taskNF36PX/test-tmp/rpc-test-1ad15404025d4dc19c89f5398dd9b0f4.sock every 8 connection(s)
I20260929 06:31:12.316516   997 acceptor_pool.cc:254] collecting diagnostics on the listening RPC socket unix:/tmp/dist-test-taskNF36PX/test-tmp/rpc-test-1ad15404025d4dc19c89f5398dd9b0f4.sock every 8 connection(s)
I20260929 06:31:12.335605  1000 rpc-test-base.h:222] got call: sleep_micros: 3000000 deferred: true
I20260929 06:31:15.337378  1000 rpcz_store.cc:275] Call kudu.rpc.GenericCalculatorService.Sleep from unix:<unnamed> (request call id 0) took 3001 ms. Trace:
I20260929 06:31:15.337534  1000 rpcz_store.cc:276] 0929 06:31:12.335493 (+     0us) service_pool.cc:170] Inserting onto call queue
0929 06:31:12.335563 (+    70us) service_pool.cc:227] Handling call
0929 06:31:15.337312 (+3001749us) inbound_call.cc:173] Queueing success response
Metrics: {}
W20260929 06:31:15.339785   993 connection.cc:196] Error closing socket: Network error: TlsSocket::Close: Broken pipe
[       OK ] Parameters/TestRpc.TestCallLongerThanKeepalive/SSL_UnixSocket (3054 ms)
[ RUN      ] Parameters/TestRpc.TestRpcSidecar/SSL_UnixSocket
I20260929 06:31:15.371821  1021 acceptor_pool.cc:254] collecting diagnostics on the listening RPC socket unix:/tmp/dist-test-taskNF36PX/test-tmp/rpc-test-08521832335d4d53974d05053b600869.sock every 8 connection(s)
I20260929 06:31:15.372057  1022 acceptor_pool.cc:254] collecting diagnostics on the listening RPC socket unix:/tmp/dist-test-taskNF36PX/test-tmp/rpc-test-08521832335d4d53974d05053b600869.sock every 8 connection(s)
W20260929 06:31:15.468644  1018 connection.cc:196] Error closing socket: Network error: TlsSocket::Close: Broken pipe
[       OK ] Parameters/TestRpc.TestRpcSidecar/SSL_UnixSocket (128 ms)
[ RUN      ] Parameters/TestRpc.TestRpcSidecarLimits/SSL_UnixSocket
I20260929 06:31:17.635218  1046 acceptor_pool.cc:254] collecting diagnostics on the listening RPC socket unix:/tmp/dist-test-taskNF36PX/test-tmp/rpc-test-91bf8ee77e10448dbe3e59f50577de21.sock every 8 connection(s)
I20260929 06:31:17.635556  1047 acceptor_pool.cc:254] collecting diagnostics on the listening RPC socket unix:/tmp/dist-test-taskNF36PX/test-tmp/rpc-test-91bf8ee77e10448dbe3e59f50577de21.sock every 8 connection(s)
W20260929 06:31:17.654816   804 serialization.cc:72] Serialized kudu.rpc_test.PushStringsRequestPB (2147483654 bytes) is larger than the maximum configured RPC message size (52428800 bytes). Sending anyway, but peer may reject the data.
W20260929 06:31:17.660830  1043 connection.cc:535] server connection from unix:<unnamed> recv error: Network error: RPC frame had a length of 2147483714, but we only support messages up to 52428800 bytes long.
W20260929 06:31:17.660983  1043 connection.cc:158] shutting down server connection from unix:<unnamed> with pending inbound data: 4/2147483714 bytes received; last active 0 ns ago: status Network error: RPC frame had a length of 2147483714, but we only support messages up to 52428800 bytes long.
W20260929 06:31:17.661432  1059 connection.cc:196] Error closing socket: Network error: TlsSocket::Close: Broken pipe
I20260929 06:31:17.674358  1071 acceptor_pool.cc:254] collecting diagnostics on the listening RPC socket unix:/tmp/dist-test-taskNF36PX/test-tmp/rpc-test-91bf8ee77e10448dbe3e59f50577de21.sock every 8 connection(s)
I20260929 06:31:17.674525  1072 acceptor_pool.cc:254] collecting diagnostics on the listening RPC socket unix:/tmp/dist-test-taskNF36PX/test-tmp/rpc-test-91bf8ee77e10448dbe3e59f50577de21.sock every 8 connection(s)
W20260929 06:31:23.544121  1068 connection.cc:577] server connection from unix:<unnamed>: received bad data: 'Corruption: Invalid packet: message had a length of 2147483710, but we only support messages up to 2147483647 bytes
'
W20260929 06:31:23.544826  1084 connection.cc:196] Error closing socket: Network error: TlsSocket::Close: Broken pipe
[       OK ] Parameters/TestRpc.TestRpcSidecarLimits/SSL_UnixSocket (8538 ms)
[ RUN      ] Parameters/TestRpc.TestCallTimeoutDoesntAffectNegotiation/SSL_UnixSocket
I20260929 06:31:24.043411  1096 acceptor_pool.cc:254] collecting diagnostics on the listening RPC socket unix:/tmp/dist-test-taskNF36PX/test-tmp/rpc-test-1553a742e693458a82b2f794ab2cab22.sock every 8 connection(s)
I20260929 06:31:24.043702  1097 acceptor_pool.cc:254] collecting diagnostics on the listening RPC socket unix:/tmp/dist-test-taskNF36PX/test-tmp/rpc-test-1553a742e693458a82b2f794ab2cab22.sock every 8 connection(s)
W20260929 06:31:24.056560  1092 negotiation.cc:266] Injecting 500ms delay in negotiation
I20260929 06:31:24.106971   804 rpc-test-base.h:595] status: Timed out: connection negotiation to unix:/tmp/dist-test-taskNF36PX/test-tmp/rpc-test-1553a742e693458a82b2f794ab2cab22.sock for RPC Sleep timed out after 0.050s (ON_OUTBOUND_QUEUE), seconds elapsed: 0.0510347
[       OK ] Parameters/TestRpc.TestCallTimeoutDoesntAffectNegotiation/SSL_UnixSocket (555 ms)
[ RUN      ] Parameters/TestRpc.TestRpcHandlerLatencyMetric/SSL_UnixSocket
I20260929 06:31:24.584367  1121 acceptor_pool.cc:254] collecting diagnostics on the listening RPC socket unix:/tmp/dist-test-taskNF36PX/test-tmp/rpc-test-1fa887dd2dd34cba8ecba2a401f709fa.sock every 8 connection(s)
I20260929 06:31:24.584605  1122 acceptor_pool.cc:254] collecting diagnostics on the listening RPC socket unix:/tmp/dist-test-taskNF36PX/test-tmp/rpc-test-1fa887dd2dd34cba8ecba2a401f709fa.sock every 8 connection(s)
I20260929 06:31:24.624037   804 rpc-test.cc:1236] Sleep() min lat: 20656
I20260929 06:31:24.624142   804 rpc-test.cc:1237] Sleep() mean lat: 20656
I20260929 06:31:24.624187   804 rpc-test.cc:1238] Sleep() max lat: 20656
I20260929 06:31:24.624207   804 rpc-test.cc:1239] Sleep() #calls: 1
[       OK ] Parameters/TestRpc.TestRpcHandlerLatencyMetric/SSL_UnixSocket (62 ms)
[ RUN      ] Parameters/TestRpc.TimedOutOnResponseMetricServiceQueue/SSL_UnixSocket
I20260929 06:31:24.657415  1147 acceptor_pool.cc:254] collecting diagnostics on the listening RPC socket unix:/tmp/dist-test-taskNF36PX/test-tmp/rpc-test-0f6d742408434ae9b53766be8f5eb7b1.sock every 8 connection(s)
I20260929 06:31:24.657634  1148 acceptor_pool.cc:254] collecting diagnostics on the listening RPC socket unix:/tmp/dist-test-taskNF36PX/test-tmp/rpc-test-0f6d742408434ae9b53766be8f5eb7b1.sock every 8 connection(s)
W20260929 06:31:24.722818  1149 rpcz_store.cc:267] Call kudu.rpc_test.CalculatorService.Sleep from unix:<unnamed> (request call id 2) took 20 ms (client timeout 20 ms). Trace:
W20260929 06:31:24.722954  1149 rpcz_store.cc:269] 0929 06:31:24.702384 (+     0us) service_pool.cc:170] Inserting onto call queue
0929 06:31:24.722742 (+ 20358us) service_pool.cc:214] Skipping call since client already timed out
0929 06:31:24.722794 (+    52us) inbound_call.cc:173] Queueing failure response
Metrics: {}
[       OK ] Parameters/TestRpc.TimedOutOnResponseMetricServiceQueue/SSL_UnixSocket (97 ms)
[ RUN      ] Parameters/TestRpc.RpcPendingConnectionsMetric/SSL_UnixSocket
I20260929 06:31:24.732084  1170 acceptor_pool.cc:254] collecting diagnostics on the listening RPC socket 0.0.0.0:42125 every 8 connection(s)
I20260929 06:31:24.732301  1171 acceptor_pool.cc:254] collecting diagnostics on the listening RPC socket 0.0.0.0:42125 every 8 connection(s)
W20260929 06:31:24.742827  1166 negotiation.cc:337] Failed RPC negotiation. Trace:
0929 06:31:24.741781 (+     0us) reactor.cc:625] Submitting negotiation task for server connection from 127.0.0.1:34154 (local address 127.0.0.1:42125)
0929 06:31:24.742035 (+   254us) server_negotiation.cc:206] Beginning negotiation
0929 06:31:24.742043 (+     8us) server_negotiation.cc:399] Waiting for connection header
0929 06:31:24.742305 (+   262us) negotiation.cc:327] Negotiation complete: Network error: Server connection negotiation failed: server connection from 127.0.0.1:34154: BlockingRecv error: recv got EOF from 127.0.0.1:34154 (error 108)
Metrics: {"server-negotiator.queue_time_us":67}
[       OK ] Parameters/TestRpc.RpcPendingConnectionsMetric/SSL_UnixSocket (27 ms)
[ RUN      ] Parameters/TestRpc.TestRpcContextClientDeadline/SSL_UnixSocket
I20260929 06:31:24.786355  1186 acceptor_pool.cc:254] collecting diagnostics on the listening RPC socket unix:/tmp/dist-test-taskNF36PX/test-tmp/rpc-test-59d8f8a8668d49fd80c3c38332af4d88.sock every 8 connection(s)
I20260929 06:31:24.786576  1187 acceptor_pool.cc:254] collecting diagnostics on the listening RPC socket unix:/tmp/dist-test-taskNF36PX/test-tmp/rpc-test-59d8f8a8668d49fd80c3c38332af4d88.sock every 8 connection(s)
[       OK ] Parameters/TestRpc.TestRpcContextClientDeadline/SSL_UnixSocket (81 ms)
[ RUN      ] Parameters/TestRpc.TestApplicationFeatureFlagUnsupportedServer/SSL_UnixSocket
I20260929 06:31:24.853264  1211 acceptor_pool.cc:254] collecting diagnostics on the listening RPC socket unix:/tmp/dist-test-taskNF36PX/test-tmp/rpc-test-fe8f2f5efbaa45cd984fcf038fffac27.sock every 8 connection(s)
I20260929 06:31:24.853466  1212 acceptor_pool.cc:254] collecting diagnostics on the listening RPC socket unix:/tmp/dist-test-taskNF36PX/test-tmp/rpc-test-fe8f2f5efbaa45cd984fcf038fffac27.sock every 8 connection(s)
W20260929 06:31:24.873337  1208 connection.cc:196] Error closing socket: Network error: TlsSocket::Close: Broken pipe
[       OK ] Parameters/TestRpc.TestApplicationFeatureFlagUnsupportedServer/SSL_UnixSocket (39 ms)
[ RUN      ] Parameters/TestRpc.TestCancellationAsync/SSL_UnixSocket
I20260929 06:31:24.887281  1236 acceptor_pool.cc:254] collecting diagnostics on the listening RPC socket unix:/tmp/dist-test-taskNF36PX/test-tmp/rpc-test-1f05cc4c58e748a9bfe6443fe63bc835.sock every 8 connection(s)
I20260929 06:31:24.887490  1237 acceptor_pool.cc:254] collecting diagnostics on the listening RPC socket unix:/tmp/dist-test-taskNF36PX/test-tmp/rpc-test-1f05cc4c58e748a9bfe6443fe63bc835.sock every 8 connection(s)
I20260929 06:31:24.888387   804 rpc-test.cc:1716] Connecting to unix:/tmp/dist-test-taskNF36PX/test-tmp/rpc-test-1f05cc4c58e748a9bfe6443fe63bc835.sock
I20260929 06:31:24.898693   804 test_util.cc:268] Using random seed: 1424883055
I20260929 06:31:24.933051  1240 rpc-test-base.h:240] got call: sleep_micros: 500 pattern: 4294967295 num_repetitions: 2097152 sidecar_idx: 0
I20260929 06:31:24.962033  1239 rpc-test-base.h:240] got call: sleep_micros: 500 pattern: 4294967295 num_repetitions: 2097152 sidecar_idx: 0
I20260929 06:31:24.997758  1240 rpc-test-base.h:240] got call: sleep_micros: 500 pattern: 4294967295 num_repetitions: 2097152 sidecar_idx: 0
I20260929 06:31:25.030462  1239 rpc-test-base.h:240] got call: sleep_micros: 500 pattern: 4294967295 num_repetitions: 2097152 sidecar_idx: 0
I20260929 06:31:25.059758  1240 rpc-test-base.h:240] got call: sleep_micros: 500 pattern: 4294967295 num_repetitions: 2097152 sidecar_idx: 0
I20260929 06:31:25.091974  1239 rpc-test-base.h:240] got call: sleep_micros: 500 pattern: 4294967295 num_repetitions: 2097152 sidecar_idx: 0
I20260929 06:31:25.119488  1240 rpc-test-base.h:240] got call: sleep_micros: 500 pattern: 4294967295 num_repetitions: 2097152 sidecar_idx: 0
W20260929 06:31:25.121816  1233 connection.cc:196] Error closing socket: Network error: TlsSocket::Close: Broken pipe
W20260929 06:31:25.137902  1233 connection.cc:441] server connection from unix:<unnamed> torn down before Call kudu.rpc.GenericCalculatorService.SleepWithSidecar from unix:<unnamed> (request call id 8) could send its response
W20260929 06:31:25.152520  1233 connection.cc:441] server connection from unix:<unnamed> torn down before Call kudu.rpc.GenericCalculatorService.SleepWithSidecar from unix:<unnamed> (request call id 9) could send its response
[       OK ] Parameters/TestRpc.TestCancellationAsync/SSL_UnixSocket (278 ms)
[ RUN      ] Parameters/TestRpc.TestPerformanceBySocketType/SSL_UnixSocket
I20260929 06:31:25.170001  1261 acceptor_pool.cc:254] collecting diagnostics on the listening RPC socket unix:/tmp/dist-test-taskNF36PX/test-tmp/rpc-test-5afffd05c68a44e09a10b919c577f86f.sock every 8 connection(s)
I20260929 06:31:25.170179  1262 acceptor_pool.cc:254] collecting diagnostics on the listening RPC socket unix:/tmp/dist-test-taskNF36PX/test-tmp/rpc-test-5afffd05c68a44e09a10b919c577f86f.sock every 8 connection(s)
I20260929 06:31:25.171121   804 rpc-test.cc:1846] Connecting to unix:/tmp/dist-test-taskNF36PX/test-tmp/rpc-test-5afffd05c68a44e09a10b919c577f86f.sock
I20260929 06:31:28.319983   804 rpc-test.cc:1859] Sending 1024MB via ssl-enabled unix socket: real 3.127s	user 3.125s	sys 2.182s
I20260929 06:31:31.361279   804 rpc-test.cc:1859] Sending 1024MB via ssl-enabled unix socket: real 3.041s	user 3.057s	sys 2.096s
I20260929 06:31:34.616182   804 rpc-test.cc:1859] Sending 1024MB via ssl-enabled unix socket: real 3.255s	user 3.171s	sys 2.353s
I20260929 06:31:37.872219   804 rpc-test.cc:1859] Sending 1024MB via ssl-enabled unix socket: real 3.256s	user 3.184s	sys 2.349s
I20260929 06:31:41.100883   804 rpc-test.cc:1859] Sending 1024MB via ssl-enabled unix socket: real 3.229s	user 3.153s	sys 2.344s
W20260929 06:31:41.101802  1258 connection.cc:196] Error closing socket: Network error: TlsSocket::Close: Broken pipe
[       OK ] Parameters/TestRpc.TestPerformanceBySocketType/SSL_UnixSocket (15952 ms)
[----------] 20 tests from Parameters/TestRpc (51622 ms total)

[----------] 1 test from Parameters/TestRpcSocketTxRxQueue
[ RUN      ] Parameters/TestRpcSocketTxRxQueue.AcceptorRxQueueSizeMetric/0
I20260929 06:31:41.112895  1286 acceptor_pool.cc:254] collecting diagnostics on the listening RPC socket 0.0.0.0:44373 every 1 connection(s)
I20260929 06:31:41.113134  1287 acceptor_pool.cc:254] collecting diagnostics on the listening RPC socket 0.0.0.0:44373 every 1 connection(s)
W20260929 06:31:41.114696  1282 negotiation.cc:337] Failed RPC negotiation. Trace:
0929 06:31:41.114306 (+     0us) reactor.cc:625] Submitting negotiation task for server connection from 127.0.0.1:45264 (local address 127.0.0.1:44373)
0929 06:31:41.114470 (+   164us) server_negotiation.cc:206] Beginning negotiation
0929 06:31:41.114474 (+     4us) server_negotiation.cc:399] Waiting for connection header
0929 06:31:41.114594 (+   120us) negotiation.cc:327] Negotiation complete: Network error: Server connection negotiation failed: server connection from 127.0.0.1:45264: BlockingRecv error: recv got EOF from 127.0.0.1:45264 (error 108)
Metrics: {"server-negotiator.queue_time_us":47}
[       OK ] Parameters/TestRpcSocketTxRxQueue.AcceptorRxQueueSizeMetric/0 (9 ms)
[----------] 1 test from Parameters/TestRpcSocketTxRxQueue (9 ms total)

[----------] Global test environment tear-down
[==========] 21 tests from 2 test suites ran. (51633 ms total)
[  PASSED  ] 20 tests.
[  FAILED  ] 1 test, listed below:
[  FAILED  ] Parameters/TestRpc.TestCallWithChainCertAndChainCA/SSL_UnixSocket, where GetParam() = (true, true)

 1 FAILED TEST