Diagnosed failure

Parameters/TestRpc.TestCallWithChainCertAndChainCA/SSL_TCP: /data0/somelongdirectorytoavoidrpathissues/src/kudu/src/kudu/rpc/rpc-test.cc:270: Failure
Failed
Bad status: Runtime error: could not verify certificate chain (error with cert: subject=CN = localhost, ST = sadfjas, C = AS, emailAddress = sdflkdsajf, O = lskdfjlsad, OU = sldfkja, issuer=C = AS, ST = ASDfkjdhf, L = lskdjf, O = saldfja, OU = skdjf, CN = localhost, emailAddress = sadjflkadsj): : certificate has expired
Google Test trace:
/data0/somelongdirectorytoavoidrpathissues/src/kudu/src/kudu/rpc/rpc-test.cc:267: Connecting to 0.0.0.0:46849
I20260923 14:37:43.882915  9058 test_util.cc:175] -----------------------------------------------
I20260923 14:37:43.882969  9058 test_util.cc:176] Had fatal failures, leaving test files at /tmp/dist-test-task0VXYYM/test-tmp/rpc-test.5.Parameters_TestRpc.TestCallWithChainCertAndChainCA_SSL_TCP.1790174263810581-9058-0

Full log

Note: This is test shard 6 of 8.
[==========] Running 21 tests from 2 test suites.
[----------] Global test environment set-up.
[----------] 20 tests from Parameters/TestRpc
[ RUN      ] Parameters/TestRpc.TestMessengerCreateDestroy/SSL_TCP
WARNING: Logging before InitGoogleLogging() is written to STDERR
I20260923 14:37:43.844398  9058 rpc-test.cc:169] started messenger TestCreateDestroy
[       OK ] Parameters/TestRpc.TestMessengerCreateDestroy/SSL_TCP (28 ms)
[ RUN      ] Parameters/TestRpc.TestNegotiationDeadlock/SSL_TCP
I20260923 14:37:43.861270  9079 acceptor_pool.cc:254] collecting diagnostics on the listening RPC socket 0.0.0.0:35315 every 8 connection(s)
I20260923 14:37:43.861266  9078 acceptor_pool.cc:254] collecting diagnostics on the listening RPC socket 0.0.0.0:35315 every 8 connection(s)
[       OK ] Parameters/TestRpc.TestNegotiationDeadlock/SSL_TCP (26 ms)
[ RUN      ] Parameters/TestRpc.TestCallWithChainCertAndChainCA/SSL_TCP
I20260923 14:37:43.878183  9094 acceptor_pool.cc:254] collecting diagnostics on the listening RPC socket 0.0.0.0:46849 every 8 connection(s)
I20260923 14:37:43.878217  9095 acceptor_pool.cc:254] collecting diagnostics on the listening RPC socket 0.0.0.0:46849 every 8 connection(s)
/data0/somelongdirectorytoavoidrpathissues/src/kudu/src/kudu/rpc/rpc-test.cc:270: Failure
Failed
Bad status: Runtime error: could not verify certificate chain (error with cert: subject=CN = localhost, ST = sadfjas, C = AS, emailAddress = sdflkdsajf, O = lskdfjlsad, OU = sldfkja, issuer=C = AS, ST = ASDfkjdhf, L = lskdjf, O = saldfja, OU = skdjf, CN = localhost, emailAddress = sadjflkadsj): : certificate has expired
Google Test trace:
/data0/somelongdirectorytoavoidrpathissues/src/kudu/src/kudu/rpc/rpc-test.cc:267: Connecting to 0.0.0.0:46849
I20260923 14:37:43.882915  9058 test_util.cc:175] -----------------------------------------------
I20260923 14:37:43.882969  9058 test_util.cc:176] Had fatal failures, leaving test files at /tmp/dist-test-task0VXYYM/test-tmp/rpc-test.5.Parameters_TestRpc.TestCallWithChainCertAndChainCA_SSL_TCP.1790174263810581-9058-0
[  FAILED  ] Parameters/TestRpc.TestCallWithChainCertAndChainCA/SSL_TCP, where GetParam() = (true, false) (10 ms)
[ RUN      ] Parameters/TestRpc.TestCallWithPasswordProtectedKey/SSL_TCP
I20260923 14:37:43.900054  9119 acceptor_pool.cc:254] collecting diagnostics on the listening RPC socket 0.0.0.0:40429 every 8 connection(s)
I20260923 14:37:43.900068  9120 acceptor_pool.cc:254] collecting diagnostics on the listening RPC socket 0.0.0.0:40429 every 8 connection(s)
[       OK ] Parameters/TestRpc.TestCallWithPasswordProtectedKey/SSL_TCP (32 ms)
[ RUN      ] Parameters/TestRpc.TestCallToBadServer/SSL_TCP
I20260923 14:37:43.939921  9058 rpc-test.cc:394] Status: Network error: Client connection negotiation failed: client connection to 0.0.0.0:0: connect: Connection refused (error 111)
I20260923 14:37:43.940467  9058 rpc-test.cc:394] Status: Network error: Client connection negotiation failed: client connection to 0.0.0.0:0: connect: Connection refused (error 111)
I20260923 14:37:43.940964  9058 rpc-test.cc:394] Status: Network error: Client connection negotiation failed: client connection to 0.0.0.0:0: connect: Connection refused (error 111)
I20260923 14:37:43.941433  9058 rpc-test.cc:394] Status: Network error: Client connection negotiation failed: client connection to 0.0.0.0:0: connect: Connection refused (error 111)
I20260923 14:37:43.941938  9058 rpc-test.cc:394] Status: Network error: Client connection negotiation failed: client connection to 0.0.0.0:0: connect: Connection refused (error 111)
[       OK ] Parameters/TestRpc.TestCallToBadServer/SSL_TCP (27 ms)
[ RUN      ] Parameters/TestRpc.TestWrongService/SSL_TCP
I20260923 14:37:43.965344  9154 acceptor_pool.cc:254] collecting diagnostics on the listening RPC socket 0.0.0.0:35563 every 8 connection(s)
I20260923 14:37:43.965435  9155 acceptor_pool.cc:254] collecting diagnostics on the listening RPC socket 0.0.0.0:35563 every 8 connection(s)
I20260923 14:37:43.996266  9153 messenger.cc:345] service WrongServiceName not registered on TestServer
[       OK ] Parameters/TestRpc.TestWrongService/SSL_TCP (55 ms)
[ RUN      ] Parameters/TestRpc.TestConnectionKeepalive/SSL_TCP
I20260923 14:37:44.006752  9177 acceptor_pool.cc:254] collecting diagnostics on the listening RPC socket 0.0.0.0:44969 every 8 connection(s)
I20260923 14:37:44.006807  9178 acceptor_pool.cc:254] collecting diagnostics on the listening RPC socket 0.0.0.0:44969 every 8 connection(s)
I20260923 14:37:44.007126  9058 rpc-test.cc:488] Connecting to 0.0.0.0:44969
[       OK ] Parameters/TestRpc.TestConnectionKeepalive/SSL_TCP (1038 ms)
[ RUN      ] Parameters/TestRpc.TestClientConnectionMetrics/SSL_TCP
I20260923 14:37:45.075927  9202 acceptor_pool.cc:254] collecting diagnostics on the listening RPC socket 0.0.0.0:36369 every 8 connection(s)
I20260923 14:37:45.075938  9203 acceptor_pool.cc:254] collecting diagnostics on the listening RPC socket 0.0.0.0:36369 every 8 connection(s)
I20260923 14:37:45.076269  9058 rpc-test.cc:569] Connecting to 0.0.0.0:36369
[       OK ] Parameters/TestRpc.TestClientConnectionMetrics/SSL_TCP (14774 ms)
[ RUN      ] Parameters/TestRpc.TestCredentialsPolicy/SSL_TCP
I20260923 14:37:59.828858  9225 acceptor_pool.cc:254] collecting diagnostics on the listening RPC socket 0.0.0.0:41635 every 8 connection(s)
I20260923 14:37:59.828896  9226 acceptor_pool.cc:254] collecting diagnostics on the listening RPC socket 0.0.0.0:41635 every 8 connection(s)
I20260923 14:37:59.829209  9058 rpc-test.cc:700] Connecting to 0.0.0.0:41635
[       OK ] Parameters/TestRpc.TestCredentialsPolicy/SSL_TCP (56 ms)
[ RUN      ] Parameters/TestRpc.TestCallLongerThanKeepalive/SSL_TCP
I20260923 14:37:59.883862  9250 acceptor_pool.cc:254] collecting diagnostics on the listening RPC socket 0.0.0.0:37395 every 8 connection(s)
I20260923 14:37:59.883882  9251 acceptor_pool.cc:254] collecting diagnostics on the listening RPC socket 0.0.0.0:37395 every 8 connection(s)
I20260923 14:37:59.912782  9254 rpc-test-base.h:222] got call: sleep_micros: 3000000 deferred: true
I20260923 14:38:02.913642  9254 rpcz_store.cc:275] Call kudu.rpc.GenericCalculatorService.Sleep from 127.0.0.1:56502 (request call id 0) took 3001 ms. Trace:
I20260923 14:38:02.913764  9254 rpcz_store.cc:276] 0923 14:37:59.912655 (+     0us) service_pool.cc:170] Inserting onto call queue
0923 14:37:59.912711 (+    56us) service_pool.cc:227] Handling call
0923 14:38:02.913620 (+3000909us) inbound_call.cc:173] Queueing success response
Metrics: {}
[       OK ] Parameters/TestRpc.TestCallLongerThanKeepalive/SSL_TCP (3048 ms)
[ RUN      ] Parameters/TestRpc.TestRpcSidecar/SSL_TCP
I20260923 14:38:02.937857  9275 acceptor_pool.cc:254] collecting diagnostics on the listening RPC socket 0.0.0.0:46645 every 8 connection(s)
I20260923 14:38:02.937888  9276 acceptor_pool.cc:254] collecting diagnostics on the listening RPC socket 0.0.0.0:46645 every 8 connection(s)
[       OK ] Parameters/TestRpc.TestRpcSidecar/SSL_TCP (81 ms)
[ RUN      ] Parameters/TestRpc.TestRpcSidecarLimits/SSL_TCP
I20260923 14:38:05.633864  9301 acceptor_pool.cc:254] collecting diagnostics on the listening RPC socket 0.0.0.0:34275 every 8 connection(s)
I20260923 14:38:05.633864  9300 acceptor_pool.cc:254] collecting diagnostics on the listening RPC socket 0.0.0.0:34275 every 8 connection(s)
W20260923 14:38:05.645817  9058 serialization.cc:72] Serialized kudu.rpc_test.PushStringsRequestPB (2147483654 bytes) is larger than the maximum configured RPC message size (52428800 bytes). Sending anyway, but peer may reject the data.
W20260923 14:38:05.649528  9298 connection.cc:535] server connection from 127.0.0.1:41622 recv error: Network error: RPC frame had a length of 2147483714, but we only support messages up to 52428800 bytes long.
W20260923 14:38:05.649582  9298 connection.cc:158] shutting down server connection from 127.0.0.1:41622 with pending inbound data: 4/2147483714 bytes received; last active 0 ns ago: status Network error: RPC frame had a length of 2147483714, but we only support messages up to 52428800 bytes long.
W20260923 14:38:05.649866  9313 connection.cc:196] Error closing socket: Network error: TlsSocket::Close: Connection reset by peer
I20260923 14:38:05.658126  9325 acceptor_pool.cc:254] collecting diagnostics on the listening RPC socket 0.0.0.0:36423 every 8 connection(s)
I20260923 14:38:05.658128  9326 acceptor_pool.cc:254] collecting diagnostics on the listening RPC socket 0.0.0.0:36423 every 8 connection(s)
W20260923 14:38:10.451886  9323 connection.cc:577] server connection from 127.0.0.1:60548: received bad data: 'Corruption: Invalid packet: message had a length of 2147483710, but we only support messages up to 2147483647 bytes
'
[       OK ] Parameters/TestRpc.TestRpcSidecarLimits/SSL_TCP (7455 ms)
[ RUN      ] Parameters/TestRpc.TestCallTimeoutDoesntAffectNegotiation/SSL_TCP
I20260923 14:38:10.467032  9350 acceptor_pool.cc:254] collecting diagnostics on the listening RPC socket 0.0.0.0:39147 every 8 connection(s)
I20260923 14:38:10.467171  9351 acceptor_pool.cc:254] collecting diagnostics on the listening RPC socket 0.0.0.0:39147 every 8 connection(s)
W20260923 14:38:10.491564  9346 negotiation.cc:266] Injecting 500ms delay in negotiation
I20260923 14:38:10.541941  9058 rpc-test-base.h:595] status: Timed out: connection negotiation to 0.0.0.0:39147 for RPC Sleep timed out after 0.050s (ON_OUTBOUND_QUEUE), seconds elapsed: 0.0508115
[       OK ] Parameters/TestRpc.TestCallTimeoutDoesntAffectNegotiation/SSL_TCP (543 ms)
[ RUN      ] Parameters/TestRpc.TestRpcHandlerLatencyMetric/SSL_TCP
I20260923 14:38:11.014524  9375 acceptor_pool.cc:254] collecting diagnostics on the listening RPC socket 0.0.0.0:38427 every 8 connection(s)
I20260923 14:38:11.014581  9376 acceptor_pool.cc:254] collecting diagnostics on the listening RPC socket 0.0.0.0:38427 every 8 connection(s)
I20260923 14:38:11.062201  9058 rpc-test.cc:1236] Sleep() min lat: 20373
I20260923 14:38:11.062306  9058 rpc-test.cc:1237] Sleep() mean lat: 20373
I20260923 14:38:11.062359  9058 rpc-test.cc:1238] Sleep() max lat: 20373
I20260923 14:38:11.062386  9058 rpc-test.cc:1239] Sleep() #calls: 1
[       OK ] Parameters/TestRpc.TestRpcHandlerLatencyMetric/SSL_TCP (65 ms)
[ RUN      ] Parameters/TestRpc.TimedOutOnResponseMetricServiceQueue/SSL_TCP
I20260923 14:38:11.086784  9401 acceptor_pool.cc:254] collecting diagnostics on the listening RPC socket 0.0.0.0:41833 every 8 connection(s)
I20260923 14:38:11.086846  9402 acceptor_pool.cc:254] collecting diagnostics on the listening RPC socket 0.0.0.0:41833 every 8 connection(s)
W20260923 14:38:11.140622  9403 rpcz_store.cc:267] Call kudu.rpc_test.CalculatorService.Sleep from 127.0.0.1:49714 (request call id 2) took 20 ms (client timeout 20 ms). Trace:
W20260923 14:38:11.140748  9403 rpcz_store.cc:269] 0923 14:38:11.120254 (+     0us) service_pool.cc:170] Inserting onto call queue
0923 14:38:11.140575 (+ 20321us) service_pool.cc:214] Skipping call since client already timed out
0923 14:38:11.140608 (+    33us) inbound_call.cc:173] Queueing failure response
Metrics: {}
[       OK ] Parameters/TestRpc.TimedOutOnResponseMetricServiceQueue/SSL_TCP (78 ms)
[ RUN      ] Parameters/TestRpc.RpcPendingConnectionsMetric/SSL_TCP
I20260923 14:38:11.145174  9424 acceptor_pool.cc:254] collecting diagnostics on the listening RPC socket 0.0.0.0:45183 every 8 connection(s)
I20260923 14:38:11.145200  9425 acceptor_pool.cc:254] collecting diagnostics on the listening RPC socket 0.0.0.0:45183 every 8 connection(s)
W20260923 14:38:11.146320  9420 negotiation.cc:337] Failed RPC negotiation. Trace:
0923 14:38:11.145900 (+     0us) reactor.cc:625] Submitting negotiation task for server connection from 127.0.0.1:48296 (local address 127.0.0.1:45183)
0923 14:38:11.146019 (+   119us) server_negotiation.cc:206] Beginning negotiation
0923 14:38:11.146023 (+     4us) server_negotiation.cc:399] Waiting for connection header
0923 14:38:11.146117 (+    94us) negotiation.cc:327] Negotiation complete: Network error: Server connection negotiation failed: server connection from 127.0.0.1:48296: BlockingRecv error: recv got EOF from 127.0.0.1:48296 (error 108)
Metrics: {"server-negotiator.queue_time_us":43}
[       OK ] Parameters/TestRpc.RpcPendingConnectionsMetric/SSL_TCP (14 ms)
[ RUN      ] Parameters/TestRpc.TestRpcContextClientDeadline/SSL_TCP
I20260923 14:38:11.167003  9440 acceptor_pool.cc:254] collecting diagnostics on the listening RPC socket 0.0.0.0:40085 every 8 connection(s)
I20260923 14:38:11.167073  9441 acceptor_pool.cc:254] collecting diagnostics on the listening RPC socket 0.0.0.0:40085 every 8 connection(s)
[       OK ] Parameters/TestRpc.TestRpcContextClientDeadline/SSL_TCP (48 ms)
[ RUN      ] Parameters/TestRpc.TestApplicationFeatureFlagUnsupportedServer/SSL_TCP
I20260923 14:38:11.227082  9465 acceptor_pool.cc:254] collecting diagnostics on the listening RPC socket 0.0.0.0:34687 every 8 connection(s)
I20260923 14:38:11.227097  9466 acceptor_pool.cc:254] collecting diagnostics on the listening RPC socket 0.0.0.0:34687 every 8 connection(s)
[       OK ] Parameters/TestRpc.TestApplicationFeatureFlagUnsupportedServer/SSL_TCP (36 ms)
[ RUN      ] Parameters/TestRpc.TestCancellationAsync/SSL_TCP
I20260923 14:38:11.258092  9490 acceptor_pool.cc:254] collecting diagnostics on the listening RPC socket 0.0.0.0:41795 every 8 connection(s)
I20260923 14:38:11.258103  9491 acceptor_pool.cc:254] collecting diagnostics on the listening RPC socket 0.0.0.0:41795 every 8 connection(s)
I20260923 14:38:11.258549  9058 rpc-test.cc:1716] Connecting to 0.0.0.0:41795
I20260923 14:38:11.263111  9058 test_util.cc:268] Using random seed: 1857519239
I20260923 14:38:11.282536  9494 rpc-test-base.h:240] got call: sleep_micros: 500 pattern: 4294967295 num_repetitions: 2097152 sidecar_idx: 0
I20260923 14:38:11.298333  9493 rpc-test-base.h:240] got call: sleep_micros: 500 pattern: 4294967295 num_repetitions: 2097152 sidecar_idx: 0
I20260923 14:38:11.317874  9494 rpc-test-base.h:240] got call: sleep_micros: 500 pattern: 4294967295 num_repetitions: 2097152 sidecar_idx: 0
I20260923 14:38:11.335930  9493 rpc-test-base.h:240] got call: sleep_micros: 500 pattern: 4294967295 num_repetitions: 2097152 sidecar_idx: 0
I20260923 14:38:11.353161  9494 rpc-test-base.h:240] got call: sleep_micros: 500 pattern: 4294967295 num_repetitions: 2097152 sidecar_idx: 0
I20260923 14:38:11.376677  9494 rpc-test-base.h:240] got call: sleep_micros: 500 pattern: 4294967295 num_repetitions: 2097152 sidecar_idx: 0
I20260923 14:38:11.401247  9494 rpc-test-base.h:240] got call: sleep_micros: 500 pattern: 4294967295 num_repetitions: 2097152 sidecar_idx: 0
W20260923 14:38:11.419099  9489 connection.cc:441] server connection from 127.0.0.1:41624 torn down before Call kudu.rpc.GenericCalculatorService.SleepWithSidecar from 127.0.0.1:41624 (request call id 9) could send its response
[       OK ] Parameters/TestRpc.TestCancellationAsync/SSL_TCP (178 ms)
[ RUN      ] Parameters/TestRpc.TestPerformanceBySocketType/SSL_TCP
I20260923 14:38:11.426946  9515 acceptor_pool.cc:254] collecting diagnostics on the listening RPC socket 0.0.0.0:38717 every 8 connection(s)
I20260923 14:38:11.427064  9516 acceptor_pool.cc:254] collecting diagnostics on the listening RPC socket 0.0.0.0:38717 every 8 connection(s)
I20260923 14:38:11.427395  9058 rpc-test.cc:1846] Connecting to 0.0.0.0:38717
I20260923 14:38:13.569434  9058 rpc-test.cc:1859] Sending 1024MB via ssl-enabled tcp socket: real 2.128s	user 2.341s	sys 1.442s
I20260923 14:38:15.668202  9058 rpc-test.cc:1859] Sending 1024MB via ssl-enabled tcp socket: real 2.099s	user 2.125s	sys 1.615s
I20260923 14:38:17.901700  9058 rpc-test.cc:1859] Sending 1024MB via ssl-enabled tcp socket: real 2.233s	user 2.270s	sys 1.691s
I20260923 14:38:20.067103  9058 rpc-test.cc:1859] Sending 1024MB via ssl-enabled tcp socket: real 2.165s	user 2.231s	sys 1.597s
I20260923 14:38:22.164757  9058 rpc-test.cc:1859] Sending 1024MB via ssl-enabled tcp socket: real 2.098s	user 2.223s	sys 1.502s
[       OK ] Parameters/TestRpc.TestPerformanceBySocketType/SSL_TCP (10746 ms)
[----------] 20 tests from Parameters/TestRpc (38350 ms total)

[----------] 1 test from Parameters/TestRpcSocketTxRxQueue
[ RUN      ] Parameters/TestRpcSocketTxRxQueue.OverCapacity/0
W20260923 14:38:22.442981  9559 negotiation.cc:337] Failed RPC negotiation. Trace:
0923 14:38:22.178604 (+     0us) reactor.cc:625] Submitting negotiation task for client connection to 0.0.0.0:35893 (local address 127.0.0.1:60384)
0923 14:38:22.178715 (+   111us) negotiation.cc:107] Waiting for socket to connect
0923 14:38:22.178727 (+    12us) client_negotiation.cc:174] Beginning negotiation
0923 14:38:22.178838 (+   111us) client_negotiation.cc:252] Sending NEGOTIATE NegotiatePB request
0923 14:38:22.442833 (+263995us) negotiation.cc:327] Negotiation complete: Network error: Client connection negotiation failed: client connection to 0.0.0.0:35893: BlockingRecv error: recv error from unknown peer: Transport endpoint is not connected (error 107)
Metrics: {"client-negotiator.queue_time_us":46}
W20260923 14:38:22.442981  9541 negotiation.cc:337] Failed RPC negotiation. Trace:
0923 14:38:22.176278 (+     0us) reactor.cc:625] Submitting negotiation task for client connection to 0.0.0.0:35893 (local address 127.0.0.1:60352)
0923 14:38:22.176391 (+   113us) negotiation.cc:107] Waiting for socket to connect
0923 14:38:22.176403 (+    12us) client_negotiation.cc:174] Beginning negotiation
0923 14:38:22.176487 (+    84us) client_negotiation.cc:252] Sending NEGOTIATE NegotiatePB request
0923 14:38:22.442834 (+266347us) negotiation.cc:327] Negotiation complete: Network error: Client connection negotiation failed: client connection to 0.0.0.0:35893: BlockingRecv error: recv error from unknown peer: Transport endpoint is not connected (error 107)
Metrics: {"client-negotiator.queue_time_us":44}
W20260923 14:38:22.442996  9577 negotiation.cc:337] Failed RPC negotiation. Trace:
0923 14:38:22.180861 (+     0us) reactor.cc:625] Submitting negotiation task for client connection to 0.0.0.0:35893 (local address 127.0.0.1:60392)
0923 14:38:22.180963 (+   102us) negotiation.cc:107] Waiting for socket to connect
0923 14:38:22.180977 (+    14us) client_negotiation.cc:174] Beginning negotiation
0923 14:38:22.181057 (+    80us) client_negotiation.cc:252] Sending NEGOTIATE NegotiatePB request
0923 14:38:22.442948 (+261891us) negotiation.cc:327] Negotiation complete: Network error: Client connection negotiation failed: client connection to 0.0.0.0:35893: BlockingRecv error: recv error from unknown peer: Transport endpoint is not connected (error 107)
Metrics: {"client-negotiator.queue_time_us":27}
W20260923 14:38:22.443444  9550 negotiation.cc:337] Failed RPC negotiation. Trace:
0923 14:38:22.177470 (+     0us) reactor.cc:625] Submitting negotiation task for client connection to 0.0.0.0:35893 (local address 127.0.0.1:60368)
0923 14:38:22.177580 (+   110us) negotiation.cc:107] Waiting for socket to connect
0923 14:38:22.177591 (+    11us) client_negotiation.cc:174] Beginning negotiation
0923 14:38:22.177670 (+    79us) client_negotiation.cc:252] Sending NEGOTIATE NegotiatePB request
0923 14:38:22.442833 (+265163us) negotiation.cc:327] Negotiation complete: Network error: Client connection negotiation failed: client connection to 0.0.0.0:35893: BlockingRecv error: recv error from unknown peer: Transport endpoint is not connected (error 107)
Metrics: {"client-negotiator.queue_time_us":44}
W20260923 14:38:22.443521  9568 negotiation.cc:337] Failed RPC negotiation. Trace:
0923 14:38:22.179721 (+     0us) reactor.cc:625] Submitting negotiation task for client connection to 0.0.0.0:35893 (local address 127.0.0.1:60386)
0923 14:38:22.179855 (+   134us) negotiation.cc:107] Waiting for socket to connect
0923 14:38:22.179867 (+    12us) client_negotiation.cc:174] Beginning negotiation
0923 14:38:22.179936 (+    69us) client_negotiation.cc:252] Sending NEGOTIATE NegotiatePB request
0923 14:38:22.443050 (+263114us) negotiation.cc:327] Negotiation complete: Network error: Client connection negotiation failed: client connection to 0.0.0.0:35893: BlockingRecv error: recv error from unknown peer: Transport endpoint is not connected (error 107)
Metrics: {"client-negotiator.queue_time_us":74}
W20260923 14:38:22.442996  9532 negotiation.cc:337] Failed RPC negotiation. Trace:
0923 14:38:22.175145 (+     0us) reactor.cc:625] Submitting negotiation task for client connection to 0.0.0.0:35893 (local address 127.0.0.1:60348)
0923 14:38:22.175262 (+   117us) negotiation.cc:107] Waiting for socket to connect
0923 14:38:22.175276 (+    14us) client_negotiation.cc:174] Beginning negotiation
0923 14:38:22.175368 (+    92us) client_negotiation.cc:252] Sending NEGOTIATE NegotiatePB request
0923 14:38:22.442834 (+267466us) negotiation.cc:327] Negotiation complete: Network error: Client connection negotiation failed: client connection to 0.0.0.0:35893: BlockingRecv error: recv error from unknown peer: Transport endpoint is not connected (error 107)
Metrics: {"client-negotiator.queue_time_us":44}
[       OK ] Parameters/TestRpcSocketTxRxQueue.OverCapacity/0 (1053 ms)
[----------] 1 test from Parameters/TestRpcSocketTxRxQueue (1053 ms total)

[----------] Global test environment tear-down
[==========] 21 tests from 2 test suites ran. (39403 ms total)
[  PASSED  ] 20 tests.
[  FAILED  ] 1 test, listed below:
[  FAILED  ] Parameters/TestRpc.TestCallWithChainCertAndChainCA/SSL_TCP, where GetParam() = (true, false)

 1 FAILED TEST