Diagnosed failure

Parameters/TestRpc.TestCallWithChainCertAndChainCA/SSL_UnixSocket: /data0/somelongdirectorytoavoidrpathissues/src/kudu/src/kudu/rpc/rpc-test.cc:270: Failure
Failed
Bad status: Runtime error: could not verify certificate chain (error with cert: subject=CN = localhost, ST = sadfjas, C = AS, emailAddress = sdflkdsajf, O = lskdfjlsad, OU = sldfkja, issuer=C = AS, ST = ASDfkjdhf, L = lskdjf, O = saldfja, OU = skdjf, CN = localhost, emailAddress = sadjflkadsj): : certificate has expired
Google Test trace:
/data0/somelongdirectorytoavoidrpathissues/src/kudu/src/kudu/rpc/rpc-test.cc:267: Connecting to unix:/tmp/dist-test-taskyjrhKV/test-tmp/rpc-test-e3ffb4b64b854b0ca7c3b9195284c7f5.sock
I20260926 22:15:04.460496 31547 test_util.cc:175] -----------------------------------------------
I20260926 22:15:04.460687 31547 test_util.cc:176] Had fatal failures, leaving test files at /tmp/dist-test-taskyjrhKV/test-tmp/rpc-test.6.Parameters_TestRpc.TestCallWithChainCertAndChainCA_SSL_UnixSocket.1790460902879335-31547-0

Full log

Note: This is test shard 7 of 8.
[==========] Running 21 tests from 2 test suites.
[----------] Global test environment set-up.
[----------] 20 tests from Parameters/TestRpc
[ RUN      ] Parameters/TestRpc.TestMessengerCreateDestroy/SSL_UnixSocket
WARNING: Logging before InitGoogleLogging() is written to STDERR
I20260926 22:15:03.015761 31547 rpc-test.cc:169] started messenger TestCreateDestroy
[       OK ] Parameters/TestRpc.TestMessengerCreateDestroy/SSL_UnixSocket (1350 ms)
[ RUN      ] Parameters/TestRpc.TestNegotiationDeadlock/SSL_UnixSocket
I20260926 22:15:04.333148 31569 acceptor_pool.cc:254] collecting diagnostics on the listening RPC socket unix:/tmp/dist-test-taskyjrhKV/test-tmp/rpc-test-068804f5ad6e4c52976a5dc9c4a3990d.sock every 8 connection(s)
I20260926 22:15:04.335275 31570 acceptor_pool.cc:254] collecting diagnostics on the listening RPC socket unix:/tmp/dist-test-taskyjrhKV/test-tmp/rpc-test-068804f5ad6e4c52976a5dc9c4a3990d.sock every 8 connection(s)
[       OK ] Parameters/TestRpc.TestNegotiationDeadlock/SSL_UnixSocket (96 ms)
[ RUN      ] Parameters/TestRpc.TestCallWithChainCertAndChainCA/SSL_UnixSocket
I20260926 22:15:04.427279 31585 acceptor_pool.cc:254] collecting diagnostics on the listening RPC socket unix:/tmp/dist-test-taskyjrhKV/test-tmp/rpc-test-e3ffb4b64b854b0ca7c3b9195284c7f5.sock every 8 connection(s)
I20260926 22:15:04.430009 31586 acceptor_pool.cc:254] collecting diagnostics on the listening RPC socket unix:/tmp/dist-test-taskyjrhKV/test-tmp/rpc-test-e3ffb4b64b854b0ca7c3b9195284c7f5.sock every 8 connection(s)
/data0/somelongdirectorytoavoidrpathissues/src/kudu/src/kudu/rpc/rpc-test.cc:270: Failure
Failed
Bad status: Runtime error: could not verify certificate chain (error with cert: subject=CN = localhost, ST = sadfjas, C = AS, emailAddress = sdflkdsajf, O = lskdfjlsad, OU = sldfkja, issuer=C = AS, ST = ASDfkjdhf, L = lskdjf, O = saldfja, OU = skdjf, CN = localhost, emailAddress = sadjflkadsj): : certificate has expired
Google Test trace:
/data0/somelongdirectorytoavoidrpathissues/src/kudu/src/kudu/rpc/rpc-test.cc:267: Connecting to unix:/tmp/dist-test-taskyjrhKV/test-tmp/rpc-test-e3ffb4b64b854b0ca7c3b9195284c7f5.sock
I20260926 22:15:04.460496 31547 test_util.cc:175] -----------------------------------------------
I20260926 22:15:04.460687 31547 test_util.cc:176] Had fatal failures, leaving test files at /tmp/dist-test-taskyjrhKV/test-tmp/rpc-test.6.Parameters_TestRpc.TestCallWithChainCertAndChainCA_SSL_UnixSocket.1790460902879335-31547-0
[  FAILED  ] Parameters/TestRpc.TestCallWithChainCertAndChainCA/SSL_UnixSocket, where GetParam() = (true, true) (63 ms)
[ RUN      ] Parameters/TestRpc.TestCallWithPasswordProtectedKey/SSL_UnixSocket
I20260926 22:15:04.502144 31610 acceptor_pool.cc:254] collecting diagnostics on the listening RPC socket unix:/tmp/dist-test-taskyjrhKV/test-tmp/rpc-test-9e01592bb9be423e9819a79e1f55585e.sock every 8 connection(s)
I20260926 22:15:04.503095 31611 acceptor_pool.cc:254] collecting diagnostics on the listening RPC socket unix:/tmp/dist-test-taskyjrhKV/test-tmp/rpc-test-9e01592bb9be423e9819a79e1f55585e.sock every 8 connection(s)
W20260926 22:15:04.552331 31607 connection.cc:196] Error closing socket: Network error: TlsSocket::Close: Broken pipe
[       OK ] Parameters/TestRpc.TestCallWithPasswordProtectedKey/SSL_UnixSocket (98 ms)
[ RUN      ] Parameters/TestRpc.TestCallToBadServer/SSL_UnixSocket
I20260926 22:15:04.585381 31547 rpc-test.cc:394] Status: Network error: Client connection negotiation failed: client connection to 0.0.0.0:0: connect: Connection refused (error 111)
I20260926 22:15:04.586987 31547 rpc-test.cc:394] Status: Network error: Client connection negotiation failed: client connection to 0.0.0.0:0: connect: Connection refused (error 111)
I20260926 22:15:04.588410 31547 rpc-test.cc:394] Status: Network error: Client connection negotiation failed: client connection to 0.0.0.0:0: connect: Connection refused (error 111)
I20260926 22:15:04.589746 31547 rpc-test.cc:394] Status: Network error: Client connection negotiation failed: client connection to 0.0.0.0:0: connect: Connection refused (error 111)
I20260926 22:15:04.591171 31547 rpc-test.cc:394] Status: Network error: Client connection negotiation failed: client connection to 0.0.0.0:0: connect: Connection refused (error 111)
[       OK ] Parameters/TestRpc.TestCallToBadServer/SSL_UnixSocket (35 ms)
[ RUN      ] Parameters/TestRpc.TestWrongService/SSL_UnixSocket
I20260926 22:15:04.618155 31645 acceptor_pool.cc:254] collecting diagnostics on the listening RPC socket unix:/tmp/dist-test-taskyjrhKV/test-tmp/rpc-test-e67ac0248c8f48a8809349afd4249a6b.sock every 8 connection(s)
I20260926 22:15:04.619096 31646 acceptor_pool.cc:254] collecting diagnostics on the listening RPC socket unix:/tmp/dist-test-taskyjrhKV/test-tmp/rpc-test-e67ac0248c8f48a8809349afd4249a6b.sock every 8 connection(s)
I20260926 22:15:04.674773 31642 messenger.cc:345] service WrongServiceName not registered on TestServer
W20260926 22:15:04.678833 31642 connection.cc:196] Error closing socket: Network error: TlsSocket::Close: Broken pipe
[       OK ] Parameters/TestRpc.TestWrongService/SSL_UnixSocket (90 ms)
[ RUN      ] Parameters/TestRpc.TestConnectionKeepalive/SSL_UnixSocket
I20260926 22:15:04.710076 31668 acceptor_pool.cc:254] collecting diagnostics on the listening RPC socket unix:/tmp/dist-test-taskyjrhKV/test-tmp/rpc-test-0c9d2214f5f9464f93ca67753ab9d7fe.sock every 8 connection(s)
I20260926 22:15:04.710840 31669 acceptor_pool.cc:254] collecting diagnostics on the listening RPC socket unix:/tmp/dist-test-taskyjrhKV/test-tmp/rpc-test-0c9d2214f5f9464f93ca67753ab9d7fe.sock every 8 connection(s)
I20260926 22:15:04.714246 31547 rpc-test.cc:488] Connecting to unix:/tmp/dist-test-taskyjrhKV/test-tmp/rpc-test-0c9d2214f5f9464f93ca67753ab9d7fe.sock
W20260926 22:15:05.189571 31681 connection.cc:196] Error closing socket: Network error: TlsSocket::Close: Broken pipe
[       OK ] Parameters/TestRpc.TestConnectionKeepalive/SSL_UnixSocket (1096 ms)
[ RUN      ] Parameters/TestRpc.TestClientConnectionMetrics/SSL_UnixSocket
I20260926 22:15:05.820576 31693 acceptor_pool.cc:254] collecting diagnostics on the listening RPC socket unix:/tmp/dist-test-taskyjrhKV/test-tmp/rpc-test-2a266432697f46a583c8a322b8cb6c65.sock every 8 connection(s)
I20260926 22:15:05.822064 31694 acceptor_pool.cc:254] collecting diagnostics on the listening RPC socket unix:/tmp/dist-test-taskyjrhKV/test-tmp/rpc-test-2a266432697f46a583c8a322b8cb6c65.sock every 8 connection(s)
I20260926 22:15:05.826164 31547 rpc-test.cc:569] Connecting to unix:/tmp/dist-test-taskyjrhKV/test-tmp/rpc-test-2a266432697f46a583c8a322b8cb6c65.sock
W20260926 22:17:38.490170 31690 connection.cc:196] Error closing socket: Network error: TlsSocket::Close: Broken pipe
[       OK ] Parameters/TestRpc.TestClientConnectionMetrics/SSL_UnixSocket (152715 ms)
[ RUN      ] Parameters/TestRpc.TestCredentialsPolicy/SSL_UnixSocket
I20260926 22:17:38.518215 31731 acceptor_pool.cc:254] collecting diagnostics on the listening RPC socket unix:/tmp/dist-test-taskyjrhKV/test-tmp/rpc-test-a0406806c6dd4b0a99def25b116cb699.sock every 8 connection(s)
I20260926 22:17:38.519167 31732 acceptor_pool.cc:254] collecting diagnostics on the listening RPC socket unix:/tmp/dist-test-taskyjrhKV/test-tmp/rpc-test-a0406806c6dd4b0a99def25b116cb699.sock every 8 connection(s)
I20260926 22:17:38.522621 31547 rpc-test.cc:700] Connecting to unix:/tmp/dist-test-taskyjrhKV/test-tmp/rpc-test-a0406806c6dd4b0a99def25b116cb699.sock
[       OK ] Parameters/TestRpc.TestCredentialsPolicy/SSL_UnixSocket (92 ms)
[ RUN      ] Parameters/TestRpc.TestCallLongerThanKeepalive/SSL_UnixSocket
I20260926 22:17:38.608301 31756 acceptor_pool.cc:254] collecting diagnostics on the listening RPC socket unix:/tmp/dist-test-taskyjrhKV/test-tmp/rpc-test-b619b88ff36b4d0ebcfb1c71945495ad.sock every 8 connection(s)
I20260926 22:17:38.608994 31757 acceptor_pool.cc:254] collecting diagnostics on the listening RPC socket unix:/tmp/dist-test-taskyjrhKV/test-tmp/rpc-test-b619b88ff36b4d0ebcfb1c71945495ad.sock every 8 connection(s)
I20260926 22:17:38.635713 31760 rpc-test-base.h:222] got call: sleep_micros: 3000000 deferred: true
I20260926 22:17:41.640767 31760 rpcz_store.cc:275] Call kudu.rpc.GenericCalculatorService.Sleep from unix:<unnamed> (request call id 0) took 3005 ms. Trace:
I20260926 22:17:41.641172 31760 rpcz_store.cc:276] 0926 22:17:38.635350 (+     0us) service_pool.cc:170] Inserting onto call queue
0926 22:17:38.635545 (+   195us) service_pool.cc:227] Handling call
0926 22:17:41.640704 (+3005159us) inbound_call.cc:173] Queueing success response
Metrics: {}
W20260926 22:17:41.645501 31753 connection.cc:196] Error closing socket: Network error: TlsSocket::Close: Broken pipe
[       OK ] Parameters/TestRpc.TestCallLongerThanKeepalive/SSL_UnixSocket (3061 ms)
[ RUN      ] Parameters/TestRpc.TestRpcSidecar/SSL_UnixSocket
I20260926 22:17:41.690783 31781 acceptor_pool.cc:254] collecting diagnostics on the listening RPC socket unix:/tmp/dist-test-taskyjrhKV/test-tmp/rpc-test-b4cb62dd93a54b2db1371a0f78886c23.sock every 8 connection(s)
I20260926 22:17:41.691491 31782 acceptor_pool.cc:254] collecting diagnostics on the listening RPC socket unix:/tmp/dist-test-taskyjrhKV/test-tmp/rpc-test-b4cb62dd93a54b2db1371a0f78886c23.sock every 8 connection(s)
W20260926 22:17:42.267719 31778 connection.cc:196] Error closing socket: Network error: TlsSocket::Close: Broken pipe
[       OK ] Parameters/TestRpc.TestRpcSidecar/SSL_UnixSocket (621 ms)
[ RUN      ] Parameters/TestRpc.TestRpcSidecarLimits/SSL_UnixSocket
I20260926 22:18:01.376884 31808 acceptor_pool.cc:254] collecting diagnostics on the listening RPC socket unix:/tmp/dist-test-taskyjrhKV/test-tmp/rpc-test-858e6c992ac74f2e874bb6314d894e33.sock every 8 connection(s)
I20260926 22:18:01.378791 31809 acceptor_pool.cc:254] collecting diagnostics on the listening RPC socket unix:/tmp/dist-test-taskyjrhKV/test-tmp/rpc-test-858e6c992ac74f2e874bb6314d894e33.sock every 8 connection(s)
W20260926 22:18:01.453923 31547 serialization.cc:72] Serialized kudu.rpc_test.PushStringsRequestPB (2147483654 bytes) is larger than the maximum configured RPC message size (52428800 bytes). Sending anyway, but peer may reject the data.
W20260926 22:18:01.466706 31805 connection.cc:535] server connection from unix:<unnamed> recv error: Network error: RPC frame had a length of 2147483714, but we only support messages up to 52428800 bytes long.
W20260926 22:18:01.467159 31805 connection.cc:158] shutting down server connection from unix:<unnamed> with pending inbound data: 4/2147483714 bytes received; last active 0 ns ago: status Network error: RPC frame had a length of 2147483714, but we only support messages up to 52428800 bytes long.
W20260926 22:18:01.468238 31821 connection.cc:698] client connection to unix:/tmp/dist-test-taskyjrhKV/test-tmp/rpc-test-858e6c992ac74f2e874bb6314d894e33.sock send error: Network error: failed to write to TLS socket: Broken pipe
W20260926 22:18:01.469003 31821 connection.cc:196] Error closing socket: Network error: TlsSocket::Close: Success
[       OK ] Parameters/TestRpc.TestRpcSidecarLimits/SSL_UnixSocket (20126 ms)
[ RUN      ] Parameters/TestRpc.TestCallTimeoutDoesntAffectNegotiation/SSL_UnixSocket
I20260926 22:18:02.430047 31833 acceptor_pool.cc:254] collecting diagnostics on the listening RPC socket unix:/tmp/dist-test-taskyjrhKV/test-tmp/rpc-test-846085e9231d48e096017d12a538c33b.sock every 8 connection(s)
I20260926 22:18:02.430821 31834 acceptor_pool.cc:254] collecting diagnostics on the listening RPC socket unix:/tmp/dist-test-taskyjrhKV/test-tmp/rpc-test-846085e9231d48e096017d12a538c33b.sock every 8 connection(s)
W20260926 22:18:02.476233 31829 negotiation.cc:266] Injecting 500ms delay in negotiation
I20260926 22:18:02.526197 31547 rpc-test-base.h:595] status: Timed out: connection negotiation to unix:/tmp/dist-test-taskyjrhKV/test-tmp/rpc-test-846085e9231d48e096017d12a538c33b.sock for RPC Sleep timed out after 0.050s (ON_OUTBOUND_QUEUE), seconds elapsed: 0.0510928
[       OK ] Parameters/TestRpc.TestCallTimeoutDoesntAffectNegotiation/SSL_UnixSocket (594 ms)
[ RUN      ] Parameters/TestRpc.TestRpcHandlerLatencyMetric/SSL_UnixSocket
I20260926 22:18:03.018747 31858 acceptor_pool.cc:254] collecting diagnostics on the listening RPC socket unix:/tmp/dist-test-taskyjrhKV/test-tmp/rpc-test-14ab5004c6a04b60b8b4ffbca1f0de94.sock every 8 connection(s)
I20260926 22:18:03.019518 31859 acceptor_pool.cc:254] collecting diagnostics on the listening RPC socket unix:/tmp/dist-test-taskyjrhKV/test-tmp/rpc-test-14ab5004c6a04b60b8b4ffbca1f0de94.sock every 8 connection(s)
I20260926 22:18:03.083797 31547 rpc-test.cc:1236] Sleep() min lat: 22393
I20260926 22:18:03.084007 31547 rpc-test.cc:1237] Sleep() mean lat: 22393
I20260926 22:18:03.084132 31547 rpc-test.cc:1238] Sleep() max lat: 22393
I20260926 22:18:03.084313 31547 rpc-test.cc:1239] Sleep() #calls: 1
W20260926 22:18:03.088474 31855 connection.cc:196] Error closing socket: Network error: TlsSocket::Close: Broken pipe
[       OK ] Parameters/TestRpc.TestRpcHandlerLatencyMetric/SSL_UnixSocket (100 ms)
[ RUN      ] Parameters/TestRpc.TimedOutOnResponseMetricServiceQueue/SSL_UnixSocket
I20260926 22:18:03.116835 31884 acceptor_pool.cc:254] collecting diagnostics on the listening RPC socket unix:/tmp/dist-test-taskyjrhKV/test-tmp/rpc-test-91a13fdd4ddb42ac8702e05062743bd5.sock every 8 connection(s)
I20260926 22:18:03.117666 31885 acceptor_pool.cc:254] collecting diagnostics on the listening RPC socket unix:/tmp/dist-test-taskyjrhKV/test-tmp/rpc-test-91a13fdd4ddb42ac8702e05062743bd5.sock every 8 connection(s)
W20260926 22:18:03.221966 31886 rpcz_store.cc:267] Call kudu.rpc_test.CalculatorService.Sleep from unix:<unnamed> (request call id 2) took 20 ms (client timeout 20 ms). Trace:
W20260926 22:18:03.222337 31886 rpcz_store.cc:269] 0926 22:18:03.201165 (+     0us) service_pool.cc:170] Inserting onto call queue
0926 22:18:03.221815 (+ 20650us) service_pool.cc:214] Skipping call since client already timed out
0926 22:18:03.221908 (+    93us) inbound_call.cc:173] Queueing failure response
Metrics: {}
W20260926 22:18:03.225633 31881 connection.cc:196] Error closing socket: Network error: TlsSocket::Close: Broken pipe
[       OK ] Parameters/TestRpc.TimedOutOnResponseMetricServiceQueue/SSL_UnixSocket (134 ms)
[ RUN      ] Parameters/TestRpc.RpcPendingConnectionsMetric/SSL_UnixSocket
I20260926 22:18:03.244148 31907 acceptor_pool.cc:254] collecting diagnostics on the listening RPC socket 0.0.0.0:36177 every 8 connection(s)
I20260926 22:18:03.244895 31908 acceptor_pool.cc:254] collecting diagnostics on the listening RPC socket 0.0.0.0:36177 every 8 connection(s)
W20260926 22:18:03.251773 31903 negotiation.cc:337] Failed RPC negotiation. Trace:
0926 22:18:03.249428 (+     0us) reactor.cc:625] Submitting negotiation task for server connection from 127.0.0.1:58388 (local address 127.0.0.1:36177)
0926 22:18:03.250329 (+   901us) server_negotiation.cc:206] Beginning negotiation
0926 22:18:03.250350 (+    21us) server_negotiation.cc:399] Waiting for connection header
0926 22:18:03.250946 (+   596us) negotiation.cc:327] Negotiation complete: Network error: Server connection negotiation failed: server connection from 127.0.0.1:58388: BlockingRecv error: recv got EOF from 127.0.0.1:58388 (error 108)
Metrics: {"server-negotiator.queue_time_us":327}
[       OK ] Parameters/TestRpc.RpcPendingConnectionsMetric/SSL_UnixSocket (35 ms)
[ RUN      ] Parameters/TestRpc.TestRpcContextClientDeadline/SSL_UnixSocket
I20260926 22:18:03.293650 31923 acceptor_pool.cc:254] collecting diagnostics on the listening RPC socket unix:/tmp/dist-test-taskyjrhKV/test-tmp/rpc-test-6e65a60f9ae448b28242f1e3d04aa2cf.sock every 8 connection(s)
I20260926 22:18:03.294420 31924 acceptor_pool.cc:254] collecting diagnostics on the listening RPC socket unix:/tmp/dist-test-taskyjrhKV/test-tmp/rpc-test-6e65a60f9ae448b28242f1e3d04aa2cf.sock every 8 connection(s)
[       OK ] Parameters/TestRpc.TestRpcContextClientDeadline/SSL_UnixSocket (102 ms)
[ RUN      ] Parameters/TestRpc.TestApplicationFeatureFlagUnsupportedServer/SSL_UnixSocket
I20260926 22:18:03.405207 31948 acceptor_pool.cc:254] collecting diagnostics on the listening RPC socket unix:/tmp/dist-test-taskyjrhKV/test-tmp/rpc-test-356eae4bef8c4f1c9682326d58b6f631.sock every 8 connection(s)
I20260926 22:18:03.406018 31949 acceptor_pool.cc:254] collecting diagnostics on the listening RPC socket unix:/tmp/dist-test-taskyjrhKV/test-tmp/rpc-test-356eae4bef8c4f1c9682326d58b6f631.sock every 8 connection(s)
W20260926 22:18:03.462459 31945 connection.cc:196] Error closing socket: Network error: TlsSocket::Close: Broken pipe
[       OK ] Parameters/TestRpc.TestApplicationFeatureFlagUnsupportedServer/SSL_UnixSocket (99 ms)
[ RUN      ] Parameters/TestRpc.TestCancellationAsync/SSL_UnixSocket
I20260926 22:18:03.512607 31973 acceptor_pool.cc:254] collecting diagnostics on the listening RPC socket unix:/tmp/dist-test-taskyjrhKV/test-tmp/rpc-test-8904f39d544d41268695e9d668832c43.sock every 8 connection(s)
I20260926 22:18:03.513454 31974 acceptor_pool.cc:254] collecting diagnostics on the listening RPC socket unix:/tmp/dist-test-taskyjrhKV/test-tmp/rpc-test-8904f39d544d41268695e9d668832c43.sock every 8 connection(s)
I20260926 22:18:03.517019 31547 rpc-test.cc:1716] Connecting to unix:/tmp/dist-test-taskyjrhKV/test-tmp/rpc-test-8904f39d544d41268695e9d668832c43.sock
I20260926 22:18:03.532487 31547 test_util.cc:268] Using random seed: 886979758
W20260926 22:18:03.665247 31986 outbound_call.cc:322] RPC callback for RPC call kudu.rpc.GenericCalculatorService.SleepWithSidecar -> {remote=unix:/tmp/dist-test-taskyjrhKV/test-tmp/rpc-test-8904f39d544d41268695e9d668832c43.sock, user_credentials={real_user=slave}} blocked reactor thread for 56135.8us
I20260926 22:18:03.882700 31977 rpc-test-base.h:240] got call: sleep_micros: 500 pattern: 4294967295 num_repetitions: 2097152 sidecar_idx: 0
I20260926 22:18:04.099117 31976 rpc-test-base.h:240] got call: sleep_micros: 500 pattern: 4294967295 num_repetitions: 2097152 sidecar_idx: 0
I20260926 22:18:04.366230 31977 rpc-test-base.h:240] got call: sleep_micros: 500 pattern: 4294967295 num_repetitions: 2097152 sidecar_idx: 0
I20260926 22:18:04.566570 31976 rpc-test-base.h:240] got call: sleep_micros: 500 pattern: 4294967295 num_repetitions: 2097152 sidecar_idx: 0
I20260926 22:18:04.809615 31977 rpc-test-base.h:240] got call: sleep_micros: 500 pattern: 4294967295 num_repetitions: 2097152 sidecar_idx: 0
I20260926 22:18:05.047634 31977 rpc-test-base.h:240] got call: sleep_micros: 500 pattern: 4294967295 num_repetitions: 2097152 sidecar_idx: 0
I20260926 22:18:05.292382 31977 rpc-test-base.h:240] got call: sleep_micros: 500 pattern: 4294967295 num_repetitions: 2097152 sidecar_idx: 0
I20260926 22:18:05.542824 31977 rpc-test-base.h:240] got call: sleep_micros: 500 pattern: 4294967295 num_repetitions: 2097152 sidecar_idx: 0
I20260926 22:18:05.783046 31976 rpc-test-base.h:240] got call: sleep_micros: 500 pattern: 4294967295 num_repetitions: 2097152 sidecar_idx: 0
W20260926 22:18:05.801918 31970 connection.cc:196] Error closing socket: Network error: TlsSocket::Close: Broken pipe
W20260926 22:18:05.934257 31970 connection.cc:441] server connection from unix:<unnamed> torn down before Call kudu.rpc.GenericCalculatorService.SleepWithSidecar from unix:<unnamed> (request call id 9) could send its response
[       OK ] Parameters/TestRpc.TestCancellationAsync/SSL_UnixSocket (2477 ms)
[ RUN      ] Parameters/TestRpc.TestPerformanceBySocketType/SSL_UnixSocket
I20260926 22:18:06.046015 31999 acceptor_pool.cc:254] collecting diagnostics on the listening RPC socket unix:/tmp/dist-test-taskyjrhKV/test-tmp/rpc-test-036fb855909943e5a9c1a20ec0b23b04.sock every 8 connection(s)
I20260926 22:18:06.047039 32000 acceptor_pool.cc:254] collecting diagnostics on the listening RPC socket unix:/tmp/dist-test-taskyjrhKV/test-tmp/rpc-test-036fb855909943e5a9c1a20ec0b23b04.sock every 8 connection(s)
I20260926 22:18:06.051043 31547 rpc-test.cc:1846] Connecting to unix:/tmp/dist-test-taskyjrhKV/test-tmp/rpc-test-036fb855909943e5a9c1a20ec0b23b04.sock
I20260926 22:18:30.804185 31547 rpc-test.cc:1859] Sending 1024MB via ssl-enabled unix socket: real 24.733s	user 23.344s	sys 15.498s
I20260926 22:18:54.468081 31547 rpc-test.cc:1859] Sending 1024MB via ssl-enabled unix socket: real 23.663s	user 21.909s	sys 14.827s
I20260926 22:19:17.867142 31547 rpc-test.cc:1859] Sending 1024MB via ssl-enabled unix socket: real 23.399s	user 21.814s	sys 14.545s
I20260926 22:19:41.590737 31547 rpc-test.cc:1859] Sending 1024MB via ssl-enabled unix socket: real 23.723s	user 22.217s	sys 14.692s
I20260926 22:20:05.851382 31547 rpc-test.cc:1859] Sending 1024MB via ssl-enabled unix socket: real 24.260s	user 22.780s	sys 15.001s
W20260926 22:20:05.859079 31996 connection.cc:196] Error closing socket: Network error: TlsSocket::Close: Broken pipe
[       OK ] Parameters/TestRpc.TestPerformanceBySocketType/SSL_UnixSocket (119926 ms)
[----------] 20 tests from Parameters/TestRpc (302923 ms total)

[----------] 1 test from Parameters/TestRpcSocketTxRxQueue
[ RUN      ] Parameters/TestRpcSocketTxRxQueue.AcceptorRxQueueSizeMetric/0
I20260926 22:20:05.892932 32036 acceptor_pool.cc:254] collecting diagnostics on the listening RPC socket 0.0.0.0:38035 every 1 connection(s)
I20260926 22:20:05.893918 32037 acceptor_pool.cc:254] collecting diagnostics on the listening RPC socket 0.0.0.0:38035 every 1 connection(s)
W20260926 22:20:05.900635 32032 negotiation.cc:337] Failed RPC negotiation. Trace:
0926 22:20:05.898846 (+     0us) reactor.cc:625] Submitting negotiation task for server connection from 127.0.0.1:49260 (local address 127.0.0.1:38035)
0926 22:20:05.899404 (+   558us) server_negotiation.cc:206] Beginning negotiation
0926 22:20:05.899429 (+    25us) server_negotiation.cc:399] Waiting for connection header
0926 22:20:05.899693 (+   264us) negotiation.cc:327] Negotiation complete: Network error: Server connection negotiation failed: server connection from 127.0.0.1:49260: BlockingRecv error: recv got EOF from 127.0.0.1:49260 (error 108)
Metrics: {"server-negotiator.queue_time_us":161}
[       OK ] Parameters/TestRpcSocketTxRxQueue.AcceptorRxQueueSizeMetric/0 (35 ms)
[----------] 1 test from Parameters/TestRpcSocketTxRxQueue (35 ms total)

[----------] Global test environment tear-down
[==========] 21 tests from 2 test suites ran. (302960 ms total)
[  PASSED  ] 20 tests.
[  FAILED  ] 1 test, listed below:
[  FAILED  ] Parameters/TestRpc.TestCallWithChainCertAndChainCA/SSL_UnixSocket, where GetParam() = (true, true)

 1 FAILED TEST