Diagnosed failure
Parameters/TestRpc.TestCallWithChainCertAndChainCA/SSL_UnixSocket: /data0/somelongdirectorytoavoidrpathissues/src/kudu/src/kudu/rpc/rpc-test.cc:270: Failure
Failed
Bad status: Runtime error: could not verify certificate chain (error with cert: subject=CN = localhost, ST = sadfjas, C = AS, emailAddress = sdflkdsajf, O = lskdfjlsad, OU = sldfkja, issuer=C = AS, ST = ASDfkjdhf, L = lskdjf, O = saldfja, OU = skdjf, CN = localhost, emailAddress = sadjflkadsj): : certificate has expired
Google Test trace:
/data0/somelongdirectorytoavoidrpathissues/src/kudu/src/kudu/rpc/rpc-test.cc:267: Connecting to unix:/tmp/dist-test-taskphL0kp/test-tmp/rpc-test-fb4e61ff8d564c0c8b0c1b95489669e4.sock
I20260924 09:57:12.272461 379 test_util.cc:175] -----------------------------------------------
I20260924 09:57:12.272550 379 test_util.cc:176] Had fatal failures, leaving test files at /tmp/dist-test-taskphL0kp/test-tmp/rpc-test.6.Parameters_TestRpc.TestCallWithChainCertAndChainCA_SSL_UnixSocket.1790243832137866-379-0
Full log
Note: This is test shard 7 of 8.
[==========] Running 21 tests from 2 test suites.
[----------] Global test environment set-up.
[----------] 20 tests from Parameters/TestRpc
[ RUN ] Parameters/TestRpc.TestMessengerCreateDestroy/SSL_UnixSocket
WARNING: Logging before InitGoogleLogging() is written to STDERR
I20260924 09:57:12.195024 379 rpc-test.cc:169] started messenger TestCreateDestroy
[ OK ] Parameters/TestRpc.TestMessengerCreateDestroy/SSL_UnixSocket (41 ms)
[ RUN ] Parameters/TestRpc.TestNegotiationDeadlock/SSL_UnixSocket
I20260924 09:57:12.207835 399 acceptor_pool.cc:254] collecting diagnostics on the listening RPC socket unix:/tmp/dist-test-taskphL0kp/test-tmp/rpc-test-7a1f5ed57b084d47b4c3ad5d3ac6ae3b.sock every 8 connection(s)
I20260924 09:57:12.208222 400 acceptor_pool.cc:254] collecting diagnostics on the listening RPC socket unix:/tmp/dist-test-taskphL0kp/test-tmp/rpc-test-7a1f5ed57b084d47b4c3ad5d3ac6ae3b.sock every 8 connection(s)
[ OK ] Parameters/TestRpc.TestNegotiationDeadlock/SSL_UnixSocket (28 ms)
[ RUN ] Parameters/TestRpc.TestCallWithChainCertAndChainCA/SSL_UnixSocket
I20260924 09:57:12.261314 415 acceptor_pool.cc:254] collecting diagnostics on the listening RPC socket unix:/tmp/dist-test-taskphL0kp/test-tmp/rpc-test-fb4e61ff8d564c0c8b0c1b95489669e4.sock every 8 connection(s)
I20260924 09:57:12.261653 416 acceptor_pool.cc:254] collecting diagnostics on the listening RPC socket unix:/tmp/dist-test-taskphL0kp/test-tmp/rpc-test-fb4e61ff8d564c0c8b0c1b95489669e4.sock every 8 connection(s)
/data0/somelongdirectorytoavoidrpathissues/src/kudu/src/kudu/rpc/rpc-test.cc:270: Failure
Failed
Bad status: Runtime error: could not verify certificate chain (error with cert: subject=CN = localhost, ST = sadfjas, C = AS, emailAddress = sdflkdsajf, O = lskdfjlsad, OU = sldfkja, issuer=C = AS, ST = ASDfkjdhf, L = lskdjf, O = saldfja, OU = skdjf, CN = localhost, emailAddress = sadjflkadsj): : certificate has expired
Google Test trace:
/data0/somelongdirectorytoavoidrpathissues/src/kudu/src/kudu/rpc/rpc-test.cc:267: Connecting to unix:/tmp/dist-test-taskphL0kp/test-tmp/rpc-test-fb4e61ff8d564c0c8b0c1b95489669e4.sock
I20260924 09:57:12.272461 379 test_util.cc:175] -----------------------------------------------
I20260924 09:57:12.272550 379 test_util.cc:176] Had fatal failures, leaving test files at /tmp/dist-test-taskphL0kp/test-tmp/rpc-test.6.Parameters_TestRpc.TestCallWithChainCertAndChainCA_SSL_UnixSocket.1790243832137866-379-0
[ FAILED ] Parameters/TestRpc.TestCallWithChainCertAndChainCA/SSL_UnixSocket, where GetParam() = (true, true) (45 ms)
[ RUN ] Parameters/TestRpc.TestCallWithPasswordProtectedKey/SSL_UnixSocket
I20260924 09:57:12.299094 440 acceptor_pool.cc:254] collecting diagnostics on the listening RPC socket unix:/tmp/dist-test-taskphL0kp/test-tmp/rpc-test-e4c8ae54c40c45ca8bb0468d80a59a0e.sock every 8 connection(s)
I20260924 09:57:12.299324 441 acceptor_pool.cc:254] collecting diagnostics on the listening RPC socket unix:/tmp/dist-test-taskphL0kp/test-tmp/rpc-test-e4c8ae54c40c45ca8bb0468d80a59a0e.sock every 8 connection(s)
W20260924 09:57:12.329457 437 connection.cc:196] Error closing socket: Network error: TlsSocket::Close: Broken pipe
[ OK ] Parameters/TestRpc.TestCallWithPasswordProtectedKey/SSL_UnixSocket (61 ms)
[ RUN ] Parameters/TestRpc.TestCallToBadServer/SSL_UnixSocket
I20260924 09:57:12.346534 379 rpc-test.cc:394] Status: Network error: Client connection negotiation failed: client connection to 0.0.0.0:0: connect: Connection refused (error 111)
I20260924 09:57:12.347110 379 rpc-test.cc:394] Status: Network error: Client connection negotiation failed: client connection to 0.0.0.0:0: connect: Connection refused (error 111)
I20260924 09:57:12.347746 379 rpc-test.cc:394] Status: Network error: Client connection negotiation failed: client connection to 0.0.0.0:0: connect: Connection refused (error 111)
I20260924 09:57:12.348256 379 rpc-test.cc:394] Status: Network error: Client connection negotiation failed: client connection to 0.0.0.0:0: connect: Connection refused (error 111)
I20260924 09:57:12.348745 379 rpc-test.cc:394] Status: Network error: Client connection negotiation failed: client connection to 0.0.0.0:0: connect: Connection refused (error 111)
[ OK ] Parameters/TestRpc.TestCallToBadServer/SSL_UnixSocket (16 ms)
[ RUN ] Parameters/TestRpc.TestWrongService/SSL_UnixSocket
I20260924 09:57:12.369191 475 acceptor_pool.cc:254] collecting diagnostics on the listening RPC socket unix:/tmp/dist-test-taskphL0kp/test-tmp/rpc-test-6f955d60ff724be1b5f3d324bbd8cb97.sock every 8 connection(s)
I20260924 09:57:12.369519 476 acceptor_pool.cc:254] collecting diagnostics on the listening RPC socket unix:/tmp/dist-test-taskphL0kp/test-tmp/rpc-test-6f955d60ff724be1b5f3d324bbd8cb97.sock every 8 connection(s)
I20260924 09:57:12.399268 472 messenger.cc:345] service WrongServiceName not registered on TestServer
W20260924 09:57:12.401122 472 connection.cc:196] Error closing socket: Network error: TlsSocket::Close: Broken pipe
[ OK ] Parameters/TestRpc.TestWrongService/SSL_UnixSocket (115 ms)
[ RUN ] Parameters/TestRpc.TestConnectionKeepalive/SSL_UnixSocket
I20260924 09:57:12.478312 498 acceptor_pool.cc:254] collecting diagnostics on the listening RPC socket unix:/tmp/dist-test-taskphL0kp/test-tmp/rpc-test-6319bd4f61cf42a18f89f209230132d6.sock every 8 connection(s)
I20260924 09:57:12.478600 499 acceptor_pool.cc:254] collecting diagnostics on the listening RPC socket unix:/tmp/dist-test-taskphL0kp/test-tmp/rpc-test-6319bd4f61cf42a18f89f209230132d6.sock every 8 connection(s)
I20260924 09:57:12.479509 379 rpc-test.cc:488] Connecting to unix:/tmp/dist-test-taskphL0kp/test-tmp/rpc-test-6319bd4f61cf42a18f89f209230132d6.sock
W20260924 09:57:12.969249 511 connection.cc:196] Error closing socket: Network error: TlsSocket::Close: Broken pipe
[ OK ] Parameters/TestRpc.TestConnectionKeepalive/SSL_UnixSocket (1046 ms)
[ RUN ] Parameters/TestRpc.TestClientConnectionMetrics/SSL_UnixSocket
I20260924 09:57:13.539149 523 acceptor_pool.cc:254] collecting diagnostics on the listening RPC socket unix:/tmp/dist-test-taskphL0kp/test-tmp/rpc-test-4ce090a228c84aa4a454130fd303c8d0.sock every 8 connection(s)
I20260924 09:57:13.539383 524 acceptor_pool.cc:254] collecting diagnostics on the listening RPC socket unix:/tmp/dist-test-taskphL0kp/test-tmp/rpc-test-4ce090a228c84aa4a454130fd303c8d0.sock every 8 connection(s)
I20260924 09:57:13.540370 379 rpc-test.cc:569] Connecting to unix:/tmp/dist-test-taskphL0kp/test-tmp/rpc-test-4ce090a228c84aa4a454130fd303c8d0.sock
W20260924 09:57:33.724584 520 connection.cc:196] Error closing socket: Network error: TlsSocket::Close: Broken pipe
[ OK ] Parameters/TestRpc.TestClientConnectionMetrics/SSL_UnixSocket (20217 ms)
[ RUN ] Parameters/TestRpc.TestCredentialsPolicy/SSL_UnixSocket
I20260924 09:57:33.752396 546 acceptor_pool.cc:254] collecting diagnostics on the listening RPC socket unix:/tmp/dist-test-taskphL0kp/test-tmp/rpc-test-fbce17564b734faf8dc92442e996671d.sock every 8 connection(s)
I20260924 09:57:33.752599 547 acceptor_pool.cc:254] collecting diagnostics on the listening RPC socket unix:/tmp/dist-test-taskphL0kp/test-tmp/rpc-test-fbce17564b734faf8dc92442e996671d.sock every 8 connection(s)
I20260924 09:57:33.753522 379 rpc-test.cc:700] Connecting to unix:/tmp/dist-test-taskphL0kp/test-tmp/rpc-test-fbce17564b734faf8dc92442e996671d.sock
W20260924 09:57:33.774073 545 connection.cc:196] Error closing socket: Network error: TlsSocket::Close: Broken pipe
[ OK ] Parameters/TestRpc.TestCredentialsPolicy/SSL_UnixSocket (53 ms)
[ RUN ] Parameters/TestRpc.TestCallLongerThanKeepalive/SSL_UnixSocket
I20260924 09:57:33.801200 571 acceptor_pool.cc:254] collecting diagnostics on the listening RPC socket unix:/tmp/dist-test-taskphL0kp/test-tmp/rpc-test-6b6fe5031c1c445a8e941ad663b07bad.sock every 8 connection(s)
I20260924 09:57:33.801429 572 acceptor_pool.cc:254] collecting diagnostics on the listening RPC socket unix:/tmp/dist-test-taskphL0kp/test-tmp/rpc-test-6b6fe5031c1c445a8e941ad663b07bad.sock every 8 connection(s)
I20260924 09:57:33.830773 575 rpc-test-base.h:222] got call: sleep_micros: 3000000 deferred: true
I20260924 09:57:36.832314 575 rpcz_store.cc:275] Call kudu.rpc.GenericCalculatorService.Sleep from unix:<unnamed> (request call id 0) took 3001 ms. Trace:
I20260924 09:57:36.832463 575 rpcz_store.cc:276] 0924 09:57:33.830680 (+ 0us) service_pool.cc:170] Inserting onto call queue
0924 09:57:33.830736 (+ 56us) service_pool.cc:227] Handling call
0924 09:57:36.832272 (+3001536us) inbound_call.cc:173] Queueing success response
Metrics: {}
[ OK ] Parameters/TestRpc.TestCallLongerThanKeepalive/SSL_UnixSocket (3054 ms)
[ RUN ] Parameters/TestRpc.TestRpcSidecar/SSL_UnixSocket
I20260924 09:57:36.852272 596 acceptor_pool.cc:254] collecting diagnostics on the listening RPC socket unix:/tmp/dist-test-taskphL0kp/test-tmp/rpc-test-6ab64cffc517440c8f352ab50cbfcd32.sock every 8 connection(s)
I20260924 09:57:36.852501 597 acceptor_pool.cc:254] collecting diagnostics on the listening RPC socket unix:/tmp/dist-test-taskphL0kp/test-tmp/rpc-test-6ab64cffc517440c8f352ab50cbfcd32.sock every 8 connection(s)
W20260924 09:57:36.938763 593 connection.cc:196] Error closing socket: Network error: TlsSocket::Close: Broken pipe
[ OK ] Parameters/TestRpc.TestRpcSidecar/SSL_UnixSocket (104 ms)
[ RUN ] Parameters/TestRpc.TestRpcSidecarLimits/SSL_UnixSocket
I20260924 09:57:39.014966 621 acceptor_pool.cc:254] collecting diagnostics on the listening RPC socket unix:/tmp/dist-test-taskphL0kp/test-tmp/rpc-test-6e18eb052c744aee97d69925253f33e8.sock every 8 connection(s)
I20260924 09:57:39.015218 622 acceptor_pool.cc:254] collecting diagnostics on the listening RPC socket unix:/tmp/dist-test-taskphL0kp/test-tmp/rpc-test-6e18eb052c744aee97d69925253f33e8.sock every 8 connection(s)
W20260924 09:57:39.040941 379 serialization.cc:72] Serialized kudu.rpc_test.PushStringsRequestPB (2147483654 bytes) is larger than the maximum configured RPC message size (52428800 bytes). Sending anyway, but peer may reject the data.
W20260924 09:57:39.046255 618 connection.cc:535] server connection from unix:<unnamed> recv error: Network error: RPC frame had a length of 2147483714, but we only support messages up to 52428800 bytes long.
W20260924 09:57:39.046355 618 connection.cc:158] shutting down server connection from unix:<unnamed> with pending inbound data: 4/2147483714 bytes received; last active 0 ns ago: status Network error: RPC frame had a length of 2147483714, but we only support messages up to 52428800 bytes long.
W20260924 09:57:39.046908 634 connection.cc:196] Error closing socket: Network error: TlsSocket::Close: Broken pipe
I20260924 09:57:39.059129 646 acceptor_pool.cc:254] collecting diagnostics on the listening RPC socket unix:/tmp/dist-test-taskphL0kp/test-tmp/rpc-test-6e18eb052c744aee97d69925253f33e8.sock every 8 connection(s)
I20260924 09:57:39.059249 647 acceptor_pool.cc:254] collecting diagnostics on the listening RPC socket unix:/tmp/dist-test-taskphL0kp/test-tmp/rpc-test-6e18eb052c744aee97d69925253f33e8.sock every 8 connection(s)
W20260924 09:57:44.565529 643 connection.cc:577] server connection from unix:<unnamed>: received bad data: 'Corruption: Invalid packet: message had a length of 2147483710, but we only support messages up to 2147483647 bytes
'
W20260924 09:57:44.566128 659 connection.cc:196] Error closing socket: Network error: TlsSocket::Close: Broken pipe
[ OK ] Parameters/TestRpc.TestRpcSidecarLimits/SSL_UnixSocket (8099 ms)
[ RUN ] Parameters/TestRpc.TestCallTimeoutDoesntAffectNegotiation/SSL_UnixSocket
I20260924 09:57:45.063360 671 acceptor_pool.cc:254] collecting diagnostics on the listening RPC socket unix:/tmp/dist-test-taskphL0kp/test-tmp/rpc-test-82ef63d098dd460ab7b4bb3422286971.sock every 8 connection(s)
I20260924 09:57:45.063633 672 acceptor_pool.cc:254] collecting diagnostics on the listening RPC socket unix:/tmp/dist-test-taskphL0kp/test-tmp/rpc-test-82ef63d098dd460ab7b4bb3422286971.sock every 8 connection(s)
W20260924 09:57:45.078898 667 negotiation.cc:266] Injecting 500ms delay in negotiation
I20260924 09:57:45.129410 379 rpc-test-base.h:595] status: Timed out: connection negotiation to unix:/tmp/dist-test-taskphL0kp/test-tmp/rpc-test-82ef63d098dd460ab7b4bb3422286971.sock for RPC Sleep timed out after 0.050s (ON_OUTBOUND_QUEUE), seconds elapsed: 0.0510333
W20260924 09:57:45.585714 668 connection.cc:196] Error closing socket: Network error: TlsSocket::Close: Broken pipe
[ OK ] Parameters/TestRpc.TestCallTimeoutDoesntAffectNegotiation/SSL_UnixSocket (547 ms)
[ RUN ] Parameters/TestRpc.TestRpcHandlerLatencyMetric/SSL_UnixSocket
I20260924 09:57:45.603401 696 acceptor_pool.cc:254] collecting diagnostics on the listening RPC socket unix:/tmp/dist-test-taskphL0kp/test-tmp/rpc-test-757e44a2f0b8485e8181bba9bd53540a.sock every 8 connection(s)
I20260924 09:57:45.603652 697 acceptor_pool.cc:254] collecting diagnostics on the listening RPC socket unix:/tmp/dist-test-taskphL0kp/test-tmp/rpc-test-757e44a2f0b8485e8181bba9bd53540a.sock every 8 connection(s)
I20260924 09:57:45.657472 379 rpc-test.cc:1236] Sleep() min lat: 20608
I20260924 09:57:45.657608 379 rpc-test.cc:1237] Sleep() mean lat: 20608
I20260924 09:57:45.657684 379 rpc-test.cc:1238] Sleep() max lat: 20608
I20260924 09:57:45.657717 379 rpc-test.cc:1239] Sleep() #calls: 1
W20260924 09:57:45.659960 693 connection.cc:196] Error closing socket: Network error: TlsSocket::Close: Broken pipe
[ OK ] Parameters/TestRpc.TestRpcHandlerLatencyMetric/SSL_UnixSocket (73 ms)
[ RUN ] Parameters/TestRpc.TimedOutOnResponseMetricServiceQueue/SSL_UnixSocket
I20260924 09:57:45.673879 722 acceptor_pool.cc:254] collecting diagnostics on the listening RPC socket unix:/tmp/dist-test-taskphL0kp/test-tmp/rpc-test-c8e6092aec9841bebfa297191c05d886.sock every 8 connection(s)
I20260924 09:57:45.674149 723 acceptor_pool.cc:254] collecting diagnostics on the listening RPC socket unix:/tmp/dist-test-taskphL0kp/test-tmp/rpc-test-c8e6092aec9841bebfa297191c05d886.sock every 8 connection(s)
W20260924 09:57:45.730712 724 rpcz_store.cc:267] Call kudu.rpc_test.CalculatorService.Sleep from unix:<unnamed> (request call id 2) took 20 ms (client timeout 20 ms). Trace:
W20260924 09:57:45.730949 724 rpcz_store.cc:269] 0924 09:57:45.710237 (+ 0us) service_pool.cc:170] Inserting onto call queue
0924 09:57:45.730641 (+ 20404us) service_pool.cc:214] Skipping call since client already timed out
0924 09:57:45.730697 (+ 56us) inbound_call.cc:173] Queueing failure response
Metrics: {}
W20260924 09:57:45.732335 719 connection.cc:196] Error closing socket: Network error: TlsSocket::Close: Broken pipe
[ OK ] Parameters/TestRpc.TimedOutOnResponseMetricServiceQueue/SSL_UnixSocket (72 ms)
[ RUN ] Parameters/TestRpc.RpcPendingConnectionsMetric/SSL_UnixSocket
I20260924 09:57:45.740224 745 acceptor_pool.cc:254] collecting diagnostics on the listening RPC socket 0.0.0.0:34231 every 8 connection(s)
I20260924 09:57:45.740445 746 acceptor_pool.cc:254] collecting diagnostics on the listening RPC socket 0.0.0.0:34231 every 8 connection(s)
W20260924 09:57:45.750379 741 negotiation.cc:337] Failed RPC negotiation. Trace:
0924 09:57:45.749532 (+ 0us) reactor.cc:625] Submitting negotiation task for server connection from 127.0.0.1:60700 (local address 127.0.0.1:34231)
0924 09:57:45.749754 (+ 222us) server_negotiation.cc:206] Beginning negotiation
0924 09:57:45.749760 (+ 6us) server_negotiation.cc:399] Waiting for connection header
0924 09:57:45.749947 (+ 187us) negotiation.cc:327] Negotiation complete: Network error: Server connection negotiation failed: server connection from 127.0.0.1:60700: BlockingRecv error: recv got EOF from 127.0.0.1:60700 (error 108)
Metrics: {"server-negotiator.queue_time_us":75}
[ OK ] Parameters/TestRpc.RpcPendingConnectionsMetric/SSL_UnixSocket (26 ms)
[ RUN ] Parameters/TestRpc.TestRpcContextClientDeadline/SSL_UnixSocket
I20260924 09:57:45.772578 761 acceptor_pool.cc:254] collecting diagnostics on the listening RPC socket unix:/tmp/dist-test-taskphL0kp/test-tmp/rpc-test-85b75c61d6e746358f5eea181d5cfeb4.sock every 8 connection(s)
I20260924 09:57:45.772768 762 acceptor_pool.cc:254] collecting diagnostics on the listening RPC socket unix:/tmp/dist-test-taskphL0kp/test-tmp/rpc-test-85b75c61d6e746358f5eea181d5cfeb4.sock every 8 connection(s)
[ OK ] Parameters/TestRpc.TestRpcContextClientDeadline/SSL_UnixSocket (52 ms)
[ RUN ] Parameters/TestRpc.TestApplicationFeatureFlagUnsupportedServer/SSL_UnixSocket
I20260924 09:57:45.833201 786 acceptor_pool.cc:254] collecting diagnostics on the listening RPC socket unix:/tmp/dist-test-taskphL0kp/test-tmp/rpc-test-78fbade9ca8243e1b197e4ec580c2805.sock every 8 connection(s)
I20260924 09:57:45.833451 787 acceptor_pool.cc:254] collecting diagnostics on the listening RPC socket unix:/tmp/dist-test-taskphL0kp/test-tmp/rpc-test-78fbade9ca8243e1b197e4ec580c2805.sock every 8 connection(s)
[ OK ] Parameters/TestRpc.TestApplicationFeatureFlagUnsupportedServer/SSL_UnixSocket (59 ms)
[ RUN ] Parameters/TestRpc.TestCancellationAsync/SSL_UnixSocket
I20260924 09:57:45.890257 811 acceptor_pool.cc:254] collecting diagnostics on the listening RPC socket unix:/tmp/dist-test-taskphL0kp/test-tmp/rpc-test-a4f8b6f169324bf4ad415e59ff74e663.sock every 8 connection(s)
I20260924 09:57:45.890497 812 acceptor_pool.cc:254] collecting diagnostics on the listening RPC socket unix:/tmp/dist-test-taskphL0kp/test-tmp/rpc-test-a4f8b6f169324bf4ad415e59ff74e663.sock every 8 connection(s)
I20260924 09:57:45.891381 379 rpc-test.cc:1716] Connecting to unix:/tmp/dist-test-taskphL0kp/test-tmp/rpc-test-a4f8b6f169324bf4ad415e59ff74e663.sock
I20260924 09:57:45.913832 379 test_util.cc:268] Using random seed: -1582274089
I20260924 09:57:45.956621 815 rpc-test-base.h:240] got call: sleep_micros: 500 pattern: 4294967295 num_repetitions: 2097152 sidecar_idx: 0
I20260924 09:57:45.976346 814 rpc-test-base.h:240] got call: sleep_micros: 500 pattern: 4294967295 num_repetitions: 2097152 sidecar_idx: 0
I20260924 09:57:46.004384 813 rpc-test-base.h:240] got call: sleep_micros: 500 pattern: 4294967295 num_repetitions: 2097152 sidecar_idx: 0
I20260924 09:57:46.042963 813 rpc-test-base.h:240] got call: sleep_micros: 500 pattern: 4294967295 num_repetitions: 2097152 sidecar_idx: 0
I20260924 09:57:46.073839 813 rpc-test-base.h:240] got call: sleep_micros: 500 pattern: 4294967295 num_repetitions: 2097152 sidecar_idx: 0
I20260924 09:57:46.106742 813 rpc-test-base.h:240] got call: sleep_micros: 500 pattern: 4294967295 num_repetitions: 2097152 sidecar_idx: 0
W20260924 09:57:46.108832 808 connection.cc:196] Error closing socket: Network error: TlsSocket::Close: Broken pipe
W20260924 09:57:46.140448 808 connection.cc:441] server connection from unix:<unnamed> torn down before Call kudu.rpc.GenericCalculatorService.SleepWithSidecar from unix:<unnamed> (request call id 9) could send its response
[ OK ] Parameters/TestRpc.TestCancellationAsync/SSL_UnixSocket (269 ms)
[ RUN ] Parameters/TestRpc.TestPerformanceBySocketType/SSL_UnixSocket
I20260924 09:57:46.173696 836 acceptor_pool.cc:254] collecting diagnostics on the listening RPC socket unix:/tmp/dist-test-taskphL0kp/test-tmp/rpc-test-de69da0ece9d46e583da140b48f5454b.sock every 8 connection(s)
I20260924 09:57:46.173909 837 acceptor_pool.cc:254] collecting diagnostics on the listening RPC socket unix:/tmp/dist-test-taskphL0kp/test-tmp/rpc-test-de69da0ece9d46e583da140b48f5454b.sock every 8 connection(s)
I20260924 09:57:46.174832 379 rpc-test.cc:1846] Connecting to unix:/tmp/dist-test-taskphL0kp/test-tmp/rpc-test-de69da0ece9d46e583da140b48f5454b.sock
I20260924 09:57:49.320240 379 rpc-test.cc:1859] Sending 1024MB via ssl-enabled unix socket: real 3.133s user 3.143s sys 2.237s
I20260924 09:57:52.310782 379 rpc-test.cc:1859] Sending 1024MB via ssl-enabled unix socket: real 2.990s user 2.890s sys 2.202s
I20260924 09:57:55.265455 379 rpc-test.cc:1859] Sending 1024MB via ssl-enabled unix socket: real 2.955s user 2.815s sys 2.208s
I20260924 09:57:58.325464 379 rpc-test.cc:1859] Sending 1024MB via ssl-enabled unix socket: real 3.060s user 2.923s sys 2.293s
I20260924 09:58:01.381635 379 rpc-test.cc:1859] Sending 1024MB via ssl-enabled unix socket: real 3.056s user 2.941s sys 2.264s
W20260924 09:58:01.383893 833 connection.cc:196] Error closing socket: Network error: TlsSocket::Close: Broken pipe
[ OK ] Parameters/TestRpc.TestPerformanceBySocketType/SSL_UnixSocket (15245 ms)
[----------] 20 tests from Parameters/TestRpc (49233 ms total)
[----------] 1 test from Parameters/TestRpcSocketTxRxQueue
[ RUN ] Parameters/TestRpcSocketTxRxQueue.AcceptorRxQueueSizeMetric/0
I20260924 09:58:01.398396 861 acceptor_pool.cc:254] collecting diagnostics on the listening RPC socket 0.0.0.0:37611 every 1 connection(s)
I20260924 09:58:01.398646 862 acceptor_pool.cc:254] collecting diagnostics on the listening RPC socket 0.0.0.0:37611 every 1 connection(s)
W20260924 09:58:01.400323 857 negotiation.cc:337] Failed RPC negotiation. Trace:
0924 09:58:01.399963 (+ 0us) reactor.cc:625] Submitting negotiation task for server connection from 127.0.0.1:34502 (local address 127.0.0.1:37611)
0924 09:58:01.400104 (+ 141us) server_negotiation.cc:206] Beginning negotiation
0924 09:58:01.400108 (+ 4us) server_negotiation.cc:399] Waiting for connection header
0924 09:58:01.400222 (+ 114us) negotiation.cc:327] Negotiation complete: Network error: Server connection negotiation failed: server connection from 127.0.0.1:34502: BlockingRecv error: recv got EOF from 127.0.0.1:34502 (error 108)
Metrics: {"server-negotiator.queue_time_us":48}
[ OK ] Parameters/TestRpcSocketTxRxQueue.AcceptorRxQueueSizeMetric/0 (13 ms)
[----------] 1 test from Parameters/TestRpcSocketTxRxQueue (13 ms total)
[----------] Global test environment tear-down
[==========] 21 tests from 2 test suites ran. (49247 ms total)
[ PASSED ] 20 tests.
[ FAILED ] 1 test, listed below:
[ FAILED ] Parameters/TestRpc.TestCallWithChainCertAndChainCA/SSL_UnixSocket, where GetParam() = (true, true)
1 FAILED TEST