Diagnosed failure

Parameters/TestRpc.TestCallWithChainCertAndRootCA/SSL_UnixSocket: /data0/somelongdirectorytoavoidrpathissues/src/kudu/src/kudu/rpc/rpc-test.cc:303: Failure
Failed
Bad status: Runtime error: could not verify certificate chain (error with cert: subject=CN = localhost, ST = sadfjas, C = AS, emailAddress = sdflkdsajf, O = lskdfjlsad, OU = sldfkja, issuer=C = AS, ST = ASDfkjdhf, L = lskdjf, O = saldfja, OU = skdjf, CN = localhost, emailAddress = sadjflkadsj): : certificate has expired
Google Test trace:
/data0/somelongdirectorytoavoidrpathissues/src/kudu/src/kudu/rpc/rpc-test.cc:300: Connecting to unix:/tmp/dist-test-taskqZY4Oa/test-tmp/rpc-test-dfce26393e424cf48866cb751a951125.sock
I20260928 23:50:07.938156 10732 test_util.cc:175] -----------------------------------------------
I20260928 23:50:07.938359 10732 test_util.cc:176] Had fatal failures, leaving test files at /tmp/dist-test-taskqZY4Oa/test-tmp/rpc-test.2.Parameters_TestRpc.TestCallWithChainCertAndRootCA_SSL_UnixSocket.1790639404423851-10732-0

Full log

Note: This is test shard 3 of 8.
[==========] Running 21 tests from 2 test suites.
[----------] Global test environment set-up.
[----------] 1 test from TestRpc
[ RUN      ] TestRpc.TestNegotiationTimeout
WARNING: Logging before InitGoogleLogging() is written to STDERR
I20260928 23:50:04.615839 10732 rpc-test-base.h:595] status: Timed out: connection negotiation to 0.0.0.0:46223 for RPC Sleep timed out after 0.100s (ON_OUTBOUND_QUEUE), seconds elapsed: 0.101834
W20260928 23:50:07.615423 10742 negotiation.cc:337] Failed RPC negotiation. Trace:
0928 23:50:04.514966 (+     0us) reactor.cc:625] Submitting negotiation task for client connection to 0.0.0.0:46223 (local address 127.0.0.1:60300)
0928 23:50:04.515747 (+   781us) negotiation.cc:107] Waiting for socket to connect
0928 23:50:04.515796 (+    49us) client_negotiation.cc:174] Beginning negotiation
0928 23:50:04.528534 (+ 12738us) client_negotiation.cc:252] Sending NEGOTIATE NegotiatePB request
0928 23:50:07.614199 (+3085665us) negotiation.cc:327] Negotiation complete: Timed out: Client connection negotiation failed: client connection to 0.0.0.0:46223: received 0 of 4 requested bytes
Metrics: {"client-negotiator.queue_time_us":215}
[       OK ] TestRpc.TestNegotiationTimeout (3143 ms)
[----------] 1 test from TestRpc (3143 ms total)

[----------] 20 tests from Parameters/TestRpc
[ RUN      ] Parameters/TestRpc.TestAcceptorPoolStartStop/SSL_UnixSocket
I20260928 23:50:07.648193 10758 acceptor_pool.cc:254] collecting diagnostics on the listening RPC socket unix:/tmp/dist-test-taskqZY4Oa/test-tmp/rpc-test-1f33e480295e4e168a07aecb4c1dad1c.sock every 8 connection(s)
I20260928 23:50:07.650246 10759 acceptor_pool.cc:254] collecting diagnostics on the listening RPC socket unix:/tmp/dist-test-taskqZY4Oa/test-tmp/rpc-test-1f33e480295e4e168a07aecb4c1dad1c.sock every 8 connection(s)
I20260928 23:50:07.706359 10769 acceptor_pool.cc:254] collecting diagnostics on the listening RPC socket unix:/tmp/dist-test-taskqZY4Oa/test-tmp/rpc-test-1f33e480295e4e168a07aecb4c1dad1c.sock every 8 connection(s)
I20260928 23:50:07.707598 10770 acceptor_pool.cc:254] collecting diagnostics on the listening RPC socket unix:/tmp/dist-test-taskqZY4Oa/test-tmp/rpc-test-1f33e480295e4e168a07aecb4c1dad1c.sock every 8 connection(s)
I20260928 23:50:07.739845 10780 acceptor_pool.cc:254] collecting diagnostics on the listening RPC socket unix:/tmp/dist-test-taskqZY4Oa/test-tmp/rpc-test-1f33e480295e4e168a07aecb4c1dad1c.sock every 8 connection(s)
I20260928 23:50:07.740543 10781 acceptor_pool.cc:254] collecting diagnostics on the listening RPC socket unix:/tmp/dist-test-taskqZY4Oa/test-tmp/rpc-test-1f33e480295e4e168a07aecb4c1dad1c.sock every 8 connection(s)
I20260928 23:50:07.780488 10791 acceptor_pool.cc:254] collecting diagnostics on the listening RPC socket unix:/tmp/dist-test-taskqZY4Oa/test-tmp/rpc-test-1f33e480295e4e168a07aecb4c1dad1c.sock every 8 connection(s)
I20260928 23:50:07.781193 10792 acceptor_pool.cc:254] collecting diagnostics on the listening RPC socket unix:/tmp/dist-test-taskqZY4Oa/test-tmp/rpc-test-1f33e480295e4e168a07aecb4c1dad1c.sock every 8 connection(s)
I20260928 23:50:07.798776 10802 acceptor_pool.cc:254] collecting diagnostics on the listening RPC socket unix:/tmp/dist-test-taskqZY4Oa/test-tmp/rpc-test-1f33e480295e4e168a07aecb4c1dad1c.sock every 8 connection(s)
I20260928 23:50:07.799443 10803 acceptor_pool.cc:254] collecting diagnostics on the listening RPC socket unix:/tmp/dist-test-taskqZY4Oa/test-tmp/rpc-test-1f33e480295e4e168a07aecb4c1dad1c.sock every 8 connection(s)
[       OK ] Parameters/TestRpc.TestAcceptorPoolStartStop/SSL_UnixSocket (182 ms)
[ RUN      ] Parameters/TestRpc.TestCall/SSL_UnixSocket
I20260928 23:50:07.823315 10815 acceptor_pool.cc:254] collecting diagnostics on the listening RPC socket unix:/tmp/dist-test-taskqZY4Oa/test-tmp/rpc-test-0f53031aa5b54b57b4693838b514ba50.sock every 8 connection(s)
I20260928 23:50:07.825225 10816 acceptor_pool.cc:254] collecting diagnostics on the listening RPC socket unix:/tmp/dist-test-taskqZY4Oa/test-tmp/rpc-test-0f53031aa5b54b57b4693838b514ba50.sock every 8 connection(s)
I20260928 23:50:07.830641 10732 rpc-test.cc:234] Connecting to unix:/tmp/dist-test-taskqZY4Oa/test-tmp/rpc-test-0f53031aa5b54b57b4693838b514ba50.sock
[       OK ] Parameters/TestRpc.TestCall/SSL_UnixSocket (81 ms)
[ RUN      ] Parameters/TestRpc.TestCallWithChainCertAndRootCA/SSL_UnixSocket
I20260928 23:50:07.915608 10840 acceptor_pool.cc:254] collecting diagnostics on the listening RPC socket unix:/tmp/dist-test-taskqZY4Oa/test-tmp/rpc-test-dfce26393e424cf48866cb751a951125.sock every 8 connection(s)
I20260928 23:50:07.916339 10841 acceptor_pool.cc:254] collecting diagnostics on the listening RPC socket unix:/tmp/dist-test-taskqZY4Oa/test-tmp/rpc-test-dfce26393e424cf48866cb751a951125.sock every 8 connection(s)
/data0/somelongdirectorytoavoidrpathissues/src/kudu/src/kudu/rpc/rpc-test.cc:303: Failure
Failed
Bad status: Runtime error: could not verify certificate chain (error with cert: subject=CN = localhost, ST = sadfjas, C = AS, emailAddress = sdflkdsajf, O = lskdfjlsad, OU = sldfkja, issuer=C = AS, ST = ASDfkjdhf, L = lskdjf, O = saldfja, OU = skdjf, CN = localhost, emailAddress = sadjflkadsj): : certificate has expired
Google Test trace:
/data0/somelongdirectorytoavoidrpathissues/src/kudu/src/kudu/rpc/rpc-test.cc:300: Connecting to unix:/tmp/dist-test-taskqZY4Oa/test-tmp/rpc-test-dfce26393e424cf48866cb751a951125.sock
I20260928 23:50:07.938156 10732 test_util.cc:175] -----------------------------------------------
I20260928 23:50:07.938359 10732 test_util.cc:176] Had fatal failures, leaving test files at /tmp/dist-test-taskqZY4Oa/test-tmp/rpc-test.2.Parameters_TestRpc.TestCallWithChainCertAndRootCA_SSL_UnixSocket.1790639404423851-10732-0
[  FAILED  ] Parameters/TestRpc.TestCallWithChainCertAndRootCA/SSL_UnixSocket, where GetParam() = (true, true) (53 ms)
[ RUN      ] Parameters/TestRpc.TestCallWithBadPasswordProtectedKey/SSL_UnixSocket
[       OK ] Parameters/TestRpc.TestCallWithBadPasswordProtectedKey/SSL_UnixSocket (30 ms)
[ RUN      ] Parameters/TestRpc.TestInvalidMethodCall/SSL_UnixSocket
I20260928 23:50:07.990280 10877 acceptor_pool.cc:254] collecting diagnostics on the listening RPC socket unix:/tmp/dist-test-taskqZY4Oa/test-tmp/rpc-test-74f257923d764d45a5d14d2993e68e7f.sock every 8 connection(s)
I20260928 23:50:07.991148 10878 acceptor_pool.cc:254] collecting diagnostics on the listening RPC socket unix:/tmp/dist-test-taskqZY4Oa/test-tmp/rpc-test-74f257923d764d45a5d14d2993e68e7f.sock every 8 connection(s)
I20260928 23:50:07.994939 10732 rpc-test.cc:406] Connecting to unix:/tmp/dist-test-taskqZY4Oa/test-tmp/rpc-test-74f257923d764d45a5d14d2993e68e7f.sock
W20260928 23:50:08.029953 10874 connection.cc:196] Error closing socket: Network error: TlsSocket::Close: Broken pipe
[       OK ] Parameters/TestRpc.TestInvalidMethodCall/SSL_UnixSocket (65 ms)
[ RUN      ] Parameters/TestRpc.TestHighFDs/SSL_UnixSocket
I20260928 23:50:08.261010 10902 acceptor_pool.cc:254] collecting diagnostics on the listening RPC socket unix:/tmp/dist-test-taskqZY4Oa/test-tmp/rpc-test-b189c92bfcc34d00b8290647235f09b2.sock every 8 connection(s)
I20260928 23:50:08.261906 10903 acceptor_pool.cc:254] collecting diagnostics on the listening RPC socket unix:/tmp/dist-test-taskqZY4Oa/test-tmp/rpc-test-b189c92bfcc34d00b8290647235f09b2.sock every 8 connection(s)
[       OK ] Parameters/TestRpc.TestHighFDs/SSL_UnixSocket (271 ms)
[ RUN      ] Parameters/TestRpc.TestConnectionAlwaysKeepalive/SSL_UnixSocket
I20260928 23:50:08.323848 10925 acceptor_pool.cc:254] collecting diagnostics on the listening RPC socket unix:/tmp/dist-test-taskqZY4Oa/test-tmp/rpc-test-bfc67ebd556e479893a753d2e3c8b6dd.sock every 8 connection(s)
I20260928 23:50:08.324536 10926 acceptor_pool.cc:254] collecting diagnostics on the listening RPC socket unix:/tmp/dist-test-taskqZY4Oa/test-tmp/rpc-test-bfc67ebd556e479893a753d2e3c8b6dd.sock every 8 connection(s)
I20260928 23:50:08.328749 10732 rpc-test.cc:532] Connecting to unix:/tmp/dist-test-taskqZY4Oa/test-tmp/rpc-test-bfc67ebd556e479893a753d2e3c8b6dd.sock
[       OK ] Parameters/TestRpc.TestConnectionAlwaysKeepalive/SSL_UnixSocket (3078 ms)
[ RUN      ] Parameters/TestRpc.TestReopenOutboundConnections/SSL_UnixSocket
I20260928 23:50:11.439085 10948 acceptor_pool.cc:254] collecting diagnostics on the listening RPC socket unix:/tmp/dist-test-taskqZY4Oa/test-tmp/rpc-test-1df364bb7f89464e9642d2871557164e.sock every 8 connection(s)
I20260928 23:50:11.439805 10949 acceptor_pool.cc:254] collecting diagnostics on the listening RPC socket unix:/tmp/dist-test-taskqZY4Oa/test-tmp/rpc-test-1df364bb7f89464e9642d2871557164e.sock every 8 connection(s)
I20260928 23:50:11.442904 10732 rpc-test.cc:658] Connecting to unix:/tmp/dist-test-taskqZY4Oa/test-tmp/rpc-test-1df364bb7f89464e9642d2871557164e.sock
W20260928 23:50:11.468253 10947 connection.cc:196] Error closing socket: Network error: TlsSocket::Close: Broken pipe
W20260928 23:50:11.479009 10947 connection.cc:196] Error closing socket: Network error: TlsSocket::Close: Broken pipe
W20260928 23:50:11.489094 10947 connection.cc:196] Error closing socket: Network error: TlsSocket::Close: Broken pipe
W20260928 23:50:11.500010 10947 connection.cc:196] Error closing socket: Network error: TlsSocket::Close: Broken pipe
W20260928 23:50:11.511301 10947 connection.cc:196] Error closing socket: Network error: TlsSocket::Close: Broken pipe
W20260928 23:50:11.523322 10947 connection.cc:196] Error closing socket: Network error: TlsSocket::Close: Broken pipe
W20260928 23:50:11.535144 10947 connection.cc:196] Error closing socket: Network error: TlsSocket::Close: Broken pipe
W20260928 23:50:11.545295 10947 connection.cc:196] Error closing socket: Network error: TlsSocket::Close: Broken pipe
W20260928 23:50:11.555760 10947 connection.cc:196] Error closing socket: Network error: TlsSocket::Close: Broken pipe
W20260928 23:50:11.565347 10947 connection.cc:196] Error closing socket: Network error: TlsSocket::Close: Broken pipe
W20260928 23:50:11.575461 10947 connection.cc:196] Error closing socket: Network error: TlsSocket::Close: Broken pipe
W20260928 23:50:11.585752 10947 connection.cc:196] Error closing socket: Network error: TlsSocket::Close: Broken pipe
W20260928 23:50:11.597438 10947 connection.cc:196] Error closing socket: Network error: TlsSocket::Close: Broken pipe
W20260928 23:50:11.612296 10948 acceptor_pool.cc:285] unable to collect diagnostics on RPC socket unix:/tmp/dist-test-taskqZY4Oa/test-tmp/rpc-test-1df364bb7f89464e9642d2871557164e.sock: Not implemented: netlink diagnostics is currently supported only on IPv4 TCP sockets
W20260928 23:50:11.613018 10947 connection.cc:196] Error closing socket: Network error: TlsSocket::Close: Broken pipe
W20260928 23:50:11.625265 10947 connection.cc:196] Error closing socket: Network error: TlsSocket::Close: Broken pipe
W20260928 23:50:11.638826 10947 connection.cc:196] Error closing socket: Network error: TlsSocket::Close: Broken pipe
W20260928 23:50:11.649103 10947 connection.cc:196] Error closing socket: Network error: TlsSocket::Close: Broken pipe
W20260928 23:50:11.659245 10947 connection.cc:196] Error closing socket: Network error: TlsSocket::Close: Broken pipe
W20260928 23:50:11.669353 10947 connection.cc:196] Error closing socket: Network error: TlsSocket::Close: Broken pipe
W20260928 23:50:11.679695 10947 connection.cc:196] Error closing socket: Network error: TlsSocket::Close: Broken pipe
W20260928 23:50:11.692679 10947 connection.cc:196] Error closing socket: Network error: TlsSocket::Close: Broken pipe
W20260928 23:50:11.703490 10947 connection.cc:196] Error closing socket: Network error: TlsSocket::Close: Broken pipe
W20260928 23:50:11.714027 10947 connection.cc:196] Error closing socket: Network error: TlsSocket::Close: Broken pipe
W20260928 23:50:11.723973 10947 connection.cc:196] Error closing socket: Network error: TlsSocket::Close: Broken pipe
W20260928 23:50:11.734532 10947 connection.cc:196] Error closing socket: Network error: TlsSocket::Close: Broken pipe
W20260928 23:50:11.744395 10947 connection.cc:196] Error closing socket: Network error: TlsSocket::Close: Broken pipe
W20260928 23:50:11.754379 10947 connection.cc:196] Error closing socket: Network error: TlsSocket::Close: Broken pipe
W20260928 23:50:11.763865 10947 connection.cc:196] Error closing socket: Network error: TlsSocket::Close: Broken pipe
W20260928 23:50:11.773346 10947 connection.cc:196] Error closing socket: Network error: TlsSocket::Close: Broken pipe
W20260928 23:50:11.783264 10947 connection.cc:196] Error closing socket: Network error: TlsSocket::Close: Broken pipe
W20260928 23:50:11.792284 10947 connection.cc:196] Error closing socket: Network error: TlsSocket::Close: Broken pipe
[       OK ] Parameters/TestRpc.TestReopenOutboundConnections/SSL_UnixSocket (421 ms)
[ RUN      ] Parameters/TestRpc.TestConnectionNetworkPlane/SSL_UnixSocket
I20260928 23:50:11.830006 10971 acceptor_pool.cc:254] collecting diagnostics on the listening RPC socket unix:/tmp/dist-test-taskqZY4Oa/test-tmp/rpc-test-1a9d2d2465d5446e841b7bd2974732ef.sock every 8 connection(s)
I20260928 23:50:11.830688 10972 acceptor_pool.cc:254] collecting diagnostics on the listening RPC socket unix:/tmp/dist-test-taskqZY4Oa/test-tmp/rpc-test-1a9d2d2465d5446e841b7bd2974732ef.sock every 8 connection(s)
I20260928 23:50:11.833788 10732 rpc-test.cc:772] Connecting to unix:/tmp/dist-test-taskqZY4Oa/test-tmp/rpc-test-1a9d2d2465d5446e841b7bd2974732ef.sock
W20260928 23:50:11.876423 10970 connection.cc:196] Error closing socket: Network error: TlsSocket::Close: Broken pipe
[       OK ] Parameters/TestRpc.TestConnectionNetworkPlane/SSL_UnixSocket (73 ms)
[ RUN      ] Parameters/TestRpc.TestTCPKeepalive/SSL_UnixSocket
I20260928 23:50:11.915832 10996 acceptor_pool.cc:254] collecting diagnostics on the listening RPC socket unix:/tmp/dist-test-taskqZY4Oa/test-tmp/rpc-test-d56df1548d3843a8a7901526e297bdd6.sock every 8 connection(s)
I20260928 23:50:11.916555 10997 acceptor_pool.cc:254] collecting diagnostics on the listening RPC socket unix:/tmp/dist-test-taskqZY4Oa/test-tmp/rpc-test-d56df1548d3843a8a7901526e297bdd6.sock every 8 connection(s)
I20260928 23:50:11.951715 11000 rpc-test-base.h:222] got call: sleep_micros: 8000000 deferred: true
I20260928 23:50:19.955829 11000 rpcz_store.cc:275] Call kudu.rpc.GenericCalculatorService.Sleep from unix:<unnamed> (request call id 0) took 8004 ms. Trace:
I20260928 23:50:19.956239 11000 rpcz_store.cc:276] 0928 23:50:11.951553 (+     0us) service_pool.cc:170] Inserting onto call queue
0928 23:50:11.951657 (+   104us) service_pool.cc:227] Handling call
0928 23:50:19.955676 (+8004019us) inbound_call.cc:173] Queueing success response
Metrics: {}
W20260928 23:50:19.961616 10993 connection.cc:196] Error closing socket: Network error: TlsSocket::Close: Broken pipe
[       OK ] Parameters/TestRpc.TestTCPKeepalive/SSL_UnixSocket (8087 ms)
[ RUN      ] Parameters/TestRpc.TestMaxSmallSidecars/SSL_UnixSocket
I20260928 23:50:20.009768 11022 acceptor_pool.cc:254] collecting diagnostics on the listening RPC socket unix:/tmp/dist-test-taskqZY4Oa/test-tmp/rpc-test-ce6f8135d9544a56aa1c86884be0b385.sock every 8 connection(s)
I20260928 23:50:20.010576 11023 acceptor_pool.cc:254] collecting diagnostics on the listening RPC socket unix:/tmp/dist-test-taskqZY4Oa/test-tmp/rpc-test-ce6f8135d9544a56aa1c86884be0b385.sock every 8 connection(s)
W20260928 23:50:20.172909 11019 connection.cc:196] Error closing socket: Network error: TlsSocket::Close: Broken pipe
[       OK ] Parameters/TestRpc.TestMaxSmallSidecars/SSL_UnixSocket (209 ms)
[ RUN      ] Parameters/TestRpc.TestCallTimeout/SSL_UnixSocket
I20260928 23:50:20.200106 11047 acceptor_pool.cc:254] collecting diagnostics on the listening RPC socket unix:/tmp/dist-test-taskqZY4Oa/test-tmp/rpc-test-912c78f055ee4086857b7f11b55bc8f4.sock every 8 connection(s)
I20260928 23:50:20.200855 11048 acceptor_pool.cc:254] collecting diagnostics on the listening RPC socket unix:/tmp/dist-test-taskqZY4Oa/test-tmp/rpc-test-912c78f055ee4086857b7f11b55bc8f4.sock every 8 connection(s)
I20260928 23:50:20.225574 10732 rpc-test-base.h:595] status: Timed out: connection negotiation to unix:/tmp/dist-test-taskqZY4Oa/test-tmp/rpc-test-912c78f055ee4086857b7f11b55bc8f4.sock for RPC Sleep timed out after 0.000s (ON_OUTBOUND_QUEUE), seconds elapsed: 0.00222046
I20260928 23:50:20.232960 11051 rpc-test-base.h:222] got call: sleep_micros: 700000
I20260928 23:50:20.426681 10732 rpc-test-base.h:595] status: Timed out: Sleep RPC to unix:/tmp/dist-test-taskqZY4Oa/test-tmp/rpc-test-912c78f055ee4086857b7f11b55bc8f4.sock timed out after 0.200s (SENT), seconds elapsed: 0.200707
I20260928 23:50:20.427943 11050 rpc-test-base.h:222] got call: sleep_micros: 2000000
W20260928 23:50:20.933671 11051 rpcz_store.cc:267] Call kudu.rpc.GenericCalculatorService.Sleep from unix:<unnamed> (request call id 1) took 700 ms (client timeout 200 ms). Trace:
W20260928 23:50:20.934003 11051 rpcz_store.cc:269] 0928 23:50:20.232778 (+     0us) service_pool.cc:170] Inserting onto call queue
0928 23:50:20.232912 (+   134us) service_pool.cc:227] Handling call
0928 23:50:20.933616 (+700704us) inbound_call.cc:173] Queueing success response
Metrics: {}
I20260928 23:50:21.928634 10732 rpc-test-base.h:595] status: Timed out: Sleep RPC to unix:/tmp/dist-test-taskqZY4Oa/test-tmp/rpc-test-912c78f055ee4086857b7f11b55bc8f4.sock timed out after 1.500s (SENT), seconds elapsed: 1.50164
W20260928 23:50:22.428449 11050 rpcz_store.cc:267] Call kudu.rpc.GenericCalculatorService.Sleep from unix:<unnamed> (request call id 2) took 2000 ms (client timeout 1500 ms). Trace:
W20260928 23:50:22.428751 11050 rpcz_store.cc:269] 0928 23:50:20.427789 (+     0us) service_pool.cc:170] Inserting onto call queue
0928 23:50:20.427883 (+    94us) service_pool.cc:227] Handling call
0928 23:50:22.428382 (+2000499us) inbound_call.cc:173] Queueing success response
Metrics: {}
W20260928 23:50:22.429296 11044 connection.cc:441] server connection from unix:<unnamed> torn down before Call kudu.rpc.GenericCalculatorService.Sleep from unix:<unnamed> (request call id 2) could send its response
[       OK ] Parameters/TestRpc.TestCallTimeout/SSL_UnixSocket (2255 ms)
[ RUN      ] Parameters/TestRpc.TestServerShutsDown/SSL_UnixSocket
I20260928 23:50:22.435925 10732 rpc-test.cc:1125] Connecting to 0.0.0.0:38909
W20260928 23:50:22.445397 11064 negotiation.cc:337] Failed RPC negotiation. Trace:
0928 23:50:22.443902 (+     0us) reactor.cc:625] Submitting negotiation task for client connection to 0.0.0.0:38909 (local address 127.0.0.1:44388)
0928 23:50:22.444385 (+   483us) negotiation.cc:107] Waiting for socket to connect
0928 23:50:22.444420 (+    35us) client_negotiation.cc:174] Beginning negotiation
0928 23:50:22.444653 (+   233us) client_negotiation.cc:252] Sending NEGOTIATE NegotiatePB request
0928 23:50:22.444881 (+   228us) negotiation.cc:327] Negotiation complete: Network error: Client connection negotiation failed: client connection to 0.0.0.0:38909: BlockingWrite error: write error: Broken pipe (error 32)
Metrics: {"client-negotiator.queue_time_us":133}
[       OK ] Parameters/TestRpc.TestServerShutsDown/SSL_UnixSocket (13 ms)
[ RUN      ] Parameters/TestRpc.TimedOutOnResponseMetric/SSL_UnixSocket
I20260928 23:50:22.474994 11081 acceptor_pool.cc:254] collecting diagnostics on the listening RPC socket unix:/tmp/dist-test-taskqZY4Oa/test-tmp/rpc-test-98ecc1bae0244353a68da94f07aab097.sock every 8 connection(s)
I20260928 23:50:22.475677 11082 acceptor_pool.cc:254] collecting diagnostics on the listening RPC socket unix:/tmp/dist-test-taskqZY4Oa/test-tmp/rpc-test-98ecc1bae0244353a68da94f07aab097.sock every 8 connection(s)
W20260928 23:50:22.722286 11085 rpcz_store.cc:267] Call kudu.rpc_test.CalculatorService.Sleep from unix:<unnamed> (request call id 3) took 50 ms (client timeout 25 ms). Trace:
W20260928 23:50:22.722576 11085 rpcz_store.cc:269] 0928 23:50:22.671696 (+     0us) service_pool.cc:170] Inserting onto call queue
0928 23:50:22.671804 (+   108us) service_pool.cc:227] Handling call
0928 23:50:22.722209 (+ 50405us) inbound_call.cc:173] Queueing success response
Related trace 'test_child':
Metrics: {"test_sleep_us":50000,"child_traces":[["test_child",{"related_trace_metric":1}]]}
W20260928 23:50:22.781324 11085 rpcz_store.cc:267] Call kudu.rpc_test.CalculatorService.Sleep from unix:<unnamed> (request call id 4) took 50 ms (client timeout 50 ms). Trace:
W20260928 23:50:22.781626 11085 rpcz_store.cc:269] 0928 23:50:22.730736 (+     0us) service_pool.cc:170] Inserting onto call queue
0928 23:50:22.730864 (+   128us) service_pool.cc:227] Handling call
0928 23:50:22.781260 (+ 50396us) inbound_call.cc:173] Queueing success response
Related trace 'test_child':
Metrics: {"test_sleep_us":50000,"child_traces":[["test_child",{"related_trace_metric":1}]]}
[       OK ] Parameters/TestRpc.TimedOutOnResponseMetric/SSL_UnixSocket (341 ms)
[ RUN      ] Parameters/TestRpc.AcceptorDispatchingTimesMetric/SSL_UnixSocket
I20260928 23:50:22.800688 11106 acceptor_pool.cc:254] collecting diagnostics on the listening RPC socket 0.0.0.0:44253 every 8 connection(s)
I20260928 23:50:22.801298 11107 acceptor_pool.cc:254] collecting diagnostics on the listening RPC socket 0.0.0.0:44253 every 8 connection(s)
W20260928 23:50:22.805899 11102 negotiation.cc:337] Failed RPC negotiation. Trace:
0928 23:50:22.804714 (+     0us) reactor.cc:625] Submitting negotiation task for server connection from 127.0.0.1:39934 (local address 127.0.0.1:44253)
0928 23:50:22.805102 (+   388us) server_negotiation.cc:206] Beginning negotiation
0928 23:50:22.805123 (+    21us) server_negotiation.cc:399] Waiting for connection header
0928 23:50:22.805359 (+   236us) negotiation.cc:327] Negotiation complete: Network error: Server connection negotiation failed: server connection from 127.0.0.1:39934: BlockingRecv error: recv got EOF from 127.0.0.1:39934 (error 108)
Metrics: {"server-negotiator.queue_time_us":105}
[       OK ] Parameters/TestRpc.AcceptorDispatchingTimesMetric/SSL_UnixSocket (21 ms)
[ RUN      ] Parameters/TestRpc.TestRpcCallbackDestroysMessenger/SSL_UnixSocket
[       OK ] Parameters/TestRpc.TestRpcCallbackDestroysMessenger/SSL_UnixSocket (34 ms)
[ RUN      ] Parameters/TestRpc.TestApplicationFeatureFlag/SSL_UnixSocket
I20260928 23:50:22.862015 11131 acceptor_pool.cc:254] collecting diagnostics on the listening RPC socket unix:/tmp/dist-test-taskqZY4Oa/test-tmp/rpc-test-ff86cf2259f0473d99df3da5d443e5a5.sock every 8 connection(s)
I20260928 23:50:22.862748 11132 acceptor_pool.cc:254] collecting diagnostics on the listening RPC socket unix:/tmp/dist-test-taskqZY4Oa/test-tmp/rpc-test-ff86cf2259f0473d99df3da5d443e5a5.sock every 8 connection(s)
W20260928 23:50:22.904735 11128 messenger.cc:357] Unable to handle RPC call: Not implemented: call requires unsupported application feature flags: 99
[       OK ] Parameters/TestRpc.TestApplicationFeatureFlag/SSL_UnixSocket (67 ms)
[ RUN      ] Parameters/TestRpc.TestCancellation/SSL_UnixSocket
I20260928 23:50:22.937664 11156 acceptor_pool.cc:254] collecting diagnostics on the listening RPC socket unix:/tmp/dist-test-taskqZY4Oa/test-tmp/rpc-test-9efea5db774749398c5ee57a6e89b991.sock every 8 connection(s)
I20260928 23:50:22.938351 11157 acceptor_pool.cc:254] collecting diagnostics on the listening RPC socket unix:/tmp/dist-test-taskqZY4Oa/test-tmp/rpc-test-9efea5db774749398c5ee57a6e89b991.sock every 8 connection(s)
I20260928 23:50:22.941314 10732 rpc-test.cc:1648] Connecting to unix:/tmp/dist-test-taskqZY4Oa/test-tmp/rpc-test-9efea5db774749398c5ee57a6e89b991.sock
I20260928 23:50:23.041581 10732 rpc-test-base.h:595] status: Aborted: Sleep RPC to unix:/tmp/dist-test-taskqZY4Oa/test-tmp/rpc-test-9efea5db774749398c5ee57a6e89b991.sock is cancelled in state READY, seconds elapsed: 0.000422073
I20260928 23:50:23.229827 10732 rpc-test-base.h:595] status: Aborted: Sleep RPC to unix:/tmp/dist-test-taskqZY4Oa/test-tmp/rpc-test-9efea5db774749398c5ee57a6e89b991.sock is cancelled in state SENT, seconds elapsed: 0.000988678
I20260928 23:50:23.230060 11159 rpc-test-base.h:222] got call: sleep_micros: 510000
I20260928 23:50:23.397554 10732 rpc-test-base.h:595] status: Aborted: Sleep RPC to unix:/tmp/dist-test-taskqZY4Oa/test-tmp/rpc-test-9efea5db774749398c5ee57a6e89b991.sock is cancelled in state SENT, seconds elapsed: 0.00087608
I20260928 23:50:23.397753 11158 rpc-test-base.h:222] got call: sleep_micros: 510000
I20260928 23:50:23.566725 10732 rpc-test-base.h:595] status: Aborted: Sleep RPC to unix:/tmp/dist-test-taskqZY4Oa/test-tmp/rpc-test-9efea5db774749398c5ee57a6e89b991.sock is cancelled in state SENT, seconds elapsed: 0.000920249
W20260928 23:50:23.577265 11160 rpcz_store.cc:267] Call kudu.rpc.GenericCalculatorService.Sleep from unix:<unnamed> (request call id 11) took 10 ms (client timeout 10 ms). Trace:
W20260928 23:50:23.577644 11160 rpcz_store.cc:269] 0928 23:50:23.566671 (+     0us) service_pool.cc:170] Inserting onto call queue
0928 23:50:23.577016 (+ 10345us) service_pool.cc:214] Skipping call since client already timed out
0928 23:50:23.577101 (+    85us) inbound_call.cc:173] Queueing failure response
Metrics: {}
I20260928 23:50:23.578153 11160 rpc-test-base.h:222] got call: sleep_micros: 1500000
W20260928 23:50:23.740711 11159 rpcz_store.cc:267] Call kudu.rpc.GenericCalculatorService.Sleep from unix:<unnamed> (request call id 3) took 510 ms (client timeout 10 ms). Trace:
W20260928 23:50:23.741009 11159 rpcz_store.cc:269] 0928 23:50:23.229869 (+     0us) service_pool.cc:170] Inserting onto call queue
0928 23:50:23.230002 (+   133us) service_pool.cc:227] Handling call
0928 23:50:23.740656 (+510654us) inbound_call.cc:173] Queueing success response
Metrics: {}
W20260928 23:50:23.908360 11158 rpcz_store.cc:267] Call kudu.rpc.GenericCalculatorService.Sleep from unix:<unnamed> (request call id 7) took 510 ms (client timeout 10 ms). Trace:
W20260928 23:50:23.908664 11158 rpcz_store.cc:269] 0928 23:50:23.397565 (+     0us) service_pool.cc:170] Inserting onto call queue
0928 23:50:23.397695 (+   130us) service_pool.cc:227] Handling call
0928 23:50:23.908304 (+510609us) inbound_call.cc:173] Queueing success response
Metrics: {}
I20260928 23:50:24.569394 10732 rpc-test-base.h:595] status: Timed out: Sleep RPC to unix:/tmp/dist-test-taskqZY4Oa/test-tmp/rpc-test-9efea5db774749398c5ee57a6e89b991.sock timed out after 1.000s (SENT), seconds elapsed: 1.00228
I20260928 23:50:24.571321 11158 rpc-test-base.h:222] got call: sleep_micros: 1500000
W20260928 23:50:25.078740 11160 rpcz_store.cc:267] Call kudu.rpc.GenericCalculatorService.Sleep from unix:<unnamed> (request call id 12) took 1511 ms (client timeout 1000 ms). Trace:
W20260928 23:50:25.079061 11160 rpcz_store.cc:269] 0928 23:50:23.567721 (+     0us) service_pool.cc:170] Inserting onto call queue
0928 23:50:23.578122 (+ 10401us) service_pool.cc:227] Handling call
0928 23:50:25.078609 (+1500487us) inbound_call.cc:173] Queueing success response
Metrics: {}
I20260928 23:50:25.571870 10732 rpc-test-base.h:595] status: Timed out: Sleep RPC to unix:/tmp/dist-test-taskqZY4Oa/test-tmp/rpc-test-9efea5db774749398c5ee57a6e89b991.sock timed out after 1.000s (SENT), seconds elapsed: 1.00195
W20260928 23:50:25.573431 11153 messenger.cc:357] Unable to handle RPC call: Not implemented: call requires unsupported application feature flags: 99, 1
W20260928 23:50:25.574873 11153 messenger.cc:357] Unable to handle RPC call: Not implemented: call requires unsupported application feature flags: 99, 1
W20260928 23:50:25.791541 11153 connection.cc:196] Error closing socket: Network error: TlsSocket::Close: Broken pipe
W20260928 23:50:26.071906 11158 rpcz_store.cc:267] Call kudu.rpc.GenericCalculatorService.Sleep from unix:<unnamed> (request call id 13) took 1501 ms (client timeout 1000 ms). Trace:
W20260928 23:50:26.072224 11158 rpcz_store.cc:269] 0928 23:50:24.571023 (+     0us) service_pool.cc:170] Inserting onto call queue
0928 23:50:24.571208 (+   185us) service_pool.cc:227] Handling call
0928 23:50:26.071853 (+1500645us) inbound_call.cc:173] Queueing success response
Metrics: {}
W20260928 23:50:26.072774 11153 connection.cc:441] server connection from unix:<unnamed> torn down before Call kudu.rpc.GenericCalculatorService.Sleep from unix:<unnamed> (request call id 13) could send its response
[       OK ] Parameters/TestRpc.TestCancellation/SSL_UnixSocket (3167 ms)
[ RUN      ] Parameters/TestRpc.TestCancellationMultiThreads/SSL_UnixSocket
I20260928 23:50:26.117785 11182 acceptor_pool.cc:254] collecting diagnostics on the listening RPC socket unix:/tmp/dist-test-taskqZY4Oa/test-tmp/rpc-test-622736abe8664c09b28d88c5b88dc8ba.sock every 8 connection(s)
I20260928 23:50:26.118609 11183 acceptor_pool.cc:254] collecting diagnostics on the listening RPC socket unix:/tmp/dist-test-taskqZY4Oa/test-tmp/rpc-test-622736abe8664c09b28d88c5b88dc8ba.sock every 8 connection(s)
I20260928 23:50:26.121631 10732 rpc-test.cc:1808] Connecting to unix:/tmp/dist-test-taskqZY4Oa/test-tmp/rpc-test-622736abe8664c09b28d88c5b88dc8ba.sock
I20260928 23:50:26.269788 11196 test_util.cc:268] Using random seed: -1158909450
I20260928 23:50:26.271777 11197 test_util.cc:268] Using random seed: -1158907400
I20260928 23:50:26.273339 11198 test_util.cc:268] Using random seed: -1158905896
I20260928 23:50:26.274986 11199 test_util.cc:268] Using random seed: -1158904209
I20260928 23:50:26.276317 11200 test_util.cc:268] Using random seed: -1158902978
I20260928 23:50:26.277724 11201 test_util.cc:268] Using random seed: -1158901576
I20260928 23:50:26.279934 11202 test_util.cc:268] Using random seed: -1158899380
I20260928 23:50:26.281960 11203 test_util.cc:268] Using random seed: -1158897326
I20260928 23:50:26.283999 11204 test_util.cc:268] Using random seed: -1158895738
I20260928 23:50:26.285178 11205 test_util.cc:268] Using random seed: -1158894108
I20260928 23:50:26.287128 11206 test_util.cc:268] Using random seed: -1158892170
I20260928 23:50:26.289330 11207 test_util.cc:268] Using random seed: -1158889995
I20260928 23:50:26.293241 11208 test_util.cc:268] Using random seed: -1158886091
I20260928 23:50:26.295377 11209 test_util.cc:268] Using random seed: -1158883943
I20260928 23:50:26.297928 11210 test_util.cc:268] Using random seed: -1158881443
I20260928 23:50:26.300071 11211 test_util.cc:268] Using random seed: -1158879684
I20260928 23:50:26.301755 11212 test_util.cc:268] Using random seed: -1158877569
I20260928 23:50:26.303761 11213 test_util.cc:268] Using random seed: -1158875512
I20260928 23:50:26.306041 11214 test_util.cc:268] Using random seed: -1158873329
I20260928 23:50:26.307996 11215 test_util.cc:268] Using random seed: -1158871309
I20260928 23:50:26.309974 11216 test_util.cc:268] Using random seed: -1158869354
I20260928 23:50:26.311810 11217 test_util.cc:268] Using random seed: -1158867452
I20260928 23:50:26.313612 11218 test_util.cc:268] Using random seed: -1158865990
I20260928 23:50:26.316069 11219 test_util.cc:268] Using random seed: -1158863227
I20260928 23:50:26.317603 11220 test_util.cc:268] Using random seed: -1158861733
I20260928 23:50:26.319429 11221 test_util.cc:268] Using random seed: -1158859819
I20260928 23:50:26.321429 11222 test_util.cc:268] Using random seed: -1158857879
I20260928 23:50:26.323659 11223 test_util.cc:268] Using random seed: -1158855635
I20260928 23:50:26.325608 11224 test_util.cc:268] Using random seed: -1158853703
I20260928 23:50:26.327677 11225 test_util.cc:268] Using random seed: -1158852123
W20260928 23:50:46.078260 11179 connection.cc:196] Error closing socket: Network error: TlsSocket::Close: Broken pipe
[       OK ] Parameters/TestRpc.TestCancellationMultiThreads/SSL_UnixSocket (20014 ms)
[ RUN      ] Parameters/TestRpc.TestCallId/SSL_UnixSocket
I20260928 23:50:46.135206 11239 acceptor_pool.cc:254] collecting diagnostics on the listening RPC socket unix:/tmp/dist-test-taskqZY4Oa/test-tmp/rpc-test-fa45cc589c2a44bc8062c6210ba2537d.sock every 8 connection(s)
I20260928 23:50:46.136032 11240 acceptor_pool.cc:254] collecting diagnostics on the listening RPC socket unix:/tmp/dist-test-taskqZY4Oa/test-tmp/rpc-test-fa45cc589c2a44bc8062c6210ba2537d.sock every 8 connection(s)
[       OK ] Parameters/TestRpc.TestCallId/SSL_UnixSocket (90 ms)
[----------] 20 tests from Parameters/TestRpc (38565 ms total)

[----------] Global test environment tear-down
[==========] 21 tests from 2 test suites ran. (41710 ms total)
[  PASSED  ] 20 tests.
[  FAILED  ] 1 test, listed below:
[  FAILED  ] Parameters/TestRpc.TestCallWithChainCertAndRootCA/SSL_UnixSocket, where GetParam() = (true, true)

 1 FAILED TEST
I20260928 23:50:46.202538 10732 logging.cc:424] LogThrottler /data0/somelongdirectorytoavoidrpathissues/src/kudu/src/kudu/rpc/acceptor_pool.cc:285: suppressed but not reported on 3 messages since previous log ~34 seconds ago