Diagnosed failure
Parameters/TestRpc.TestCallWithChainCertAndChainCA/SSL_TCP: /data0/somelongdirectorytoavoidrpathissues/src/kudu/src/kudu/rpc/rpc-test.cc:270: Failure
Failed
Bad status: Runtime error: could not verify certificate chain (error with cert: subject=CN = localhost, ST = sadfjas, C = AS, emailAddress = sdflkdsajf, O = lskdfjlsad, OU = sldfkja, issuer=C = AS, ST = ASDfkjdhf, L = lskdjf, O = saldfja, OU = skdjf, CN = localhost, emailAddress = sadjflkadsj): : certificate has expired
Google Test trace:
/data0/somelongdirectorytoavoidrpathissues/src/kudu/src/kudu/rpc/rpc-test.cc:267: Connecting to 0.0.0.0:45121
I20260924 19:01:12.241200 5647 test_util.cc:175] -----------------------------------------------
I20260924 19:01:12.241312 5647 test_util.cc:176] Had fatal failures, leaving test files at /tmp/dist-test-taskojmVOh/test-tmp/rpc-test.5.Parameters_TestRpc.TestCallWithChainCertAndChainCA_SSL_TCP.1790276472114598-5647-0
Full log
Note: This is test shard 6 of 8.
[==========] Running 21 tests from 2 test suites.
[----------] Global test environment set-up.
[----------] 20 tests from Parameters/TestRpc
[ RUN ] Parameters/TestRpc.TestMessengerCreateDestroy/SSL_TCP
WARNING: Logging before InitGoogleLogging() is written to STDERR
I20260924 19:01:12.172408 5647 rpc-test.cc:169] started messenger TestCreateDestroy
[ OK ] Parameters/TestRpc.TestMessengerCreateDestroy/SSL_TCP (41 ms)
[ RUN ] Parameters/TestRpc.TestNegotiationDeadlock/SSL_TCP
I20260924 19:01:12.184940 5667 acceptor_pool.cc:254] collecting diagnostics on the listening RPC socket 0.0.0.0:44003 every 8 connection(s)
I20260924 19:01:12.185144 5668 acceptor_pool.cc:254] collecting diagnostics on the listening RPC socket 0.0.0.0:44003 every 8 connection(s)
[ OK ] Parameters/TestRpc.TestNegotiationDeadlock/SSL_TCP (28 ms)
[ RUN ] Parameters/TestRpc.TestCallWithChainCertAndChainCA/SSL_TCP
I20260924 19:01:12.229276 5683 acceptor_pool.cc:254] collecting diagnostics on the listening RPC socket 0.0.0.0:45121 every 8 connection(s)
I20260924 19:01:12.229671 5684 acceptor_pool.cc:254] collecting diagnostics on the listening RPC socket 0.0.0.0:45121 every 8 connection(s)
/data0/somelongdirectorytoavoidrpathissues/src/kudu/src/kudu/rpc/rpc-test.cc:270: Failure
Failed
Bad status: Runtime error: could not verify certificate chain (error with cert: subject=CN = localhost, ST = sadfjas, C = AS, emailAddress = sdflkdsajf, O = lskdfjlsad, OU = sldfkja, issuer=C = AS, ST = ASDfkjdhf, L = lskdjf, O = saldfja, OU = skdjf, CN = localhost, emailAddress = sadjflkadsj): : certificate has expired
Google Test trace:
/data0/somelongdirectorytoavoidrpathissues/src/kudu/src/kudu/rpc/rpc-test.cc:267: Connecting to 0.0.0.0:45121
I20260924 19:01:12.241200 5647 test_util.cc:175] -----------------------------------------------
I20260924 19:01:12.241312 5647 test_util.cc:176] Had fatal failures, leaving test files at /tmp/dist-test-taskojmVOh/test-tmp/rpc-test.5.Parameters_TestRpc.TestCallWithChainCertAndChainCA_SSL_TCP.1790276472114598-5647-0
[ FAILED ] Parameters/TestRpc.TestCallWithChainCertAndChainCA/SSL_TCP, where GetParam() = (true, false) (36 ms)
[ RUN ] Parameters/TestRpc.TestCallWithPasswordProtectedKey/SSL_TCP
I20260924 19:01:12.259920 5708 acceptor_pool.cc:254] collecting diagnostics on the listening RPC socket 0.0.0.0:34431 every 8 connection(s)
I20260924 19:01:12.260151 5709 acceptor_pool.cc:254] collecting diagnostics on the listening RPC socket 0.0.0.0:34431 every 8 connection(s)
[ OK ] Parameters/TestRpc.TestCallWithPasswordProtectedKey/SSL_TCP (53 ms)
[ RUN ] Parameters/TestRpc.TestCallToBadServer/SSL_TCP
I20260924 19:01:12.306785 5647 rpc-test.cc:394] Status: Network error: Client connection negotiation failed: client connection to 0.0.0.0:0: connect: Connection refused (error 111)
I20260924 19:01:12.307469 5647 rpc-test.cc:394] Status: Network error: Client connection negotiation failed: client connection to 0.0.0.0:0: connect: Connection refused (error 111)
I20260924 19:01:12.308040 5647 rpc-test.cc:394] Status: Network error: Client connection negotiation failed: client connection to 0.0.0.0:0: connect: Connection refused (error 111)
I20260924 19:01:12.308629 5647 rpc-test.cc:394] Status: Network error: Client connection negotiation failed: client connection to 0.0.0.0:0: connect: Connection refused (error 111)
I20260924 19:01:12.309173 5647 rpc-test.cc:394] Status: Network error: Client connection negotiation failed: client connection to 0.0.0.0:0: connect: Connection refused (error 111)
[ OK ] Parameters/TestRpc.TestCallToBadServer/SSL_TCP (15 ms)
[ RUN ] Parameters/TestRpc.TestWrongService/SSL_TCP
I20260924 19:01:12.333894 5743 acceptor_pool.cc:254] collecting diagnostics on the listening RPC socket 0.0.0.0:34575 every 8 connection(s)
I20260924 19:01:12.334185 5744 acceptor_pool.cc:254] collecting diagnostics on the listening RPC socket 0.0.0.0:34575 every 8 connection(s)
I20260924 19:01:12.356439 5741 messenger.cc:345] service WrongServiceName not registered on TestServer
[ OK ] Parameters/TestRpc.TestWrongService/SSL_TCP (50 ms)
[ RUN ] Parameters/TestRpc.TestConnectionKeepalive/SSL_TCP
I20260924 19:01:12.382184 5766 acceptor_pool.cc:254] collecting diagnostics on the listening RPC socket 0.0.0.0:43183 every 8 connection(s)
I20260924 19:01:12.382472 5767 acceptor_pool.cc:254] collecting diagnostics on the listening RPC socket 0.0.0.0:43183 every 8 connection(s)
I20260924 19:01:12.383481 5647 rpc-test.cc:488] Connecting to 0.0.0.0:43183
[ OK ] Parameters/TestRpc.TestConnectionKeepalive/SSL_TCP (1060 ms)
[ RUN ] Parameters/TestRpc.TestClientConnectionMetrics/SSL_TCP
I20260924 19:01:13.436091 5791 acceptor_pool.cc:254] collecting diagnostics on the listening RPC socket 0.0.0.0:44077 every 8 connection(s)
I20260924 19:01:13.436362 5792 acceptor_pool.cc:254] collecting diagnostics on the listening RPC socket 0.0.0.0:44077 every 8 connection(s)
I20260924 19:01:13.437347 5647 rpc-test.cc:569] Connecting to 0.0.0.0:44077
[ OK ] Parameters/TestRpc.TestClientConnectionMetrics/SSL_TCP (20080 ms)
[ RUN ] Parameters/TestRpc.TestCredentialsPolicy/SSL_TCP
I20260924 19:01:33.524905 5814 acceptor_pool.cc:254] collecting diagnostics on the listening RPC socket 0.0.0.0:39747 every 8 connection(s)
I20260924 19:01:33.525180 5815 acceptor_pool.cc:254] collecting diagnostics on the listening RPC socket 0.0.0.0:39747 every 8 connection(s)
I20260924 19:01:33.526262 5647 rpc-test.cc:700] Connecting to 0.0.0.0:39747
[ OK ] Parameters/TestRpc.TestCredentialsPolicy/SSL_TCP (61 ms)
[ RUN ] Parameters/TestRpc.TestCallLongerThanKeepalive/SSL_TCP
I20260924 19:01:33.580114 5839 acceptor_pool.cc:254] collecting diagnostics on the listening RPC socket 0.0.0.0:39369 every 8 connection(s)
I20260924 19:01:33.580384 5840 acceptor_pool.cc:254] collecting diagnostics on the listening RPC socket 0.0.0.0:39369 every 8 connection(s)
I20260924 19:01:33.615696 5843 rpc-test-base.h:222] got call: sleep_micros: 3000000 deferred: true
I20260924 19:01:36.617792 5843 rpcz_store.cc:275] Call kudu.rpc.GenericCalculatorService.Sleep from 127.0.0.1:35708 (request call id 0) took 3002 ms. Trace:
I20260924 19:01:36.618000 5843 rpcz_store.cc:276] 0924 19:01:33.615541 (+ 0us) service_pool.cc:170] Inserting onto call queue
0924 19:01:33.615647 (+ 106us) service_pool.cc:227] Handling call
0924 19:01:36.617740 (+3002093us) inbound_call.cc:173] Queueing success response
Metrics: {}
[ OK ] Parameters/TestRpc.TestCallLongerThanKeepalive/SSL_TCP (3060 ms)
[ RUN ] Parameters/TestRpc.TestRpcSidecar/SSL_TCP
I20260924 19:01:36.636196 5864 acceptor_pool.cc:254] collecting diagnostics on the listening RPC socket 0.0.0.0:38025 every 8 connection(s)
I20260924 19:01:36.636430 5865 acceptor_pool.cc:254] collecting diagnostics on the listening RPC socket 0.0.0.0:38025 every 8 connection(s)
[ OK ] Parameters/TestRpc.TestRpcSidecar/SSL_TCP (104 ms)
[ RUN ] Parameters/TestRpc.TestRpcSidecarLimits/SSL_TCP
I20260924 19:01:38.862799 5889 acceptor_pool.cc:254] collecting diagnostics on the listening RPC socket 0.0.0.0:37989 every 8 connection(s)
I20260924 19:01:38.863049 5890 acceptor_pool.cc:254] collecting diagnostics on the listening RPC socket 0.0.0.0:37989 every 8 connection(s)
W20260924 19:01:38.880900 5647 serialization.cc:72] Serialized kudu.rpc_test.PushStringsRequestPB (2147483654 bytes) is larger than the maximum configured RPC message size (52428800 bytes). Sending anyway, but peer may reject the data.
W20260924 19:01:38.887684 5887 connection.cc:535] server connection from 127.0.0.1:45204 recv error: Network error: RPC frame had a length of 2147483714, but we only support messages up to 52428800 bytes long.
W20260924 19:01:38.887827 5887 connection.cc:158] shutting down server connection from 127.0.0.1:45204 with pending inbound data: 4/2147483714 bytes received; last active 0 ns ago: status Network error: RPC frame had a length of 2147483714, but we only support messages up to 52428800 bytes long.
W20260924 19:01:38.888339 5902 connection.cc:196] Error closing socket: Network error: TlsSocket::Close: Connection reset by peer
I20260924 19:01:38.910691 5914 acceptor_pool.cc:254] collecting diagnostics on the listening RPC socket 0.0.0.0:38413 every 8 connection(s)
I20260924 19:01:38.910841 5915 acceptor_pool.cc:254] collecting diagnostics on the listening RPC socket 0.0.0.0:38413 every 8 connection(s)
W20260924 19:01:44.287051 5911 connection.cc:577] server connection from 127.0.0.1:60990: received bad data: 'Corruption: Invalid packet: message had a length of 2147483710, but we only support messages up to 2147483647 bytes
'
[ OK ] Parameters/TestRpc.TestRpcSidecarLimits/SSL_TCP (8023 ms)
[ RUN ] Parameters/TestRpc.TestCallTimeoutDoesntAffectNegotiation/SSL_TCP
I20260924 19:01:44.773943 5939 acceptor_pool.cc:254] collecting diagnostics on the listening RPC socket 0.0.0.0:43529 every 8 connection(s)
I20260924 19:01:44.774224 5940 acceptor_pool.cc:254] collecting diagnostics on the listening RPC socket 0.0.0.0:43529 every 8 connection(s)
W20260924 19:01:44.789292 5935 negotiation.cc:266] Injecting 500ms delay in negotiation
I20260924 19:01:44.839831 5647 rpc-test-base.h:595] status: Timed out: connection negotiation to 0.0.0.0:43529 for RPC Sleep timed out after 0.050s (ON_OUTBOUND_QUEUE), seconds elapsed: 0.0511588
[ OK ] Parameters/TestRpc.TestCallTimeoutDoesntAffectNegotiation/SSL_TCP (548 ms)
[ RUN ] Parameters/TestRpc.TestRpcHandlerLatencyMetric/SSL_TCP
I20260924 19:01:45.334100 5964 acceptor_pool.cc:254] collecting diagnostics on the listening RPC socket 0.0.0.0:42831 every 8 connection(s)
I20260924 19:01:45.334326 5965 acceptor_pool.cc:254] collecting diagnostics on the listening RPC socket 0.0.0.0:42831 every 8 connection(s)
I20260924 19:01:45.378460 5647 rpc-test.cc:1236] Sleep() min lat: 20676
I20260924 19:01:45.378551 5647 rpc-test.cc:1237] Sleep() mean lat: 20676
I20260924 19:01:45.378590 5647 rpc-test.cc:1238] Sleep() max lat: 20676
I20260924 19:01:45.378609 5647 rpc-test.cc:1239] Sleep() #calls: 1
[ OK ] Parameters/TestRpc.TestRpcHandlerLatencyMetric/SSL_TCP (83 ms)
[ RUN ] Parameters/TestRpc.TimedOutOnResponseMetricServiceQueue/SSL_TCP
I20260924 19:01:45.395635 5990 acceptor_pool.cc:254] collecting diagnostics on the listening RPC socket 0.0.0.0:43795 every 8 connection(s)
I20260924 19:01:45.395799 5991 acceptor_pool.cc:254] collecting diagnostics on the listening RPC socket 0.0.0.0:43795 every 8 connection(s)
W20260924 19:01:45.458011 5992 rpcz_store.cc:267] Call kudu.rpc_test.CalculatorService.Sleep from 127.0.0.1:52856 (request call id 2) took 20 ms (client timeout 20 ms). Trace:
W20260924 19:01:45.458190 5992 rpcz_store.cc:269] 0924 19:01:45.437333 (+ 0us) service_pool.cc:170] Inserting onto call queue
0924 19:01:45.457904 (+ 20571us) service_pool.cc:214] Skipping call since client already timed out
0924 19:01:45.457986 (+ 82us) inbound_call.cc:173] Queueing failure response
Metrics: {}
[ OK ] Parameters/TestRpc.TimedOutOnResponseMetricServiceQueue/SSL_TCP (78 ms)
[ RUN ] Parameters/TestRpc.RpcPendingConnectionsMetric/SSL_TCP
I20260924 19:01:45.467604 6013 acceptor_pool.cc:254] collecting diagnostics on the listening RPC socket 0.0.0.0:41971 every 8 connection(s)
I20260924 19:01:45.467821 6014 acceptor_pool.cc:254] collecting diagnostics on the listening RPC socket 0.0.0.0:41971 every 8 connection(s)
W20260924 19:01:45.469920 6009 negotiation.cc:337] Failed RPC negotiation. Trace:
0924 19:01:45.469217 (+ 0us) reactor.cc:625] Submitting negotiation task for server connection from 127.0.0.1:32864 (local address 127.0.0.1:41971)
0924 19:01:45.469386 (+ 169us) server_negotiation.cc:206] Beginning negotiation
0924 19:01:45.469390 (+ 4us) server_negotiation.cc:399] Waiting for connection header
0924 19:01:45.469516 (+ 126us) negotiation.cc:327] Negotiation complete: Network error: Server connection negotiation failed: server connection from 127.0.0.1:32864: BlockingRecv error: recv got EOF from 127.0.0.1:32864 (error 108)
Metrics: {"server-negotiator.queue_time_us":54}
[ OK ] Parameters/TestRpc.RpcPendingConnectionsMetric/SSL_TCP (19 ms)
[ RUN ] Parameters/TestRpc.TestRpcContextClientDeadline/SSL_TCP
I20260924 19:01:45.509655 6029 acceptor_pool.cc:254] collecting diagnostics on the listening RPC socket 0.0.0.0:36107 every 8 connection(s)
I20260924 19:01:45.509934 6030 acceptor_pool.cc:254] collecting diagnostics on the listening RPC socket 0.0.0.0:36107 every 8 connection(s)
[ OK ] Parameters/TestRpc.TestRpcContextClientDeadline/SSL_TCP (80 ms)
[ RUN ] Parameters/TestRpc.TestApplicationFeatureFlagUnsupportedServer/SSL_TCP
I20260924 19:01:45.579783 6054 acceptor_pool.cc:254] collecting diagnostics on the listening RPC socket 0.0.0.0:40975 every 8 connection(s)
I20260924 19:01:45.580013 6055 acceptor_pool.cc:254] collecting diagnostics on the listening RPC socket 0.0.0.0:40975 every 8 connection(s)
[ OK ] Parameters/TestRpc.TestApplicationFeatureFlagUnsupportedServer/SSL_TCP (51 ms)
[ RUN ] Parameters/TestRpc.TestCancellationAsync/SSL_TCP
I20260924 19:01:45.629415 6079 acceptor_pool.cc:254] collecting diagnostics on the listening RPC socket 0.0.0.0:37225 every 8 connection(s)
I20260924 19:01:45.629751 6080 acceptor_pool.cc:254] collecting diagnostics on the listening RPC socket 0.0.0.0:37225 every 8 connection(s)
I20260924 19:01:45.630687 5647 rpc-test.cc:1716] Connecting to 0.0.0.0:37225
I20260924 19:01:45.644452 5647 test_util.cc:268] Using random seed: 992685445
I20260924 19:01:45.680899 6083 rpc-test-base.h:240] got call: sleep_micros: 500 pattern: 4294967295 num_repetitions: 2097152 sidecar_idx: 0
I20260924 19:01:45.706809 6082 rpc-test-base.h:240] got call: sleep_micros: 500 pattern: 4294967295 num_repetitions: 2097152 sidecar_idx: 0
I20260924 19:01:45.741259 6081 rpc-test-base.h:240] got call: sleep_micros: 500 pattern: 4294967295 num_repetitions: 2097152 sidecar_idx: 0
I20260924 19:01:45.767307 6082 rpc-test-base.h:240] got call: sleep_micros: 500 pattern: 4294967295 num_repetitions: 2097152 sidecar_idx: 0
I20260924 19:01:45.792940 6083 rpc-test-base.h:240] got call: sleep_micros: 500 pattern: 4294967295 num_repetitions: 2097152 sidecar_idx: 0
I20260924 19:01:45.822549 6082 rpc-test-base.h:240] got call: sleep_micros: 500 pattern: 4294967295 num_repetitions: 2097152 sidecar_idx: 0
W20260924 19:01:45.849304 6076 connection.cc:698] server connection from 127.0.0.1:49526 send error: Network error: failed to write to TLS socket: Broken pipe
W20260924 19:01:45.849460 6076 connection.cc:441] server connection from 127.0.0.1:49526 torn down before Call kudu.rpc.GenericCalculatorService.SleepWithSidecar from 127.0.0.1:49526 (request call id 9) could send its response
W20260924 19:01:45.849817 6076 connection.cc:196] Error closing socket: Network error: TlsSocket::Close: Success
W20260924 19:01:45.859205 6076 connection.cc:441] server connection from 127.0.0.1:49526 torn down before Call kudu.rpc.GenericCalculatorService.SleepWithSidecar from 127.0.0.1:49526 (request call id 8) could send its response
[ OK ] Parameters/TestRpc.TestCancellationAsync/SSL_TCP (247 ms)
[ RUN ] Parameters/TestRpc.TestPerformanceBySocketType/SSL_TCP
I20260924 19:01:45.891803 6104 acceptor_pool.cc:254] collecting diagnostics on the listening RPC socket 0.0.0.0:40429 every 8 connection(s)
I20260924 19:01:45.892027 6105 acceptor_pool.cc:254] collecting diagnostics on the listening RPC socket 0.0.0.0:40429 every 8 connection(s)
I20260924 19:01:45.892988 5647 rpc-test.cc:1846] Connecting to 0.0.0.0:40429
I20260924 19:01:48.906829 5647 rpc-test.cc:1859] Sending 1024MB via ssl-enabled tcp socket: real 2.986s user 2.822s sys 2.176s
I20260924 19:01:51.915057 5647 rpc-test.cc:1859] Sending 1024MB via ssl-enabled tcp socket: real 3.008s user 2.855s sys 2.136s
I20260924 19:01:54.971292 5647 rpc-test.cc:1859] Sending 1024MB via ssl-enabled tcp socket: real 3.056s user 2.984s sys 2.113s
I20260924 19:01:58.047639 5647 rpc-test.cc:1859] Sending 1024MB via ssl-enabled tcp socket: real 3.076s user 2.791s sys 2.269s
I20260924 19:02:01.163959 5647 rpc-test.cc:1859] Sending 1024MB via ssl-enabled tcp socket: real 3.116s user 2.864s sys 2.267s
[ OK ] Parameters/TestRpc.TestPerformanceBySocketType/SSL_TCP (15310 ms)
[----------] 20 tests from Parameters/TestRpc (49039 ms total)
[----------] 1 test from Parameters/TestRpcSocketTxRxQueue
[ RUN ] Parameters/TestRpcSocketTxRxQueue.OverCapacity/0
W20260924 19:02:01.475639 6139 negotiation.cc:337] Failed RPC negotiation. Trace:
0924 19:02:01.187155 (+ 0us) reactor.cc:625] Submitting negotiation task for client connection to 0.0.0.0:45095 (local address 127.0.0.1:33192)
0924 19:02:01.187317 (+ 162us) negotiation.cc:107] Waiting for socket to connect
0924 19:02:01.187341 (+ 24us) client_negotiation.cc:174] Beginning negotiation
0924 19:02:01.187430 (+ 89us) client_negotiation.cc:252] Sending NEGOTIATE NegotiatePB request
0924 19:02:01.474622 (+287192us) negotiation.cc:327] Negotiation complete: Network error: Client connection negotiation failed: client connection to 0.0.0.0:45095: BlockingRecv error: recv error from unknown peer: Transport endpoint is not connected (error 107)
Metrics: {"client-negotiator.queue_time_us":53}
W20260924 19:02:01.476328 6157 negotiation.cc:337] Failed RPC negotiation. Trace:
0924 19:02:01.192493 (+ 0us) reactor.cc:625] Submitting negotiation task for client connection to 0.0.0.0:45095 (local address 127.0.0.1:33218)
0924 19:02:01.192653 (+ 160us) negotiation.cc:107] Waiting for socket to connect
0924 19:02:01.192670 (+ 17us) client_negotiation.cc:174] Beginning negotiation
0924 19:02:01.192765 (+ 95us) client_negotiation.cc:252] Sending NEGOTIATE NegotiatePB request
0924 19:02:01.474569 (+281804us) negotiation.cc:327] Negotiation complete: Network error: Client connection negotiation failed: client connection to 0.0.0.0:45095: BlockingRecv error: recv error from unknown peer: Transport endpoint is not connected (error 107)
Metrics: {"client-negotiator.queue_time_us":55}
W20260924 19:02:01.476349 6130 negotiation.cc:337] Failed RPC negotiation. Trace:
0924 19:02:01.184593 (+ 0us) reactor.cc:625] Submitting negotiation task for client connection to 0.0.0.0:45095 (local address 127.0.0.1:33190)
0924 19:02:01.184756 (+ 163us) negotiation.cc:107] Waiting for socket to connect
0924 19:02:01.184782 (+ 26us) client_negotiation.cc:174] Beginning negotiation
0924 19:02:01.184891 (+ 109us) client_negotiation.cc:252] Sending NEGOTIATE NegotiatePB request
0924 19:02:01.474666 (+289775us) negotiation.cc:327] Negotiation complete: Network error: Client connection negotiation failed: client connection to 0.0.0.0:45095: BlockingRecv error: recv error from unknown peer: Transport endpoint is not connected (error 107)
Metrics: {"client-negotiator.queue_time_us":52}
W20260924 19:02:01.476939 6148 negotiation.cc:337] Failed RPC negotiation. Trace:
0924 19:02:01.189907 (+ 0us) reactor.cc:625] Submitting negotiation task for client connection to 0.0.0.0:45095 (local address 127.0.0.1:33204)
0924 19:02:01.190087 (+ 180us) negotiation.cc:107] Waiting for socket to connect
0924 19:02:01.190105 (+ 18us) client_negotiation.cc:174] Beginning negotiation
0924 19:02:01.190196 (+ 91us) client_negotiation.cc:252] Sending NEGOTIATE NegotiatePB request
0924 19:02:01.475216 (+285020us) negotiation.cc:327] Negotiation complete: Network error: Client connection negotiation failed: client connection to 0.0.0.0:45095: BlockingRecv error: recv error from unknown peer: Transport endpoint is not connected (error 107)
Metrics: {"client-negotiator.queue_time_us":54}
W20260924 19:02:01.477082 6166 negotiation.cc:337] Failed RPC negotiation. Trace:
0924 19:02:01.195473 (+ 0us) reactor.cc:625] Submitting negotiation task for client connection to 0.0.0.0:45095 (local address 127.0.0.1:33228)
0924 19:02:01.195649 (+ 176us) negotiation.cc:107] Waiting for socket to connect
0924 19:02:01.195670 (+ 21us) client_negotiation.cc:174] Beginning negotiation
0924 19:02:01.195764 (+ 94us) client_negotiation.cc:252] Sending NEGOTIATE NegotiatePB request
0924 19:02:01.476120 (+280356us) negotiation.cc:327] Negotiation complete: Network error: Client connection negotiation failed: client connection to 0.0.0.0:45095: BlockingRecv error: recv error from unknown peer: Transport endpoint is not connected (error 107)
Metrics: {"client-negotiator.queue_time_us":56}
W20260924 19:02:01.477073 6121 negotiation.cc:337] Failed RPC negotiation. Trace:
0924 19:02:01.181386 (+ 0us) reactor.cc:625] Submitting negotiation task for client connection to 0.0.0.0:45095 (local address 127.0.0.1:33174)
0924 19:02:01.181648 (+ 262us) negotiation.cc:107] Waiting for socket to connect
0924 19:02:01.181675 (+ 27us) client_negotiation.cc:174] Beginning negotiation
0924 19:02:01.181814 (+ 139us) client_negotiation.cc:252] Sending NEGOTIATE NegotiatePB request
0924 19:02:01.474569 (+292755us) negotiation.cc:327] Negotiation complete: Network error: Client connection negotiation failed: client connection to 0.0.0.0:45095: BlockingRecv error: recv error from unknown peer: Transport endpoint is not connected (error 107)
Metrics: {"client-negotiator.queue_time_us":61}
[ OK ] Parameters/TestRpcSocketTxRxQueue.OverCapacity/0 (1082 ms)
[----------] 1 test from Parameters/TestRpcSocketTxRxQueue (1082 ms total)
[----------] Global test environment tear-down
[==========] 21 tests from 2 test suites ran. (50122 ms total)
[ PASSED ] 20 tests.
[ FAILED ] 1 test, listed below:
[ FAILED ] Parameters/TestRpc.TestCallWithChainCertAndChainCA/SSL_TCP, where GetParam() = (true, false)
1 FAILED TEST