Diagnosed failure

Parameters/TestRpc.TestCallWithChainCertAndChainCA/SSL_TCP: /data0/somelongdirectorytoavoidrpathissues/src/kudu/src/kudu/rpc/rpc-test.cc:270: Failure
Failed
Bad status: Runtime error: could not verify certificate chain (error with cert: subject=CN = localhost, ST = sadfjas, C = AS, emailAddress = sdflkdsajf, O = lskdfjlsad, OU = sldfkja, issuer=C = AS, ST = ASDfkjdhf, L = lskdjf, O = saldfja, OU = skdjf, CN = localhost, emailAddress = sadjflkadsj): : certificate has expired
Google Test trace:
/data0/somelongdirectorytoavoidrpathissues/src/kudu/src/kudu/rpc/rpc-test.cc:267: Connecting to 0.0.0.0:36383
I20260926 22:41:03.043282 10088 test_util.cc:175] -----------------------------------------------
I20260926 22:41:03.043339 10088 test_util.cc:176] Had fatal failures, leaving test files at /tmp/dist-test-tasky3cLOb/test-tmp/rpc-test.5.Parameters_TestRpc.TestCallWithChainCertAndChainCA_SSL_TCP.1790462462966824-10088-0

Full log

Note: This is test shard 6 of 8.
[==========] Running 21 tests from 2 test suites.
[----------] Global test environment set-up.
[----------] 20 tests from Parameters/TestRpc
[ RUN      ] Parameters/TestRpc.TestMessengerCreateDestroy/SSL_TCP
WARNING: Logging before InitGoogleLogging() is written to STDERR
I20260926 22:41:02.988552 10088 rpc-test.cc:169] started messenger TestCreateDestroy
[       OK ] Parameters/TestRpc.TestMessengerCreateDestroy/SSL_TCP (20 ms)
[ RUN      ] Parameters/TestRpc.TestNegotiationDeadlock/SSL_TCP
I20260926 22:41:03.013327 10108 acceptor_pool.cc:254] collecting diagnostics on the listening RPC socket 0.0.0.0:34985 every 8 connection(s)
I20260926 22:41:03.013345 10109 acceptor_pool.cc:254] collecting diagnostics on the listening RPC socket 0.0.0.0:34985 every 8 connection(s)
[       OK ] Parameters/TestRpc.TestNegotiationDeadlock/SSL_TCP (31 ms)
[ RUN      ] Parameters/TestRpc.TestCallWithChainCertAndChainCA/SSL_TCP
I20260926 22:41:03.038697 10125 acceptor_pool.cc:254] collecting diagnostics on the listening RPC socket 0.0.0.0:36383 every 8 connection(s)
I20260926 22:41:03.038667 10124 acceptor_pool.cc:254] collecting diagnostics on the listening RPC socket 0.0.0.0:36383 every 8 connection(s)
/data0/somelongdirectorytoavoidrpathissues/src/kudu/src/kudu/rpc/rpc-test.cc:270: Failure
Failed
Bad status: Runtime error: could not verify certificate chain (error with cert: subject=CN = localhost, ST = sadfjas, C = AS, emailAddress = sdflkdsajf, O = lskdfjlsad, OU = sldfkja, issuer=C = AS, ST = ASDfkjdhf, L = lskdjf, O = saldfja, OU = skdjf, CN = localhost, emailAddress = sadjflkadsj): : certificate has expired
Google Test trace:
/data0/somelongdirectorytoavoidrpathissues/src/kudu/src/kudu/rpc/rpc-test.cc:267: Connecting to 0.0.0.0:36383
I20260926 22:41:03.043282 10088 test_util.cc:175] -----------------------------------------------
I20260926 22:41:03.043339 10088 test_util.cc:176] Had fatal failures, leaving test files at /tmp/dist-test-tasky3cLOb/test-tmp/rpc-test.5.Parameters_TestRpc.TestCallWithChainCertAndChainCA_SSL_TCP.1790462462966824-10088-0
[  FAILED  ] Parameters/TestRpc.TestCallWithChainCertAndChainCA/SSL_TCP, where GetParam() = (true, false) (22 ms)
[ RUN      ] Parameters/TestRpc.TestCallWithPasswordProtectedKey/SSL_TCP
I20260926 22:41:03.056397 10150 acceptor_pool.cc:254] collecting diagnostics on the listening RPC socket 0.0.0.0:38957 every 8 connection(s)
I20260926 22:41:03.056370 10149 acceptor_pool.cc:254] collecting diagnostics on the listening RPC socket 0.0.0.0:38957 every 8 connection(s)
[       OK ] Parameters/TestRpc.TestCallWithPasswordProtectedKey/SSL_TCP (26 ms)
[ RUN      ] Parameters/TestRpc.TestCallToBadServer/SSL_TCP
I20260926 22:41:03.080241 10088 rpc-test.cc:394] Status: Network error: Client connection negotiation failed: client connection to 0.0.0.0:0: connect: Connection refused (error 111)
I20260926 22:41:03.080526 10088 rpc-test.cc:394] Status: Network error: Client connection negotiation failed: client connection to 0.0.0.0:0: connect: Connection refused (error 111)
I20260926 22:41:03.080731 10088 rpc-test.cc:394] Status: Network error: Client connection negotiation failed: client connection to 0.0.0.0:0: connect: Connection refused (error 111)
I20260926 22:41:03.080950 10088 rpc-test.cc:394] Status: Network error: Client connection negotiation failed: client connection to 0.0.0.0:0: connect: Connection refused (error 111)
I20260926 22:41:03.081141 10088 rpc-test.cc:394] Status: Network error: Client connection negotiation failed: client connection to 0.0.0.0:0: connect: Connection refused (error 111)
[       OK ] Parameters/TestRpc.TestCallToBadServer/SSL_TCP (11 ms)
[ RUN      ] Parameters/TestRpc.TestWrongService/SSL_TCP
I20260926 22:41:03.096546 10184 acceptor_pool.cc:254] collecting diagnostics on the listening RPC socket 0.0.0.0:46637 every 8 connection(s)
I20260926 22:41:03.096575 10185 acceptor_pool.cc:254] collecting diagnostics on the listening RPC socket 0.0.0.0:46637 every 8 connection(s)
I20260926 22:41:03.109632 10182 messenger.cc:345] service WrongServiceName not registered on TestServer
[       OK ] Parameters/TestRpc.TestWrongService/SSL_TCP (29 ms)
[ RUN      ] Parameters/TestRpc.TestConnectionKeepalive/SSL_TCP
I20260926 22:41:03.118291 10207 acceptor_pool.cc:254] collecting diagnostics on the listening RPC socket 0.0.0.0:44741 every 8 connection(s)
I20260926 22:41:03.118326 10208 acceptor_pool.cc:254] collecting diagnostics on the listening RPC socket 0.0.0.0:44741 every 8 connection(s)
I20260926 22:41:03.118517 10088 rpc-test.cc:488] Connecting to 0.0.0.0:44741
[       OK ] Parameters/TestRpc.TestConnectionKeepalive/SSL_TCP (1041 ms)
[ RUN      ] Parameters/TestRpc.TestClientConnectionMetrics/SSL_TCP
I20260926 22:41:04.171679 10232 acceptor_pool.cc:254] collecting diagnostics on the listening RPC socket 0.0.0.0:37349 every 8 connection(s)
I20260926 22:41:04.171888 10233 acceptor_pool.cc:254] collecting diagnostics on the listening RPC socket 0.0.0.0:37349 every 8 connection(s)
I20260926 22:41:04.172043 10088 rpc-test.cc:569] Connecting to 0.0.0.0:37349
[       OK ] Parameters/TestRpc.TestClientConnectionMetrics/SSL_TCP (9845 ms)
[ RUN      ] Parameters/TestRpc.TestCredentialsPolicy/SSL_TCP
I20260926 22:41:14.009913 10255 acceptor_pool.cc:254] collecting diagnostics on the listening RPC socket 0.0.0.0:41169 every 8 connection(s)
I20260926 22:41:14.009961 10256 acceptor_pool.cc:254] collecting diagnostics on the listening RPC socket 0.0.0.0:41169 every 8 connection(s)
I20260926 22:41:14.010124 10088 rpc-test.cc:700] Connecting to 0.0.0.0:41169
[       OK ] Parameters/TestRpc.TestCredentialsPolicy/SSL_TCP (68 ms)
[ RUN      ] Parameters/TestRpc.TestCallLongerThanKeepalive/SSL_TCP
I20260926 22:41:14.076802 10280 acceptor_pool.cc:254] collecting diagnostics on the listening RPC socket 0.0.0.0:42971 every 8 connection(s)
I20260926 22:41:14.076848 10281 acceptor_pool.cc:254] collecting diagnostics on the listening RPC socket 0.0.0.0:42971 every 8 connection(s)
I20260926 22:41:14.097352 10284 rpc-test-base.h:222] got call: sleep_micros: 3000000 deferred: true
I20260926 22:41:17.098189 10284 rpcz_store.cc:275] Call kudu.rpc.GenericCalculatorService.Sleep from 127.0.0.1:52984 (request call id 0) took 3000 ms. Trace:
I20260926 22:41:17.098357 10284 rpcz_store.cc:276] 0926 22:41:14.097285 (+     0us) service_pool.cc:170] Inserting onto call queue
0926 22:41:14.097332 (+    47us) service_pool.cc:227] Handling call
0926 22:41:17.098172 (+3000840us) inbound_call.cc:173] Queueing success response
Metrics: {}
[       OK ] Parameters/TestRpc.TestCallLongerThanKeepalive/SSL_TCP (3032 ms)
[ RUN      ] Parameters/TestRpc.TestRpcSidecar/SSL_TCP
I20260926 22:41:17.114022 10305 acceptor_pool.cc:254] collecting diagnostics on the listening RPC socket 0.0.0.0:45039 every 8 connection(s)
I20260926 22:41:17.114065 10306 acceptor_pool.cc:254] collecting diagnostics on the listening RPC socket 0.0.0.0:45039 every 8 connection(s)
[       OK ] Parameters/TestRpc.TestRpcSidecar/SSL_TCP (57 ms)
[ RUN      ] Parameters/TestRpc.TestRpcSidecarLimits/SSL_TCP
I20260926 22:41:18.844365 10330 acceptor_pool.cc:254] collecting diagnostics on the listening RPC socket 0.0.0.0:46817 every 8 connection(s)
I20260926 22:41:18.844422 10331 acceptor_pool.cc:254] collecting diagnostics on the listening RPC socket 0.0.0.0:46817 every 8 connection(s)
W20260926 22:41:18.862265 10088 serialization.cc:72] Serialized kudu.rpc_test.PushStringsRequestPB (2147483654 bytes) is larger than the maximum configured RPC message size (52428800 bytes). Sending anyway, but peer may reject the data.
W20260926 22:41:18.865607 10329 connection.cc:535] server connection from 127.0.0.1:57398 recv error: Network error: RPC frame had a length of 2147483714, but we only support messages up to 52428800 bytes long.
W20260926 22:41:18.865653 10329 connection.cc:158] shutting down server connection from 127.0.0.1:57398 with pending inbound data: 4/2147483714 bytes received; last active 0 ns ago: status Network error: RPC frame had a length of 2147483714, but we only support messages up to 52428800 bytes long.
W20260926 22:41:18.866045 10343 connection.cc:196] Error closing socket: Network error: TlsSocket::Close: Connection reset by peer
I20260926 22:41:18.877233 10355 acceptor_pool.cc:254] collecting diagnostics on the listening RPC socket 0.0.0.0:42747 every 8 connection(s)
I20260926 22:41:18.877290 10356 acceptor_pool.cc:254] collecting diagnostics on the listening RPC socket 0.0.0.0:42747 every 8 connection(s)
W20260926 22:41:23.035784 10354 connection.cc:577] server connection from 127.0.0.1:43488: received bad data: 'Corruption: Invalid packet: message had a length of 2147483710, but we only support messages up to 2147483647 bytes
'
[       OK ] Parameters/TestRpc.TestRpcSidecarLimits/SSL_TCP (5880 ms)
[ RUN      ] Parameters/TestRpc.TestCallTimeoutDoesntAffectNegotiation/SSL_TCP
I20260926 22:41:23.054755 10380 acceptor_pool.cc:254] collecting diagnostics on the listening RPC socket 0.0.0.0:44919 every 8 connection(s)
I20260926 22:41:23.054800 10381 acceptor_pool.cc:254] collecting diagnostics on the listening RPC socket 0.0.0.0:44919 every 8 connection(s)
W20260926 22:41:23.074770 10376 negotiation.cc:266] Injecting 500ms delay in negotiation
I20260926 22:41:23.125029 10088 rpc-test-base.h:595] status: Timed out: connection negotiation to 0.0.0.0:44919 for RPC Sleep timed out after 0.050s (ON_OUTBOUND_QUEUE), seconds elapsed: 0.0506133
[       OK ] Parameters/TestRpc.TestCallTimeoutDoesntAffectNegotiation/SSL_TCP (541 ms)
[ RUN      ] Parameters/TestRpc.TestRpcHandlerLatencyMetric/SSL_TCP
I20260926 22:41:23.589162 10405 acceptor_pool.cc:254] collecting diagnostics on the listening RPC socket 0.0.0.0:37093 every 8 connection(s)
I20260926 22:41:23.589226 10406 acceptor_pool.cc:254] collecting diagnostics on the listening RPC socket 0.0.0.0:37093 every 8 connection(s)
I20260926 22:41:23.619107 10088 rpc-test.cc:1236] Sleep() min lat: 20233
I20260926 22:41:23.619179 10088 rpc-test.cc:1237] Sleep() mean lat: 20233
I20260926 22:41:23.619205 10088 rpc-test.cc:1238] Sleep() max lat: 20233
I20260926 22:41:23.619220 10088 rpc-test.cc:1239] Sleep() #calls: 1
[       OK ] Parameters/TestRpc.TestRpcHandlerLatencyMetric/SSL_TCP (41 ms)
[ RUN      ] Parameters/TestRpc.TimedOutOnResponseMetricServiceQueue/SSL_TCP
I20260926 22:41:23.633996 10431 acceptor_pool.cc:254] collecting diagnostics on the listening RPC socket 0.0.0.0:35109 every 8 connection(s)
I20260926 22:41:23.634038 10432 acceptor_pool.cc:254] collecting diagnostics on the listening RPC socket 0.0.0.0:35109 every 8 connection(s)
W20260926 22:41:23.693717 10433 rpcz_store.cc:267] Call kudu.rpc_test.CalculatorService.Sleep from 127.0.0.1:52368 (request call id 2) took 20 ms (client timeout 20 ms). Trace:
W20260926 22:41:23.693841 10433 rpcz_store.cc:269] 0926 22:41:23.673470 (+     0us) service_pool.cc:170] Inserting onto call queue
0926 22:41:23.693689 (+ 20219us) service_pool.cc:214] Skipping call since client already timed out
0926 22:41:23.693699 (+    10us) inbound_call.cc:173] Queueing failure response
Metrics: {}
[       OK ] Parameters/TestRpc.TimedOutOnResponseMetricServiceQueue/SSL_TCP (74 ms)
[ RUN      ] Parameters/TestRpc.RpcPendingConnectionsMetric/SSL_TCP
I20260926 22:41:23.697075 10454 acceptor_pool.cc:254] collecting diagnostics on the listening RPC socket 0.0.0.0:40959 every 8 connection(s)
I20260926 22:41:23.697295 10455 acceptor_pool.cc:254] collecting diagnostics on the listening RPC socket 0.0.0.0:40959 every 8 connection(s)
W20260926 22:41:23.697722 10450 negotiation.cc:337] Failed RPC negotiation. Trace:
0926 22:41:23.697584 (+     0us) reactor.cc:625] Submitting negotiation task for server connection from 127.0.0.1:39724 (local address 127.0.0.1:40959)
0926 22:41:23.697632 (+    48us) server_negotiation.cc:206] Beginning negotiation
0926 22:41:23.697634 (+     2us) server_negotiation.cc:399] Waiting for connection header
0926 22:41:23.697681 (+    47us) negotiation.cc:327] Negotiation complete: Network error: Server connection negotiation failed: server connection from 127.0.0.1:39724: BlockingRecv error: recv got EOF from 127.0.0.1:39724 (error 108)
Metrics: {"server-negotiator.queue_time_us":17}
[       OK ] Parameters/TestRpc.RpcPendingConnectionsMetric/SSL_TCP (13 ms)
[ RUN      ] Parameters/TestRpc.TestRpcContextClientDeadline/SSL_TCP
I20260926 22:41:23.717145 10470 acceptor_pool.cc:254] collecting diagnostics on the listening RPC socket 0.0.0.0:41623 every 8 connection(s)
I20260926 22:41:23.717196 10471 acceptor_pool.cc:254] collecting diagnostics on the listening RPC socket 0.0.0.0:41623 every 8 connection(s)
[       OK ] Parameters/TestRpc.TestRpcContextClientDeadline/SSL_TCP (47 ms)
[ RUN      ] Parameters/TestRpc.TestApplicationFeatureFlagUnsupportedServer/SSL_TCP
I20260926 22:41:23.778053 10495 acceptor_pool.cc:254] collecting diagnostics on the listening RPC socket 0.0.0.0:39325 every 8 connection(s)
I20260926 22:41:23.778087 10496 acceptor_pool.cc:254] collecting diagnostics on the listening RPC socket 0.0.0.0:39325 every 8 connection(s)
[       OK ] Parameters/TestRpc.TestApplicationFeatureFlagUnsupportedServer/SSL_TCP (40 ms)
[ RUN      ] Parameters/TestRpc.TestCancellationAsync/SSL_TCP
I20260926 22:41:23.803409 10520 acceptor_pool.cc:254] collecting diagnostics on the listening RPC socket 0.0.0.0:42267 every 8 connection(s)
I20260926 22:41:23.803462 10521 acceptor_pool.cc:254] collecting diagnostics on the listening RPC socket 0.0.0.0:42267 every 8 connection(s)
I20260926 22:41:23.803620 10088 rpc-test.cc:1716] Connecting to 0.0.0.0:42267
I20260926 22:41:23.816833 10088 test_util.cc:268] Using random seed: -2007703172
I20260926 22:41:23.836422 10524 rpc-test-base.h:240] got call: sleep_micros: 500 pattern: 4294967295 num_repetitions: 2097152 sidecar_idx: 0
I20260926 22:41:23.853446 10524 rpc-test-base.h:240] got call: sleep_micros: 500 pattern: 4294967295 num_repetitions: 2097152 sidecar_idx: 0
I20260926 22:41:23.867924 10524 rpc-test-base.h:240] got call: sleep_micros: 500 pattern: 4294967295 num_repetitions: 2097152 sidecar_idx: 0
I20260926 22:41:23.881246 10524 rpc-test-base.h:240] got call: sleep_micros: 500 pattern: 4294967295 num_repetitions: 2097152 sidecar_idx: 0
I20260926 22:41:23.894399 10524 rpc-test-base.h:240] got call: sleep_micros: 500 pattern: 4294967295 num_repetitions: 2097152 sidecar_idx: 0
I20260926 22:41:23.907620 10524 rpc-test-base.h:240] got call: sleep_micros: 500 pattern: 4294967295 num_repetitions: 2097152 sidecar_idx: 0
I20260926 22:41:23.921061 10524 rpc-test-base.h:240] got call: sleep_micros: 500 pattern: 4294967295 num_repetitions: 2097152 sidecar_idx: 0
I20260926 22:41:23.934098 10524 rpc-test-base.h:240] got call: sleep_micros: 500 pattern: 4294967295 num_repetitions: 2097152 sidecar_idx: 0
W20260926 22:41:23.937211 10519 connection.cc:441] server connection from 127.0.0.1:46126 torn down before Call kudu.rpc.GenericCalculatorService.SleepWithSidecar from 127.0.0.1:46126 (request call id 9) could send its response
[       OK ] Parameters/TestRpc.TestCancellationAsync/SSL_TCP (141 ms)
[ RUN      ] Parameters/TestRpc.TestPerformanceBySocketType/SSL_TCP
I20260926 22:41:23.947525 10545 acceptor_pool.cc:254] collecting diagnostics on the listening RPC socket 0.0.0.0:37341 every 8 connection(s)
I20260926 22:41:23.947605 10546 acceptor_pool.cc:254] collecting diagnostics on the listening RPC socket 0.0.0.0:37341 every 8 connection(s)
I20260926 22:41:23.947779 10088 rpc-test.cc:1846] Connecting to 0.0.0.0:37341
I20260926 22:41:25.666523 10088 rpc-test.cc:1859] Sending 1024MB via ssl-enabled tcp socket: real 1.695s	user 1.575s	sys 1.434s
I20260926 22:41:27.360728 10088 rpc-test.cc:1859] Sending 1024MB via ssl-enabled tcp socket: real 1.694s	user 1.392s	sys 1.608s
I20260926 22:41:28.931838 10088 rpc-test.cc:1859] Sending 1024MB via ssl-enabled tcp socket: real 1.571s	user 1.421s	sys 1.395s
I20260926 22:41:30.563843 10088 rpc-test.cc:1859] Sending 1024MB via ssl-enabled tcp socket: real 1.632s	user 1.442s	sys 1.472s
I20260926 22:41:32.253417 10088 rpc-test.cc:1859] Sending 1024MB via ssl-enabled tcp socket: real 1.689s	user 1.494s	sys 1.540s
[       OK ] Parameters/TestRpc.TestPerformanceBySocketType/SSL_TCP (8316 ms)
[----------] 20 tests from Parameters/TestRpc (29285 ms total)

[----------] 1 test from Parameters/TestRpcSocketTxRxQueue
[ RUN      ] Parameters/TestRpcSocketTxRxQueue.OverCapacity/0
W20260926 22:41:32.519951 10580 negotiation.cc:337] Failed RPC negotiation. Trace:
0926 22:41:32.258806 (+     0us) reactor.cc:625] Submitting negotiation task for client connection to 0.0.0.0:43013 (local address 127.0.0.1:54544)
0926 22:41:32.258842 (+    36us) negotiation.cc:107] Waiting for socket to connect
0926 22:41:32.258851 (+     9us) client_negotiation.cc:174] Beginning negotiation
0926 22:41:32.258892 (+    41us) client_negotiation.cc:252] Sending NEGOTIATE NegotiatePB request
0926 22:41:32.519854 (+260962us) negotiation.cc:327] Negotiation complete: Network error: Client connection negotiation failed: client connection to 0.0.0.0:43013: BlockingRecv error: recv error from unknown peer: Transport endpoint is not connected (error 107)
Metrics: {"client-negotiator.queue_time_us":17}
W20260926 22:41:32.520023 10589 negotiation.cc:337] Failed RPC negotiation. Trace:
0926 22:41:32.259623 (+     0us) reactor.cc:625] Submitting negotiation task for client connection to 0.0.0.0:43013 (local address 127.0.0.1:54550)
0926 22:41:32.259661 (+    38us) negotiation.cc:107] Waiting for socket to connect
0926 22:41:32.259669 (+     8us) client_negotiation.cc:174] Beginning negotiation
0926 22:41:32.259702 (+    33us) client_negotiation.cc:252] Sending NEGOTIATE NegotiatePB request
0926 22:41:32.519849 (+260147us) negotiation.cc:327] Negotiation complete: Network error: Client connection negotiation failed: client connection to 0.0.0.0:43013: BlockingRecv error: recv error from unknown peer: Transport endpoint is not connected (error 107)
Metrics: {"client-negotiator.queue_time_us":17}
W20260926 22:41:32.519966 10562 negotiation.cc:337] Failed RPC negotiation. Trace:
0926 22:41:32.256764 (+     0us) reactor.cc:625] Submitting negotiation task for client connection to 0.0.0.0:43013 (local address 127.0.0.1:54518)
0926 22:41:32.256829 (+    65us) negotiation.cc:107] Waiting for socket to connect
0926 22:41:32.256839 (+    10us) client_negotiation.cc:174] Beginning negotiation
0926 22:41:32.256939 (+   100us) client_negotiation.cc:252] Sending NEGOTIATE NegotiatePB request
0926 22:41:32.519872 (+262933us) negotiation.cc:327] Negotiation complete: Network error: Client connection negotiation failed: client connection to 0.0.0.0:43013: BlockingRecv error: recv error from unknown peer: Transport endpoint is not connected (error 107)
Metrics: {"client-negotiator.queue_time_us":37}
W20260926 22:41:32.520043 10571 negotiation.cc:337] Failed RPC negotiation. Trace:
0926 22:41:32.257816 (+     0us) reactor.cc:625] Submitting negotiation task for client connection to 0.0.0.0:43013 (local address 127.0.0.1:54534)
0926 22:41:32.257883 (+    67us) negotiation.cc:107] Waiting for socket to connect
0926 22:41:32.257894 (+    11us) client_negotiation.cc:174] Beginning negotiation
0926 22:41:32.257945 (+    51us) client_negotiation.cc:252] Sending NEGOTIATE NegotiatePB request
0926 22:41:32.519806 (+261861us) negotiation.cc:327] Negotiation complete: Network error: Client connection negotiation failed: client connection to 0.0.0.0:43013: BlockingRecv error: recv error from unknown peer: Transport endpoint is not connected (error 107)
Metrics: {"client-negotiator.queue_time_us":38}
W20260926 22:41:32.520303 10607 negotiation.cc:337] Failed RPC negotiation. Trace:
0926 22:41:32.261292 (+     0us) reactor.cc:625] Submitting negotiation task for client connection to 0.0.0.0:43013 (local address 127.0.0.1:54568)
0926 22:41:32.261324 (+    32us) negotiation.cc:107] Waiting for socket to connect
0926 22:41:32.261332 (+     8us) client_negotiation.cc:174] Beginning negotiation
0926 22:41:32.261365 (+    33us) client_negotiation.cc:252] Sending NEGOTIATE NegotiatePB request
0926 22:41:32.520258 (+258893us) negotiation.cc:327] Negotiation complete: Network error: Client connection negotiation failed: client connection to 0.0.0.0:43013: BlockingRecv error: recv error from unknown peer: Transport endpoint is not connected (error 107)
Metrics: {"client-negotiator.queue_time_us":16}
W20260926 22:41:32.520328 10598 negotiation.cc:337] Failed RPC negotiation. Trace:
0926 22:41:32.260460 (+     0us) reactor.cc:625] Submitting negotiation task for client connection to 0.0.0.0:43013 (local address 127.0.0.1:54562)
0926 22:41:32.260493 (+    33us) negotiation.cc:107] Waiting for socket to connect
0926 22:41:32.260501 (+     8us) client_negotiation.cc:174] Beginning negotiation
0926 22:41:32.260535 (+    34us) client_negotiation.cc:252] Sending NEGOTIATE NegotiatePB request
0926 22:41:32.520282 (+259747us) negotiation.cc:327] Negotiation complete: Network error: Client connection negotiation failed: client connection to 0.0.0.0:43013: BlockingRecv error: recv error from unknown peer: Transport endpoint is not connected (error 107)
Metrics: {"client-negotiator.queue_time_us":18}
[       OK ] Parameters/TestRpcSocketTxRxQueue.OverCapacity/0 (1025 ms)
[----------] 1 test from Parameters/TestRpcSocketTxRxQueue (1025 ms total)

[----------] Global test environment tear-down
[==========] 21 tests from 2 test suites ran. (30311 ms total)
[  PASSED  ] 20 tests.
[  FAILED  ] 1 test, listed below:
[  FAILED  ] Parameters/TestRpc.TestCallWithChainCertAndChainCA/SSL_TCP, where GetParam() = (true, false)

 1 FAILED TEST