Diagnosed failure

Parameters/TestRpc.TestCallWithChainCertAndChainCA/SSL_TCP: /data0/somelongdirectorytoavoidrpathissues/src/kudu/src/kudu/rpc/rpc-test.cc:270: Failure
Failed
Bad status: Runtime error: could not verify certificate chain (error with cert: subject=CN = localhost, ST = sadfjas, C = AS, emailAddress = sdflkdsajf, O = lskdfjlsad, OU = sldfkja, issuer=C = AS, ST = ASDfkjdhf, L = lskdjf, O = saldfja, OU = skdjf, CN = localhost, emailAddress = sadjflkadsj): : certificate has expired
Google Test trace:
/data0/somelongdirectorytoavoidrpathissues/src/kudu/src/kudu/rpc/rpc-test.cc:267: Connecting to 0.0.0.0:44923
I20260924 15:19:34.252421  1677 test_util.cc:175] -----------------------------------------------
I20260924 15:19:34.252498  1677 test_util.cc:176] Had fatal failures, leaving test files at /tmp/dist-test-taskU67uyz/test-tmp/rpc-test.5.Parameters_TestRpc.TestCallWithChainCertAndChainCA_SSL_TCP.1790263174179143-1677-0

Full log

Note: This is test shard 6 of 8.
[==========] Running 21 tests from 2 test suites.
[----------] Global test environment set-up.
[----------] 20 tests from Parameters/TestRpc
[ RUN      ] Parameters/TestRpc.TestMessengerCreateDestroy/SSL_TCP
WARNING: Logging before InitGoogleLogging() is written to STDERR
I20260924 15:19:34.206089  1677 rpc-test.cc:169] started messenger TestCreateDestroy
[       OK ] Parameters/TestRpc.TestMessengerCreateDestroy/SSL_TCP (24 ms)
[ RUN      ] Parameters/TestRpc.TestNegotiationDeadlock/SSL_TCP
I20260924 15:19:34.221851  1698 acceptor_pool.cc:254] collecting diagnostics on the listening RPC socket 0.0.0.0:35185 every 8 connection(s)
I20260924 15:19:34.223634  1697 acceptor_pool.cc:254] collecting diagnostics on the listening RPC socket 0.0.0.0:35185 every 8 connection(s)
[       OK ] Parameters/TestRpc.TestNegotiationDeadlock/SSL_TCP (23 ms)
[ RUN      ] Parameters/TestRpc.TestCallWithChainCertAndChainCA/SSL_TCP
I20260924 15:19:34.248263  1713 acceptor_pool.cc:254] collecting diagnostics on the listening RPC socket 0.0.0.0:44923 every 8 connection(s)
I20260924 15:19:34.248299  1714 acceptor_pool.cc:254] collecting diagnostics on the listening RPC socket 0.0.0.0:44923 every 8 connection(s)
/data0/somelongdirectorytoavoidrpathissues/src/kudu/src/kudu/rpc/rpc-test.cc:270: Failure
Failed
Bad status: Runtime error: could not verify certificate chain (error with cert: subject=CN = localhost, ST = sadfjas, C = AS, emailAddress = sdflkdsajf, O = lskdfjlsad, OU = sldfkja, issuer=C = AS, ST = ASDfkjdhf, L = lskdjf, O = saldfja, OU = skdjf, CN = localhost, emailAddress = sadjflkadsj): : certificate has expired
Google Test trace:
/data0/somelongdirectorytoavoidrpathissues/src/kudu/src/kudu/rpc/rpc-test.cc:267: Connecting to 0.0.0.0:44923
I20260924 15:19:34.252421  1677 test_util.cc:175] -----------------------------------------------
I20260924 15:19:34.252498  1677 test_util.cc:176] Had fatal failures, leaving test files at /tmp/dist-test-taskU67uyz/test-tmp/rpc-test.5.Parameters_TestRpc.TestCallWithChainCertAndChainCA_SSL_TCP.1790263174179143-1677-0
[  FAILED  ] Parameters/TestRpc.TestCallWithChainCertAndChainCA/SSL_TCP, where GetParam() = (true, false) (21 ms)
[ RUN      ] Parameters/TestRpc.TestCallWithPasswordProtectedKey/SSL_TCP
I20260924 15:19:34.264987  1738 acceptor_pool.cc:254] collecting diagnostics on the listening RPC socket 0.0.0.0:33415 every 8 connection(s)
I20260924 15:19:34.265026  1739 acceptor_pool.cc:254] collecting diagnostics on the listening RPC socket 0.0.0.0:33415 every 8 connection(s)
[       OK ] Parameters/TestRpc.TestCallWithPasswordProtectedKey/SSL_TCP (25 ms)
[ RUN      ] Parameters/TestRpc.TestCallToBadServer/SSL_TCP
I20260924 15:19:34.306886  1677 rpc-test.cc:394] Status: Network error: Client connection negotiation failed: client connection to 0.0.0.0:0: connect: Connection refused (error 111)
I20260924 15:19:34.307150  1677 rpc-test.cc:394] Status: Network error: Client connection negotiation failed: client connection to 0.0.0.0:0: connect: Connection refused (error 111)
I20260924 15:19:34.307343  1677 rpc-test.cc:394] Status: Network error: Client connection negotiation failed: client connection to 0.0.0.0:0: connect: Connection refused (error 111)
I20260924 15:19:34.307533  1677 rpc-test.cc:394] Status: Network error: Client connection negotiation failed: client connection to 0.0.0.0:0: connect: Connection refused (error 111)
I20260924 15:19:34.307740  1677 rpc-test.cc:394] Status: Network error: Client connection negotiation failed: client connection to 0.0.0.0:0: connect: Connection refused (error 111)
[       OK ] Parameters/TestRpc.TestCallToBadServer/SSL_TCP (30 ms)
[ RUN      ] Parameters/TestRpc.TestWrongService/SSL_TCP
I20260924 15:19:34.327143  1774 acceptor_pool.cc:254] collecting diagnostics on the listening RPC socket 0.0.0.0:41683 every 8 connection(s)
I20260924 15:19:34.327138  1773 acceptor_pool.cc:254] collecting diagnostics on the listening RPC socket 0.0.0.0:41683 every 8 connection(s)
I20260924 15:19:34.356261  1771 messenger.cc:345] service WrongServiceName not registered on TestServer
[       OK ] Parameters/TestRpc.TestWrongService/SSL_TCP (49 ms)
[ RUN      ] Parameters/TestRpc.TestConnectionKeepalive/SSL_TCP
I20260924 15:19:34.391219  1796 acceptor_pool.cc:254] collecting diagnostics on the listening RPC socket 0.0.0.0:33401 every 8 connection(s)
I20260924 15:19:34.391250  1797 acceptor_pool.cc:254] collecting diagnostics on the listening RPC socket 0.0.0.0:33401 every 8 connection(s)
I20260924 15:19:34.391408  1677 rpc-test.cc:488] Connecting to 0.0.0.0:33401
[       OK ] Parameters/TestRpc.TestConnectionKeepalive/SSL_TCP (1057 ms)
[ RUN      ] Parameters/TestRpc.TestClientConnectionMetrics/SSL_TCP
I20260924 15:19:35.433454  1821 acceptor_pool.cc:254] collecting diagnostics on the listening RPC socket 0.0.0.0:42815 every 8 connection(s)
I20260924 15:19:35.433492  1822 acceptor_pool.cc:254] collecting diagnostics on the listening RPC socket 0.0.0.0:42815 every 8 connection(s)
I20260924 15:19:35.433678  1677 rpc-test.cc:569] Connecting to 0.0.0.0:42815
[       OK ] Parameters/TestRpc.TestClientConnectionMetrics/SSL_TCP (8551 ms)
[ RUN      ] Parameters/TestRpc.TestCredentialsPolicy/SSL_TCP
I20260924 15:19:43.980373  1844 acceptor_pool.cc:254] collecting diagnostics on the listening RPC socket 0.0.0.0:39763 every 8 connection(s)
I20260924 15:19:43.980437  1845 acceptor_pool.cc:254] collecting diagnostics on the listening RPC socket 0.0.0.0:39763 every 8 connection(s)
I20260924 15:19:43.980587  1677 rpc-test.cc:700] Connecting to 0.0.0.0:39763
[       OK ] Parameters/TestRpc.TestCredentialsPolicy/SSL_TCP (33 ms)
[ RUN      ] Parameters/TestRpc.TestCallLongerThanKeepalive/SSL_TCP
I20260924 15:19:44.030701  1869 acceptor_pool.cc:254] collecting diagnostics on the listening RPC socket 0.0.0.0:38425 every 8 connection(s)
I20260924 15:19:44.030742  1870 acceptor_pool.cc:254] collecting diagnostics on the listening RPC socket 0.0.0.0:38425 every 8 connection(s)
I20260924 15:19:44.052585  1873 rpc-test-base.h:222] got call: sleep_micros: 3000000 deferred: true
I20260924 15:19:47.053426  1873 rpcz_store.cc:275] Call kudu.rpc.GenericCalculatorService.Sleep from 127.0.0.1:37244 (request call id 0) took 3000 ms. Trace:
I20260924 15:19:47.053539  1873 rpcz_store.cc:276] 0924 15:19:44.052524 (+     0us) service_pool.cc:170] Inserting onto call queue
0924 15:19:44.052559 (+    35us) service_pool.cc:227] Handling call
0924 15:19:47.053408 (+3000849us) inbound_call.cc:173] Queueing success response
Metrics: {}
[       OK ] Parameters/TestRpc.TestCallLongerThanKeepalive/SSL_TCP (3054 ms)
[ RUN      ] Parameters/TestRpc.TestRpcSidecar/SSL_TCP
I20260924 15:19:47.083895  1894 acceptor_pool.cc:254] collecting diagnostics on the listening RPC socket 0.0.0.0:34445 every 8 connection(s)
I20260924 15:19:47.083912  1895 acceptor_pool.cc:254] collecting diagnostics on the listening RPC socket 0.0.0.0:34445 every 8 connection(s)
[       OK ] Parameters/TestRpc.TestRpcSidecar/SSL_TCP (95 ms)
[ RUN      ] Parameters/TestRpc.TestRpcSidecarLimits/SSL_TCP
I20260924 15:19:49.718552  1919 acceptor_pool.cc:254] collecting diagnostics on the listening RPC socket 0.0.0.0:42013 every 8 connection(s)
I20260924 15:19:49.718617  1920 acceptor_pool.cc:254] collecting diagnostics on the listening RPC socket 0.0.0.0:42013 every 8 connection(s)
W20260924 15:19:49.722640  1677 serialization.cc:72] Serialized kudu.rpc_test.PushStringsRequestPB (2147483654 bytes) is larger than the maximum configured RPC message size (52428800 bytes). Sending anyway, but peer may reject the data.
W20260924 15:19:49.725737  1916 connection.cc:535] server connection from 127.0.0.1:43094 recv error: Network error: RPC frame had a length of 2147483714, but we only support messages up to 52428800 bytes long.
W20260924 15:19:49.725783  1916 connection.cc:158] shutting down server connection from 127.0.0.1:43094 with pending inbound data: 4/2147483714 bytes received; last active 0 ns ago: status Network error: RPC frame had a length of 2147483714, but we only support messages up to 52428800 bytes long.
W20260924 15:19:49.726012  1932 connection.cc:196] Error closing socket: Network error: TlsSocket::Close: Connection reset by peer
I20260924 15:19:49.742563  1944 acceptor_pool.cc:254] collecting diagnostics on the listening RPC socket 0.0.0.0:42509 every 8 connection(s)
I20260924 15:19:49.742591  1945 acceptor_pool.cc:254] collecting diagnostics on the listening RPC socket 0.0.0.0:42509 every 8 connection(s)
W20260924 15:19:55.429093  1941 connection.cc:577] server connection from 127.0.0.1:38372: received bad data: 'Corruption: Invalid packet: message had a length of 2147483710, but we only support messages up to 2147483647 bytes
'
[       OK ] Parameters/TestRpc.TestRpcSidecarLimits/SSL_TCP (8280 ms)
[ RUN      ] Parameters/TestRpc.TestCallTimeoutDoesntAffectNegotiation/SSL_TCP
I20260924 15:19:55.449586  1969 acceptor_pool.cc:254] collecting diagnostics on the listening RPC socket 0.0.0.0:42643 every 8 connection(s)
I20260924 15:19:55.449666  1970 acceptor_pool.cc:254] collecting diagnostics on the listening RPC socket 0.0.0.0:42643 every 8 connection(s)
W20260924 15:19:55.467725  1962 negotiation.cc:266] Injecting 500ms delay in negotiation
I20260924 15:19:55.517927  1677 rpc-test-base.h:595] status: Timed out: connection negotiation to 0.0.0.0:42643 for RPC Sleep timed out after 0.050s (ON_OUTBOUND_QUEUE), seconds elapsed: 0.050599
[       OK ] Parameters/TestRpc.TestCallTimeoutDoesntAffectNegotiation/SSL_TCP (541 ms)
[ RUN      ] Parameters/TestRpc.TestRpcHandlerLatencyMetric/SSL_TCP
I20260924 15:19:55.990176  1994 acceptor_pool.cc:254] collecting diagnostics on the listening RPC socket 0.0.0.0:35559 every 8 connection(s)
I20260924 15:19:55.990201  1995 acceptor_pool.cc:254] collecting diagnostics on the listening RPC socket 0.0.0.0:35559 every 8 connection(s)
I20260924 15:19:56.022084  1677 rpc-test.cc:1236] Sleep() min lat: 20281
I20260924 15:19:56.022151  1677 rpc-test.cc:1237] Sleep() mean lat: 20281
I20260924 15:19:56.022179  1677 rpc-test.cc:1238] Sleep() max lat: 20281
I20260924 15:19:56.022192  1677 rpc-test.cc:1239] Sleep() #calls: 1
[       OK ] Parameters/TestRpc.TestRpcHandlerLatencyMetric/SSL_TCP (52 ms)
[ RUN      ] Parameters/TestRpc.TimedOutOnResponseMetricServiceQueue/SSL_TCP
I20260924 15:19:56.038776  2020 acceptor_pool.cc:254] collecting diagnostics on the listening RPC socket 0.0.0.0:41303 every 8 connection(s)
I20260924 15:19:56.038825  2021 acceptor_pool.cc:254] collecting diagnostics on the listening RPC socket 0.0.0.0:41303 every 8 connection(s)
W20260924 15:19:56.096292  2022 rpcz_store.cc:267] Call kudu.rpc_test.CalculatorService.Sleep from 127.0.0.1:33640 (request call id 2) took 20 ms (client timeout 20 ms). Trace:
W20260924 15:19:56.096514  2022 rpcz_store.cc:269] 0924 15:19:56.076050 (+     0us) service_pool.cc:170] Inserting onto call queue
0924 15:19:56.096265 (+ 20215us) service_pool.cc:214] Skipping call since client already timed out
0924 15:19:56.096277 (+    12us) inbound_call.cc:173] Queueing failure response
Metrics: {}
[       OK ] Parameters/TestRpc.TimedOutOnResponseMetricServiceQueue/SSL_TCP (72 ms)
[ RUN      ] Parameters/TestRpc.RpcPendingConnectionsMetric/SSL_TCP
I20260924 15:19:56.099959  2043 acceptor_pool.cc:254] collecting diagnostics on the listening RPC socket 0.0.0.0:41025 every 8 connection(s)
I20260924 15:19:56.100026  2044 acceptor_pool.cc:254] collecting diagnostics on the listening RPC socket 0.0.0.0:41025 every 8 connection(s)
W20260924 15:19:56.100625  2039 negotiation.cc:337] Failed RPC negotiation. Trace:
0924 15:19:56.100435 (+     0us) reactor.cc:625] Submitting negotiation task for server connection from 127.0.0.1:43826 (local address 127.0.0.1:41025)
0924 15:19:56.100491 (+    56us) server_negotiation.cc:206] Beginning negotiation
0924 15:19:56.100492 (+     1us) server_negotiation.cc:399] Waiting for connection header
0924 15:19:56.100574 (+    82us) negotiation.cc:327] Negotiation complete: Network error: Server connection negotiation failed: server connection from 127.0.0.1:43826: BlockingRecv error: recv got EOF from 127.0.0.1:43826 (error 108)
Metrics: {"server-negotiator.queue_time_us":14}
[       OK ] Parameters/TestRpc.RpcPendingConnectionsMetric/SSL_TCP (13 ms)
[ RUN      ] Parameters/TestRpc.TestRpcContextClientDeadline/SSL_TCP
I20260924 15:19:56.119994  2059 acceptor_pool.cc:254] collecting diagnostics on the listening RPC socket 0.0.0.0:41329 every 8 connection(s)
I20260924 15:19:56.120043  2060 acceptor_pool.cc:254] collecting diagnostics on the listening RPC socket 0.0.0.0:41329 every 8 connection(s)
[       OK ] Parameters/TestRpc.TestRpcContextClientDeadline/SSL_TCP (60 ms)
[ RUN      ] Parameters/TestRpc.TestApplicationFeatureFlagUnsupportedServer/SSL_TCP
I20260924 15:19:56.189639  2084 acceptor_pool.cc:254] collecting diagnostics on the listening RPC socket 0.0.0.0:44257 every 8 connection(s)
I20260924 15:19:56.189639  2085 acceptor_pool.cc:254] collecting diagnostics on the listening RPC socket 0.0.0.0:44257 every 8 connection(s)
[       OK ] Parameters/TestRpc.TestApplicationFeatureFlagUnsupportedServer/SSL_TCP (38 ms)
[ RUN      ] Parameters/TestRpc.TestCancellationAsync/SSL_TCP
I20260924 15:19:56.221863  2109 acceptor_pool.cc:254] collecting diagnostics on the listening RPC socket 0.0.0.0:41357 every 8 connection(s)
I20260924 15:19:56.221912  2110 acceptor_pool.cc:254] collecting diagnostics on the listening RPC socket 0.0.0.0:41357 every 8 connection(s)
I20260924 15:19:56.222076  1677 rpc-test.cc:1716] Connecting to 0.0.0.0:41357
I20260924 15:19:56.238940  1677 test_util.cc:268] Using random seed: 568181849
I20260924 15:19:56.258718  2113 rpc-test-base.h:240] got call: sleep_micros: 500 pattern: 4294967295 num_repetitions: 2097152 sidecar_idx: 0
I20260924 15:19:56.276496  2113 rpc-test-base.h:240] got call: sleep_micros: 500 pattern: 4294967295 num_repetitions: 2097152 sidecar_idx: 0
I20260924 15:19:56.292555  2113 rpc-test-base.h:240] got call: sleep_micros: 500 pattern: 4294967295 num_repetitions: 2097152 sidecar_idx: 0
I20260924 15:19:56.306473  2113 rpc-test-base.h:240] got call: sleep_micros: 500 pattern: 4294967295 num_repetitions: 2097152 sidecar_idx: 0
I20260924 15:19:56.319919  2113 rpc-test-base.h:240] got call: sleep_micros: 500 pattern: 4294967295 num_repetitions: 2097152 sidecar_idx: 0
I20260924 15:19:56.333949  2113 rpc-test-base.h:240] got call: sleep_micros: 500 pattern: 4294967295 num_repetitions: 2097152 sidecar_idx: 0
I20260924 15:19:56.348959  2113 rpc-test-base.h:240] got call: sleep_micros: 500 pattern: 4294967295 num_repetitions: 2097152 sidecar_idx: 0
W20260924 15:19:56.352437  2107 connection.cc:441] server connection from 127.0.0.1:56248 torn down before Call kudu.rpc.GenericCalculatorService.SleepWithSidecar from 127.0.0.1:56248 (request call id 9) could send its response
[       OK ] Parameters/TestRpc.TestCancellationAsync/SSL_TCP (143 ms)
[ RUN      ] Parameters/TestRpc.TestPerformanceBySocketType/SSL_TCP
I20260924 15:19:56.368906  2135 acceptor_pool.cc:254] collecting diagnostics on the listening RPC socket 0.0.0.0:43837 every 8 connection(s)
I20260924 15:19:56.368924  2136 acceptor_pool.cc:254] collecting diagnostics on the listening RPC socket 0.0.0.0:43837 every 8 connection(s)
I20260924 15:19:56.369095  1677 rpc-test.cc:1846] Connecting to 0.0.0.0:43837
I20260924 15:19:58.136236  1677 rpc-test.cc:1859] Sending 1024MB via ssl-enabled tcp socket: real 1.748s	user 1.532s	sys 1.551s
I20260924 15:19:59.887418  1677 rpc-test.cc:1859] Sending 1024MB via ssl-enabled tcp socket: real 1.751s	user 1.606s	sys 1.509s
I20260924 15:20:01.627647  1677 rpc-test.cc:1859] Sending 1024MB via ssl-enabled tcp socket: real 1.740s	user 1.518s	sys 1.524s
I20260924 15:20:03.341671  1677 rpc-test.cc:1859] Sending 1024MB via ssl-enabled tcp socket: real 1.714s	user 1.658s	sys 1.379s
I20260924 15:20:05.024555  1677 rpc-test.cc:1859] Sending 1024MB via ssl-enabled tcp socket: real 1.683s	user 1.565s	sys 1.405s
[       OK ] Parameters/TestRpc.TestPerformanceBySocketType/SSL_TCP (8672 ms)
[----------] 20 tests from Parameters/TestRpc (30843 ms total)

[----------] 1 test from Parameters/TestRpcSocketTxRxQueue
[ RUN      ] Parameters/TestRpcSocketTxRxQueue.OverCapacity/0
W20260924 15:20:05.296592  2179 negotiation.cc:337] Failed RPC negotiation. Trace:
0924 15:20:05.035959 (+     0us) reactor.cc:625] Submitting negotiation task for client connection to 0.0.0.0:38375 (local address 127.0.0.1:39120)
0924 15:20:05.035999 (+    40us) negotiation.cc:107] Waiting for socket to connect
0924 15:20:05.036009 (+    10us) client_negotiation.cc:174] Beginning negotiation
0924 15:20:05.036054 (+    45us) client_negotiation.cc:252] Sending NEGOTIATE NegotiatePB request
0924 15:20:05.296430 (+260376us) negotiation.cc:327] Negotiation complete: Network error: Client connection negotiation failed: client connection to 0.0.0.0:38375: BlockingRecv error: recv error from unknown peer: Transport endpoint is not connected (error 107)
Metrics: {"client-negotiator.queue_time_us":18}
W20260924 15:20:05.296756  2197 negotiation.cc:337] Failed RPC negotiation. Trace:
0924 15:20:05.037777 (+     0us) reactor.cc:625] Submitting negotiation task for client connection to 0.0.0.0:38375 (local address 127.0.0.1:39140)
0924 15:20:05.037811 (+    34us) negotiation.cc:107] Waiting for socket to connect
0924 15:20:05.037819 (+     8us) client_negotiation.cc:174] Beginning negotiation
0924 15:20:05.037853 (+    34us) client_negotiation.cc:252] Sending NEGOTIATE NegotiatePB request
0924 15:20:05.296582 (+258729us) negotiation.cc:327] Negotiation complete: Network error: Client connection negotiation failed: client connection to 0.0.0.0:38375: BlockingRecv error: recv error from unknown peer: Transport endpoint is not connected (error 107)
Metrics: {"client-negotiator.queue_time_us":17}
W20260924 15:20:05.296835  2161 negotiation.cc:337] Failed RPC negotiation. Trace:
0924 15:20:05.033899 (+     0us) reactor.cc:625] Submitting negotiation task for client connection to 0.0.0.0:38375 (local address 127.0.0.1:39098)
0924 15:20:05.033940 (+    41us) negotiation.cc:107] Waiting for socket to connect
0924 15:20:05.033948 (+     8us) client_negotiation.cc:174] Beginning negotiation
0924 15:20:05.033989 (+    41us) client_negotiation.cc:252] Sending NEGOTIATE NegotiatePB request
0924 15:20:05.296428 (+262439us) negotiation.cc:327] Negotiation complete: Network error: Client connection negotiation failed: client connection to 0.0.0.0:38375: BlockingRecv error: recv error from unknown peer: Transport endpoint is not connected (error 107)
Metrics: {"client-negotiator.queue_time_us":18}
W20260924 15:20:05.296586  2152 negotiation.cc:337] Failed RPC negotiation. Trace:
0924 15:20:05.032883 (+     0us) reactor.cc:625] Submitting negotiation task for client connection to 0.0.0.0:38375 (local address 127.0.0.1:39094)
0924 15:20:05.032935 (+    52us) negotiation.cc:107] Waiting for socket to connect
0924 15:20:05.032946 (+    11us) client_negotiation.cc:174] Beginning negotiation
0924 15:20:05.033007 (+    61us) client_negotiation.cc:252] Sending NEGOTIATE NegotiatePB request
0924 15:20:05.296447 (+263440us) negotiation.cc:327] Negotiation complete: Network error: Client connection negotiation failed: client connection to 0.0.0.0:38375: BlockingRecv error: recv error from unknown peer: Transport endpoint is not connected (error 107)
Metrics: {"client-negotiator.queue_time_us":20}
W20260924 15:20:05.296973  2188 negotiation.cc:337] Failed RPC negotiation. Trace:
0924 15:20:05.036844 (+     0us) reactor.cc:625] Submitting negotiation task for client connection to 0.0.0.0:38375 (local address 127.0.0.1:39126)
0924 15:20:05.036881 (+    37us) negotiation.cc:107] Waiting for socket to connect
0924 15:20:05.036889 (+     8us) client_negotiation.cc:174] Beginning negotiation
0924 15:20:05.036924 (+    35us) client_negotiation.cc:252] Sending NEGOTIATE NegotiatePB request
0924 15:20:05.296490 (+259566us) negotiation.cc:327] Negotiation complete: Network error: Client connection negotiation failed: client connection to 0.0.0.0:38375: BlockingRecv error: recv error from unknown peer: Transport endpoint is not connected (error 107)
Metrics: {"client-negotiator.queue_time_us":19}
W20260924 15:20:05.296586  2170 negotiation.cc:337] Failed RPC negotiation. Trace:
0924 15:20:05.034903 (+     0us) reactor.cc:625] Submitting negotiation task for client connection to 0.0.0.0:38375 (local address 127.0.0.1:39106)
0924 15:20:05.034973 (+    70us) negotiation.cc:107] Waiting for socket to connect
0924 15:20:05.034982 (+     9us) client_negotiation.cc:174] Beginning negotiation
0924 15:20:05.035034 (+    52us) client_negotiation.cc:252] Sending NEGOTIATE NegotiatePB request
0924 15:20:05.296495 (+261461us) negotiation.cc:327] Negotiation complete: Network error: Client connection negotiation failed: client connection to 0.0.0.0:38375: BlockingRecv error: recv error from unknown peer: Transport endpoint is not connected (error 107)
Metrics: {"client-negotiator.queue_time_us":44}
[       OK ] Parameters/TestRpcSocketTxRxQueue.OverCapacity/0 (1043 ms)
[----------] 1 test from Parameters/TestRpcSocketTxRxQueue (1043 ms total)

[----------] Global test environment tear-down
[==========] 21 tests from 2 test suites ran. (31887 ms total)
[  PASSED  ] 20 tests.
[  FAILED  ] 1 test, listed below:
[  FAILED  ] Parameters/TestRpc.TestCallWithChainCertAndChainCA/SSL_TCP, where GetParam() = (true, false)

 1 FAILED TEST