Diagnosed failure

Parameters/TestRpc.TestCallWithChainCertAndChainCA/SSL_UnixSocket: /data0/somelongdirectorytoavoidrpathissues/src/kudu/src/kudu/rpc/rpc-test.cc:270: Failure
Failed
Bad status: Runtime error: could not verify certificate chain (error with cert: subject=CN = localhost, ST = sadfjas, C = AS, emailAddress = sdflkdsajf, O = lskdfjlsad, OU = sldfkja, issuer=C = AS, ST = ASDfkjdhf, L = lskdjf, O = saldfja, OU = skdjf, CN = localhost, emailAddress = sadjflkadsj): : certificate has expired
Google Test trace:
/data0/somelongdirectorytoavoidrpathissues/src/kudu/src/kudu/rpc/rpc-test.cc:267: Connecting to unix:/tmp/dist-test-task7FCWj7/test-tmp/rpc-test-37cfc5ac22914d8ca86abee87886a0db.sock
I20260924 15:19:36.057375 15126 test_util.cc:175] -----------------------------------------------
I20260924 15:19:36.057426 15126 test_util.cc:176] Had fatal failures, leaving test files at /tmp/dist-test-task7FCWj7/test-tmp/rpc-test.6.Parameters_TestRpc.TestCallWithChainCertAndChainCA_SSL_UnixSocket.1790263175983725-15126-0

Full log

Note: This is test shard 7 of 8.
[==========] Running 21 tests from 2 test suites.
[----------] Global test environment set-up.
[----------] 20 tests from Parameters/TestRpc
[ RUN      ] Parameters/TestRpc.TestMessengerCreateDestroy/SSL_UnixSocket
WARNING: Logging before InitGoogleLogging() is written to STDERR
I20260924 15:19:36.004259 15126 rpc-test.cc:169] started messenger TestCreateDestroy
[       OK ] Parameters/TestRpc.TestMessengerCreateDestroy/SSL_UnixSocket (19 ms)
[ RUN      ] Parameters/TestRpc.TestNegotiationDeadlock/SSL_UnixSocket
I20260924 15:19:36.038251 15146 acceptor_pool.cc:254] collecting diagnostics on the listening RPC socket unix:/tmp/dist-test-task7FCWj7/test-tmp/rpc-test-27f948da98214d41ba1126fb94a85b70.sock every 8 connection(s)
I20260924 15:19:36.038269 15147 acceptor_pool.cc:254] collecting diagnostics on the listening RPC socket unix:/tmp/dist-test-task7FCWj7/test-tmp/rpc-test-27f948da98214d41ba1126fb94a85b70.sock every 8 connection(s)
[       OK ] Parameters/TestRpc.TestNegotiationDeadlock/SSL_UnixSocket (39 ms)
[ RUN      ] Parameters/TestRpc.TestCallWithChainCertAndChainCA/SSL_UnixSocket
I20260924 15:19:36.053114 15163 acceptor_pool.cc:254] collecting diagnostics on the listening RPC socket unix:/tmp/dist-test-task7FCWj7/test-tmp/rpc-test-37cfc5ac22914d8ca86abee87886a0db.sock every 8 connection(s)
I20260924 15:19:36.053104 15162 acceptor_pool.cc:254] collecting diagnostics on the listening RPC socket unix:/tmp/dist-test-task7FCWj7/test-tmp/rpc-test-37cfc5ac22914d8ca86abee87886a0db.sock every 8 connection(s)
/data0/somelongdirectorytoavoidrpathissues/src/kudu/src/kudu/rpc/rpc-test.cc:270: Failure
Failed
Bad status: Runtime error: could not verify certificate chain (error with cert: subject=CN = localhost, ST = sadfjas, C = AS, emailAddress = sdflkdsajf, O = lskdfjlsad, OU = sldfkja, issuer=C = AS, ST = ASDfkjdhf, L = lskdjf, O = saldfja, OU = skdjf, CN = localhost, emailAddress = sadjflkadsj): : certificate has expired
Google Test trace:
/data0/somelongdirectorytoavoidrpathissues/src/kudu/src/kudu/rpc/rpc-test.cc:267: Connecting to unix:/tmp/dist-test-task7FCWj7/test-tmp/rpc-test-37cfc5ac22914d8ca86abee87886a0db.sock
I20260924 15:19:36.057375 15126 test_util.cc:175] -----------------------------------------------
I20260924 15:19:36.057426 15126 test_util.cc:176] Had fatal failures, leaving test files at /tmp/dist-test-task7FCWj7/test-tmp/rpc-test.6.Parameters_TestRpc.TestCallWithChainCertAndChainCA_SSL_UnixSocket.1790263175983725-15126-0
[  FAILED  ] Parameters/TestRpc.TestCallWithChainCertAndChainCA/SSL_UnixSocket, where GetParam() = (true, true) (12 ms)
[ RUN      ] Parameters/TestRpc.TestCallWithPasswordProtectedKey/SSL_UnixSocket
I20260924 15:19:36.071215 15187 acceptor_pool.cc:254] collecting diagnostics on the listening RPC socket unix:/tmp/dist-test-task7FCWj7/test-tmp/rpc-test-fc6d6c924d2d4055adadb8a02d39d06c.sock every 8 connection(s)
I20260924 15:19:36.071236 15188 acceptor_pool.cc:254] collecting diagnostics on the listening RPC socket unix:/tmp/dist-test-task7FCWj7/test-tmp/rpc-test-fc6d6c924d2d4055adadb8a02d39d06c.sock every 8 connection(s)
W20260924 15:19:36.082765 15184 connection.cc:196] Error closing socket: Network error: TlsSocket::Close: Broken pipe
[       OK ] Parameters/TestRpc.TestCallWithPasswordProtectedKey/SSL_UnixSocket (26 ms)
[ RUN      ] Parameters/TestRpc.TestCallToBadServer/SSL_UnixSocket
I20260924 15:19:36.107832 15126 rpc-test.cc:394] Status: Network error: Client connection negotiation failed: client connection to 0.0.0.0:0: connect: Connection refused (error 111)
I20260924 15:19:36.108105 15126 rpc-test.cc:394] Status: Network error: Client connection negotiation failed: client connection to 0.0.0.0:0: connect: Connection refused (error 111)
I20260924 15:19:36.108299 15126 rpc-test.cc:394] Status: Network error: Client connection negotiation failed: client connection to 0.0.0.0:0: connect: Connection refused (error 111)
I20260924 15:19:36.108490 15126 rpc-test.cc:394] Status: Network error: Client connection negotiation failed: client connection to 0.0.0.0:0: connect: Connection refused (error 111)
I20260924 15:19:36.108673 15126 rpc-test.cc:394] Status: Network error: Client connection negotiation failed: client connection to 0.0.0.0:0: connect: Connection refused (error 111)
[       OK ] Parameters/TestRpc.TestCallToBadServer/SSL_UnixSocket (25 ms)
[ RUN      ] Parameters/TestRpc.TestWrongService/SSL_UnixSocket
I20260924 15:19:36.131878 15222 acceptor_pool.cc:254] collecting diagnostics on the listening RPC socket unix:/tmp/dist-test-task7FCWj7/test-tmp/rpc-test-b43ef4d5db3d4165bbdb4eb1ac876fe5.sock every 8 connection(s)
I20260924 15:19:36.131920 15223 acceptor_pool.cc:254] collecting diagnostics on the listening RPC socket unix:/tmp/dist-test-task7FCWj7/test-tmp/rpc-test-b43ef4d5db3d4165bbdb4eb1ac876fe5.sock every 8 connection(s)
I20260924 15:19:36.146873 15219 messenger.cc:345] service WrongServiceName not registered on TestServer
[       OK ] Parameters/TestRpc.TestWrongService/SSL_UnixSocket (39 ms)
[ RUN      ] Parameters/TestRpc.TestConnectionKeepalive/SSL_UnixSocket
I20260924 15:19:36.155385 15245 acceptor_pool.cc:254] collecting diagnostics on the listening RPC socket unix:/tmp/dist-test-task7FCWj7/test-tmp/rpc-test-081ade00e4a04a4ab2c228f9efde709d.sock every 8 connection(s)
I20260924 15:19:36.155419 15246 acceptor_pool.cc:254] collecting diagnostics on the listening RPC socket unix:/tmp/dist-test-task7FCWj7/test-tmp/rpc-test-081ade00e4a04a4ab2c228f9efde709d.sock every 8 connection(s)
I20260924 15:19:36.155632 15126 rpc-test.cc:488] Connecting to unix:/tmp/dist-test-task7FCWj7/test-tmp/rpc-test-081ade00e4a04a4ab2c228f9efde709d.sock
W20260924 15:19:36.650405 15258 connection.cc:196] Error closing socket: Network error: TlsSocket::Close: Broken pipe
[       OK ] Parameters/TestRpc.TestConnectionKeepalive/SSL_UnixSocket (1048 ms)
[ RUN      ] Parameters/TestRpc.TestClientConnectionMetrics/SSL_UnixSocket
I20260924 15:19:37.226513 15270 acceptor_pool.cc:254] collecting diagnostics on the listening RPC socket unix:/tmp/dist-test-task7FCWj7/test-tmp/rpc-test-791c894ecf894e5480fdc9a2792e2470.sock every 8 connection(s)
I20260924 15:19:37.226557 15271 acceptor_pool.cc:254] collecting diagnostics on the listening RPC socket unix:/tmp/dist-test-task7FCWj7/test-tmp/rpc-test-791c894ecf894e5480fdc9a2792e2470.sock every 8 connection(s)
I20260924 15:19:37.226722 15126 rpc-test.cc:569] Connecting to unix:/tmp/dist-test-task7FCWj7/test-tmp/rpc-test-791c894ecf894e5480fdc9a2792e2470.sock
W20260924 15:19:45.388733 15267 connection.cc:196] Error closing socket: Network error: TlsSocket::Close: Broken pipe
[       OK ] Parameters/TestRpc.TestClientConnectionMetrics/SSL_UnixSocket (8193 ms)
[ RUN      ] Parameters/TestRpc.TestCredentialsPolicy/SSL_UnixSocket
I20260924 15:19:45.408293 15293 acceptor_pool.cc:254] collecting diagnostics on the listening RPC socket unix:/tmp/dist-test-task7FCWj7/test-tmp/rpc-test-5e9e4d9a581c4a2faccc3acd3062f0e4.sock every 8 connection(s)
I20260924 15:19:45.408356 15294 acceptor_pool.cc:254] collecting diagnostics on the listening RPC socket unix:/tmp/dist-test-task7FCWj7/test-tmp/rpc-test-5e9e4d9a581c4a2faccc3acd3062f0e4.sock every 8 connection(s)
I20260924 15:19:45.408530 15126 rpc-test.cc:700] Connecting to unix:/tmp/dist-test-task7FCWj7/test-tmp/rpc-test-5e9e4d9a581c4a2faccc3acd3062f0e4.sock
W20260924 15:19:45.433216 15292 connection.cc:196] Error closing socket: Network error: TlsSocket::Close: Broken pipe
[       OK ] Parameters/TestRpc.TestCredentialsPolicy/SSL_UnixSocket (47 ms)
[ RUN      ] Parameters/TestRpc.TestCallLongerThanKeepalive/SSL_UnixSocket
I20260924 15:19:45.455760 15319 acceptor_pool.cc:254] collecting diagnostics on the listening RPC socket unix:/tmp/dist-test-task7FCWj7/test-tmp/rpc-test-5453f33e7e2d442388736c7c800c08c3.sock every 8 connection(s)
I20260924 15:19:45.455801 15320 acceptor_pool.cc:254] collecting diagnostics on the listening RPC socket unix:/tmp/dist-test-task7FCWj7/test-tmp/rpc-test-5453f33e7e2d442388736c7c800c08c3.sock every 8 connection(s)
I20260924 15:19:45.464903 15323 rpc-test-base.h:222] got call: sleep_micros: 3000000 deferred: true
I20260924 15:19:48.465579 15323 rpcz_store.cc:275] Call kudu.rpc.GenericCalculatorService.Sleep from unix:<unnamed> (request call id 0) took 3000 ms. Trace:
I20260924 15:19:48.465680 15323 rpcz_store.cc:276] 0924 15:19:45.464849 (+     0us) service_pool.cc:170] Inserting onto call queue
0924 15:19:45.464887 (+    38us) service_pool.cc:227] Handling call
0924 15:19:48.465560 (+3000673us) inbound_call.cc:173] Queueing success response
Metrics: {}
[       OK ] Parameters/TestRpc.TestCallLongerThanKeepalive/SSL_UnixSocket (3030 ms)
[ RUN      ] Parameters/TestRpc.TestRpcSidecar/SSL_UnixSocket
I20260924 15:19:48.486832 15344 acceptor_pool.cc:254] collecting diagnostics on the listening RPC socket unix:/tmp/dist-test-task7FCWj7/test-tmp/rpc-test-cc99227213d24eba8a0defba8d69155e.sock every 8 connection(s)
I20260924 15:19:48.486888 15345 acceptor_pool.cc:254] collecting diagnostics on the listening RPC socket unix:/tmp/dist-test-task7FCWj7/test-tmp/rpc-test-cc99227213d24eba8a0defba8d69155e.sock every 8 connection(s)
[       OK ] Parameters/TestRpc.TestRpcSidecar/SSL_UnixSocket (66 ms)
[ RUN      ] Parameters/TestRpc.TestRpcSidecarLimits/SSL_UnixSocket
I20260924 15:19:51.628489 15369 acceptor_pool.cc:254] collecting diagnostics on the listening RPC socket unix:/tmp/dist-test-task7FCWj7/test-tmp/rpc-test-c6a9bd25f1074a5893fc8bdc0adccfdc.sock every 8 connection(s)
I20260924 15:19:51.628525 15370 acceptor_pool.cc:254] collecting diagnostics on the listening RPC socket unix:/tmp/dist-test-task7FCWj7/test-tmp/rpc-test-c6a9bd25f1074a5893fc8bdc0adccfdc.sock every 8 connection(s)
W20260924 15:19:51.644335 15126 serialization.cc:72] Serialized kudu.rpc_test.PushStringsRequestPB (2147483654 bytes) is larger than the maximum configured RPC message size (52428800 bytes). Sending anyway, but peer may reject the data.
W20260924 15:19:51.647487 15366 connection.cc:535] server connection from unix:<unnamed> recv error: Network error: RPC frame had a length of 2147483714, but we only support messages up to 52428800 bytes long.
W20260924 15:19:51.647595 15366 connection.cc:158] shutting down server connection from unix:<unnamed> with pending inbound data: 4/2147483714 bytes received; last active 0 ns ago: status Network error: RPC frame had a length of 2147483714, but we only support messages up to 52428800 bytes long.
W20260924 15:19:51.647739 15382 connection.cc:698] client connection to unix:/tmp/dist-test-task7FCWj7/test-tmp/rpc-test-c6a9bd25f1074a5893fc8bdc0adccfdc.sock send error: Network error: failed to write to TLS socket: Broken pipe
W20260924 15:19:51.647886 15382 connection.cc:196] Error closing socket: Network error: TlsSocket::Close: Success
I20260924 15:19:51.660604 15394 acceptor_pool.cc:254] collecting diagnostics on the listening RPC socket unix:/tmp/dist-test-task7FCWj7/test-tmp/rpc-test-c6a9bd25f1074a5893fc8bdc0adccfdc.sock every 8 connection(s)
I20260924 15:19:51.660604 15395 acceptor_pool.cc:254] collecting diagnostics on the listening RPC socket unix:/tmp/dist-test-task7FCWj7/test-tmp/rpc-test-c6a9bd25f1074a5893fc8bdc0adccfdc.sock every 8 connection(s)
W20260924 15:19:58.793257 15391 connection.cc:577] server connection from unix:<unnamed>: received bad data: 'Corruption: Invalid packet: message had a length of 2147483710, but we only support messages up to 2147483647 bytes
'
W20260924 15:19:58.793617 15407 connection.cc:196] Error closing socket: Network error: TlsSocket::Close: Broken pipe
[       OK ] Parameters/TestRpc.TestRpcSidecarLimits/SSL_UnixSocket (10261 ms)
[ RUN      ] Parameters/TestRpc.TestCallTimeoutDoesntAffectNegotiation/SSL_UnixSocket
I20260924 15:19:58.806026 15419 acceptor_pool.cc:254] collecting diagnostics on the listening RPC socket unix:/tmp/dist-test-task7FCWj7/test-tmp/rpc-test-e1e2b26b676046e1837794d0f3cb9551.sock every 8 connection(s)
I20260924 15:19:58.806104 15420 acceptor_pool.cc:254] collecting diagnostics on the listening RPC socket unix:/tmp/dist-test-task7FCWj7/test-tmp/rpc-test-e1e2b26b676046e1837794d0f3cb9551.sock every 8 connection(s)
W20260924 15:19:58.830389 15415 negotiation.cc:266] Injecting 500ms delay in negotiation
I20260924 15:19:58.880672 15126 rpc-test-base.h:595] status: Timed out: connection negotiation to unix:/tmp/dist-test-task7FCWj7/test-tmp/rpc-test-e1e2b26b676046e1837794d0f3cb9551.sock for RPC Sleep timed out after 0.050s (ON_OUTBOUND_QUEUE), seconds elapsed: 0.0506874
W20260924 15:19:59.335003 15416 connection.cc:196] Error closing socket: Network error: TlsSocket::Close: Broken pipe
[       OK ] Parameters/TestRpc.TestCallTimeoutDoesntAffectNegotiation/SSL_UnixSocket (539 ms)
[ RUN      ] Parameters/TestRpc.TestRpcHandlerLatencyMetric/SSL_UnixSocket
I20260924 15:19:59.348263 15445 acceptor_pool.cc:254] collecting diagnostics on the listening RPC socket unix:/tmp/dist-test-task7FCWj7/test-tmp/rpc-test-2a24f27b89c44c63b27bf4bc2965fd43.sock every 8 connection(s)
I20260924 15:19:59.348297 15446 acceptor_pool.cc:254] collecting diagnostics on the listening RPC socket unix:/tmp/dist-test-task7FCWj7/test-tmp/rpc-test-2a24f27b89c44c63b27bf4bc2965fd43.sock every 8 connection(s)
I20260924 15:19:59.397128 15126 rpc-test.cc:1236] Sleep() min lat: 20336
I20260924 15:19:59.397207 15126 rpc-test.cc:1237] Sleep() mean lat: 20336
I20260924 15:19:59.397253 15126 rpc-test.cc:1238] Sleep() max lat: 20336
I20260924 15:19:59.397266 15126 rpc-test.cc:1239] Sleep() #calls: 1
W20260924 15:19:59.398144 15442 connection.cc:196] Error closing socket: Network error: TlsSocket::Close: Broken pipe
[       OK ] Parameters/TestRpc.TestRpcHandlerLatencyMetric/SSL_UnixSocket (62 ms)
[ RUN      ] Parameters/TestRpc.TimedOutOnResponseMetricServiceQueue/SSL_UnixSocket
I20260924 15:19:59.418359 15471 acceptor_pool.cc:254] collecting diagnostics on the listening RPC socket unix:/tmp/dist-test-task7FCWj7/test-tmp/rpc-test-286bd850c9ee41bbb4c97ee4e9fdf226.sock every 8 connection(s)
I20260924 15:19:59.418406 15472 acceptor_pool.cc:254] collecting diagnostics on the listening RPC socket unix:/tmp/dist-test-task7FCWj7/test-tmp/rpc-test-286bd850c9ee41bbb4c97ee4e9fdf226.sock every 8 connection(s)
W20260924 15:19:59.469066 15473 rpcz_store.cc:267] Call kudu.rpc_test.CalculatorService.Sleep from unix:<unnamed> (request call id 2) took 20 ms (client timeout 20 ms). Trace:
W20260924 15:19:59.469203 15473 rpcz_store.cc:269] 0924 15:19:59.448780 (+     0us) service_pool.cc:170] Inserting onto call queue
0924 15:19:59.469034 (+ 20254us) service_pool.cc:214] Skipping call since client already timed out
0924 15:19:59.469047 (+    13us) inbound_call.cc:173] Queueing failure response
Metrics: {}
W20260924 15:19:59.469827 15468 connection.cc:196] Error closing socket: Network error: TlsSocket::Close: Broken pipe
[       OK ] Parameters/TestRpc.TimedOutOnResponseMetricServiceQueue/SSL_UnixSocket (71 ms)
[ RUN      ] Parameters/TestRpc.RpcPendingConnectionsMetric/SSL_UnixSocket
I20260924 15:19:59.472611 15494 acceptor_pool.cc:254] collecting diagnostics on the listening RPC socket 0.0.0.0:34727 every 8 connection(s)
I20260924 15:19:59.472674 15495 acceptor_pool.cc:254] collecting diagnostics on the listening RPC socket 0.0.0.0:34727 every 8 connection(s)
W20260924 15:19:59.473351 15490 negotiation.cc:337] Failed RPC negotiation. Trace:
0924 15:19:59.473139 (+     0us) reactor.cc:625] Submitting negotiation task for server connection from 127.0.0.1:39166 (local address 127.0.0.1:34727)
0924 15:19:59.473200 (+    61us) server_negotiation.cc:206] Beginning negotiation
0924 15:19:59.473202 (+     2us) server_negotiation.cc:399] Waiting for connection header
0924 15:19:59.473286 (+    84us) negotiation.cc:327] Negotiation complete: Network error: Server connection negotiation failed: server connection from 127.0.0.1:39166: BlockingRecv error: recv got EOF from 127.0.0.1:39166 (error 108)
Metrics: {"server-negotiator.queue_time_us":30}
[       OK ] Parameters/TestRpc.RpcPendingConnectionsMetric/SSL_UnixSocket (13 ms)
[ RUN      ] Parameters/TestRpc.TestRpcContextClientDeadline/SSL_UnixSocket
I20260924 15:19:59.494498 15510 acceptor_pool.cc:254] collecting diagnostics on the listening RPC socket unix:/tmp/dist-test-task7FCWj7/test-tmp/rpc-test-429f50d725254e66a42f9b463e6a8642.sock every 8 connection(s)
I20260924 15:19:59.494540 15511 acceptor_pool.cc:254] collecting diagnostics on the listening RPC socket unix:/tmp/dist-test-task7FCWj7/test-tmp/rpc-test-429f50d725254e66a42f9b463e6a8642.sock every 8 connection(s)
[       OK ] Parameters/TestRpc.TestRpcContextClientDeadline/SSL_UnixSocket (49 ms)
[ RUN      ] Parameters/TestRpc.TestApplicationFeatureFlagUnsupportedServer/SSL_UnixSocket
I20260924 15:19:59.544622 15536 acceptor_pool.cc:254] collecting diagnostics on the listening RPC socket unix:/tmp/dist-test-task7FCWj7/test-tmp/rpc-test-47636265359649d8bba4eb06d6edbf4a.sock every 8 connection(s)
I20260924 15:19:59.544631 15537 acceptor_pool.cc:254] collecting diagnostics on the listening RPC socket unix:/tmp/dist-test-task7FCWj7/test-tmp/rpc-test-47636265359649d8bba4eb06d6edbf4a.sock every 8 connection(s)
[       OK ] Parameters/TestRpc.TestApplicationFeatureFlagUnsupportedServer/SSL_UnixSocket (35 ms)
[ RUN      ] Parameters/TestRpc.TestCancellationAsync/SSL_UnixSocket
I20260924 15:19:59.579432 15562 acceptor_pool.cc:254] collecting diagnostics on the listening RPC socket unix:/tmp/dist-test-task7FCWj7/test-tmp/rpc-test-b473700a78f2492d83d7ead8ace26713.sock every 8 connection(s)
I20260924 15:19:59.579491 15563 acceptor_pool.cc:254] collecting diagnostics on the listening RPC socket unix:/tmp/dist-test-task7FCWj7/test-tmp/rpc-test-b473700a78f2492d83d7ead8ace26713.sock every 8 connection(s)
I20260924 15:19:59.579687 15126 rpc-test.cc:1716] Connecting to unix:/tmp/dist-test-task7FCWj7/test-tmp/rpc-test-b473700a78f2492d83d7ead8ace26713.sock
I20260924 15:19:59.610507 15126 test_util.cc:268] Using random seed: 571553415
I20260924 15:19:59.623663 15566 rpc-test-base.h:240] got call: sleep_micros: 500 pattern: 4294967295 num_repetitions: 2097152 sidecar_idx: 0
I20260924 15:19:59.634150 15566 rpc-test-base.h:240] got call: sleep_micros: 500 pattern: 4294967295 num_repetitions: 2097152 sidecar_idx: 0
I20260924 15:19:59.644765 15566 rpc-test-base.h:240] got call: sleep_micros: 500 pattern: 4294967295 num_repetitions: 2097152 sidecar_idx: 0
I20260924 15:19:59.655270 15566 rpc-test-base.h:240] got call: sleep_micros: 500 pattern: 4294967295 num_repetitions: 2097152 sidecar_idx: 0
I20260924 15:19:59.666827 15566 rpc-test-base.h:240] got call: sleep_micros: 500 pattern: 4294967295 num_repetitions: 2097152 sidecar_idx: 0
I20260924 15:19:59.678273 15566 rpc-test-base.h:240] got call: sleep_micros: 500 pattern: 4294967295 num_repetitions: 2097152 sidecar_idx: 0
I20260924 15:19:59.689896 15566 rpc-test-base.h:240] got call: sleep_micros: 500 pattern: 4294967295 num_repetitions: 2097152 sidecar_idx: 0
I20260924 15:19:59.700718 15566 rpc-test-base.h:240] got call: sleep_micros: 500 pattern: 4294967295 num_repetitions: 2097152 sidecar_idx: 0
W20260924 15:19:59.702338 15559 connection.cc:196] Error closing socket: Network error: TlsSocket::Close: Broken pipe
W20260924 15:19:59.704017 15559 connection.cc:441] server connection from unix:<unnamed> torn down before Call kudu.rpc.GenericCalculatorService.SleepWithSidecar from unix:<unnamed> (request call id 9) could send its response
[       OK ] Parameters/TestRpc.TestCancellationAsync/SSL_UnixSocket (135 ms)
[ RUN      ] Parameters/TestRpc.TestPerformanceBySocketType/SSL_UnixSocket
I20260924 15:19:59.734655 15588 acceptor_pool.cc:254] collecting diagnostics on the listening RPC socket unix:/tmp/dist-test-task7FCWj7/test-tmp/rpc-test-309b87ef5e1648b2a96ce81a6080a416.sock every 8 connection(s)
I20260924 15:19:59.734687 15589 acceptor_pool.cc:254] collecting diagnostics on the listening RPC socket unix:/tmp/dist-test-task7FCWj7/test-tmp/rpc-test-309b87ef5e1648b2a96ce81a6080a416.sock every 8 connection(s)
I20260924 15:19:59.734866 15126 rpc-test.cc:1846] Connecting to unix:/tmp/dist-test-task7FCWj7/test-tmp/rpc-test-309b87ef5e1648b2a96ce81a6080a416.sock
I20260924 15:20:01.059767 15126 rpc-test.cc:1859] Sending 1024MB via ssl-enabled unix socket: real 1.310s	user 1.501s	sys 0.832s
I20260924 15:20:02.311635 15126 rpc-test.cc:1859] Sending 1024MB via ssl-enabled unix socket: real 1.252s	user 1.391s	sys 0.863s
I20260924 15:20:03.512689 15126 rpc-test.cc:1859] Sending 1024MB via ssl-enabled unix socket: real 1.201s	user 1.318s	sys 0.847s
I20260924 15:20:04.778708 15126 rpc-test.cc:1859] Sending 1024MB via ssl-enabled unix socket: real 1.266s	user 1.394s	sys 0.886s
I20260924 15:20:06.042188 15126 rpc-test.cc:1859] Sending 1024MB via ssl-enabled unix socket: real 1.263s	user 1.357s	sys 0.904s
W20260924 15:20:06.042999 15585 connection.cc:196] Error closing socket: Network error: TlsSocket::Close: Broken pipe
[       OK ] Parameters/TestRpc.TestPerformanceBySocketType/SSL_UnixSocket (6338 ms)
[----------] 20 tests from Parameters/TestRpc (30058 ms total)

[----------] 1 test from Parameters/TestRpcSocketTxRxQueue
[ RUN      ] Parameters/TestRpcSocketTxRxQueue.AcceptorRxQueueSizeMetric/0
I20260924 15:20:06.049968 15614 acceptor_pool.cc:254] collecting diagnostics on the listening RPC socket 0.0.0.0:39761 every 1 connection(s)
I20260924 15:20:06.050047 15615 acceptor_pool.cc:254] collecting diagnostics on the listening RPC socket 0.0.0.0:39761 every 1 connection(s)
W20260924 15:20:06.050642 15610 negotiation.cc:337] Failed RPC negotiation. Trace:
0924 15:20:06.050495 (+     0us) reactor.cc:625] Submitting negotiation task for server connection from 127.0.0.1:55986 (local address 127.0.0.1:39761)
0924 15:20:06.050543 (+    48us) server_negotiation.cc:206] Beginning negotiation
0924 15:20:06.050546 (+     3us) server_negotiation.cc:399] Waiting for connection header
0924 15:20:06.050613 (+    67us) negotiation.cc:327] Negotiation complete: Network error: Server connection negotiation failed: server connection from 127.0.0.1:55986: BlockingRecv error: recv got EOF from 127.0.0.1:55986 (error 108)
Metrics: {"server-negotiator.queue_time_us":16}
[       OK ] Parameters/TestRpcSocketTxRxQueue.AcceptorRxQueueSizeMetric/0 (8 ms)
[----------] 1 test from Parameters/TestRpcSocketTxRxQueue (8 ms total)

[----------] Global test environment tear-down
[==========] 21 tests from 2 test suites ran. (30066 ms total)
[  PASSED  ] 20 tests.
[  FAILED  ] 1 test, listed below:
[  FAILED  ] Parameters/TestRpc.TestCallWithChainCertAndChainCA/SSL_UnixSocket, where GetParam() = (true, true)

 1 FAILED TEST