Diagnosed failure

Parameters/TestRpc.TestCallWithChainCertAndChainCA/SSL_TCP: /data0/somelongdirectorytoavoidrpathissues/src/kudu/src/kudu/rpc/rpc-test.cc:270: Failure
Failed
Bad status: Runtime error: could not verify certificate chain (error with cert: subject=CN = localhost, ST = sadfjas, C = AS, emailAddress = sdflkdsajf, O = lskdfjlsad, OU = sldfkja, issuer=C = AS, ST = ASDfkjdhf, L = lskdjf, O = saldfja, OU = skdjf, CN = localhost, emailAddress = sadjflkadsj): : certificate has expired
Google Test trace:
/data0/somelongdirectorytoavoidrpathissues/src/kudu/src/kudu/rpc/rpc-test.cc:267: Connecting to 0.0.0.0:37637
I20260928 06:10:39.962885 18665 test_util.cc:175] -----------------------------------------------
I20260928 06:10:39.962975 18665 test_util.cc:176] Had fatal failures, leaving test files at /tmp/dist-test-task10SdS6/test-tmp/rpc-test.5.Parameters_TestRpc.TestCallWithChainCertAndChainCA_SSL_TCP.1790575839864428-18665-0

Full log

Note: This is test shard 6 of 8.
[==========] Running 21 tests from 2 test suites.
[----------] Global test environment set-up.
[----------] 20 tests from Parameters/TestRpc
[ RUN      ] Parameters/TestRpc.TestMessengerCreateDestroy/SSL_TCP
WARNING: Logging before InitGoogleLogging() is written to STDERR
I20260928 06:10:39.906363 18665 rpc-test.cc:169] started messenger TestCreateDestroy
[       OK ] Parameters/TestRpc.TestMessengerCreateDestroy/SSL_TCP (35 ms)
[ RUN      ] Parameters/TestRpc.TestNegotiationDeadlock/SSL_TCP
I20260928 06:10:39.918293 18685 acceptor_pool.cc:254] collecting diagnostics on the listening RPC socket 0.0.0.0:37705 every 8 connection(s)
I20260928 06:10:39.918293 18686 acceptor_pool.cc:254] collecting diagnostics on the listening RPC socket 0.0.0.0:37705 every 8 connection(s)
[       OK ] Parameters/TestRpc.TestNegotiationDeadlock/SSL_TCP (22 ms)
[ RUN      ] Parameters/TestRpc.TestCallWithChainCertAndChainCA/SSL_TCP
I20260928 06:10:39.957504 18701 acceptor_pool.cc:254] collecting diagnostics on the listening RPC socket 0.0.0.0:37637 every 8 connection(s)
I20260928 06:10:39.957511 18702 acceptor_pool.cc:254] collecting diagnostics on the listening RPC socket 0.0.0.0:37637 every 8 connection(s)
/data0/somelongdirectorytoavoidrpathissues/src/kudu/src/kudu/rpc/rpc-test.cc:270: Failure
Failed
Bad status: Runtime error: could not verify certificate chain (error with cert: subject=CN = localhost, ST = sadfjas, C = AS, emailAddress = sdflkdsajf, O = lskdfjlsad, OU = sldfkja, issuer=C = AS, ST = ASDfkjdhf, L = lskdjf, O = saldfja, OU = skdjf, CN = localhost, emailAddress = sadjflkadsj): : certificate has expired
Google Test trace:
/data0/somelongdirectorytoavoidrpathissues/src/kudu/src/kudu/rpc/rpc-test.cc:267: Connecting to 0.0.0.0:37637
I20260928 06:10:39.962885 18665 test_util.cc:175] -----------------------------------------------
I20260928 06:10:39.962975 18665 test_util.cc:176] Had fatal failures, leaving test files at /tmp/dist-test-task10SdS6/test-tmp/rpc-test.5.Parameters_TestRpc.TestCallWithChainCertAndChainCA_SSL_TCP.1790575839864428-18665-0
[  FAILED  ] Parameters/TestRpc.TestCallWithChainCertAndChainCA/SSL_TCP, where GetParam() = (true, false) (32 ms)
[ RUN      ] Parameters/TestRpc.TestCallWithPasswordProtectedKey/SSL_TCP
I20260928 06:10:39.974254 18726 acceptor_pool.cc:254] collecting diagnostics on the listening RPC socket 0.0.0.0:38889 every 8 connection(s)
I20260928 06:10:39.974268 18727 acceptor_pool.cc:254] collecting diagnostics on the listening RPC socket 0.0.0.0:38889 every 8 connection(s)
[       OK ] Parameters/TestRpc.TestCallWithPasswordProtectedKey/SSL_TCP (28 ms)
[ RUN      ] Parameters/TestRpc.TestCallToBadServer/SSL_TCP
I20260928 06:10:40.003263 18665 rpc-test.cc:394] Status: Network error: Client connection negotiation failed: client connection to 0.0.0.0:0: connect: Connection refused (error 111)
I20260928 06:10:40.003819 18665 rpc-test.cc:394] Status: Network error: Client connection negotiation failed: client connection to 0.0.0.0:0: connect: Connection refused (error 111)
I20260928 06:10:40.004262 18665 rpc-test.cc:394] Status: Network error: Client connection negotiation failed: client connection to 0.0.0.0:0: connect: Connection refused (error 111)
I20260928 06:10:40.004666 18665 rpc-test.cc:394] Status: Network error: Client connection negotiation failed: client connection to 0.0.0.0:0: connect: Connection refused (error 111)
I20260928 06:10:40.005059 18665 rpc-test.cc:394] Status: Network error: Client connection negotiation failed: client connection to 0.0.0.0:0: connect: Connection refused (error 111)
[       OK ] Parameters/TestRpc.TestCallToBadServer/SSL_TCP (14 ms)
[ RUN      ] Parameters/TestRpc.TestWrongService/SSL_TCP
I20260928 06:10:40.016577 18761 acceptor_pool.cc:254] collecting diagnostics on the listening RPC socket 0.0.0.0:38221 every 8 connection(s)
I20260928 06:10:40.016602 18762 acceptor_pool.cc:254] collecting diagnostics on the listening RPC socket 0.0.0.0:38221 every 8 connection(s)
I20260928 06:10:40.033128 18759 messenger.cc:345] service WrongServiceName not registered on TestServer
[       OK ] Parameters/TestRpc.TestWrongService/SSL_TCP (29 ms)
[ RUN      ] Parameters/TestRpc.TestConnectionKeepalive/SSL_TCP
I20260928 06:10:40.050186 18784 acceptor_pool.cc:254] collecting diagnostics on the listening RPC socket 0.0.0.0:46267 every 8 connection(s)
I20260928 06:10:40.050235 18785 acceptor_pool.cc:254] collecting diagnostics on the listening RPC socket 0.0.0.0:46267 every 8 connection(s)
I20260928 06:10:40.050566 18665 rpc-test.cc:488] Connecting to 0.0.0.0:46267
[       OK ] Parameters/TestRpc.TestConnectionKeepalive/SSL_TCP (1032 ms)
[ RUN      ] Parameters/TestRpc.TestClientConnectionMetrics/SSL_TCP
I20260928 06:10:41.085022 18809 acceptor_pool.cc:254] collecting diagnostics on the listening RPC socket 0.0.0.0:35727 every 8 connection(s)
I20260928 06:10:41.085054 18810 acceptor_pool.cc:254] collecting diagnostics on the listening RPC socket 0.0.0.0:35727 every 8 connection(s)
I20260928 06:10:41.085417 18665 rpc-test.cc:569] Connecting to 0.0.0.0:35727
[       OK ] Parameters/TestRpc.TestClientConnectionMetrics/SSL_TCP (15223 ms)
[ RUN      ] Parameters/TestRpc.TestCredentialsPolicy/SSL_TCP
I20260928 06:10:56.309319 18832 acceptor_pool.cc:254] collecting diagnostics on the listening RPC socket 0.0.0.0:33991 every 8 connection(s)
I20260928 06:10:56.309332 18833 acceptor_pool.cc:254] collecting diagnostics on the listening RPC socket 0.0.0.0:33991 every 8 connection(s)
I20260928 06:10:56.309659 18665 rpc-test.cc:700] Connecting to 0.0.0.0:33991
[       OK ] Parameters/TestRpc.TestCredentialsPolicy/SSL_TCP (48 ms)
[ RUN      ] Parameters/TestRpc.TestCallLongerThanKeepalive/SSL_TCP
I20260928 06:10:56.360515 18857 acceptor_pool.cc:254] collecting diagnostics on the listening RPC socket 0.0.0.0:32879 every 8 connection(s)
I20260928 06:10:56.360544 18858 acceptor_pool.cc:254] collecting diagnostics on the listening RPC socket 0.0.0.0:32879 every 8 connection(s)
I20260928 06:10:56.378794 18861 rpc-test-base.h:222] got call: sleep_micros: 3000000 deferred: true
I20260928 06:10:59.379832 18861 rpcz_store.cc:275] Call kudu.rpc.GenericCalculatorService.Sleep from 127.0.0.1:53770 (request call id 0) took 3001 ms. Trace:
I20260928 06:10:59.379987 18861 rpcz_store.cc:276] 0928 06:10:56.378691 (+     0us) service_pool.cc:170] Inserting onto call queue
0928 06:10:56.378758 (+    67us) service_pool.cc:227] Handling call
0928 06:10:59.379803 (+3001045us) inbound_call.cc:173] Queueing success response
Metrics: {}
[       OK ] Parameters/TestRpc.TestCallLongerThanKeepalive/SSL_TCP (3042 ms)
[ RUN      ] Parameters/TestRpc.TestRpcSidecar/SSL_TCP
I20260928 06:10:59.394173 18882 acceptor_pool.cc:254] collecting diagnostics on the listening RPC socket 0.0.0.0:34961 every 8 connection(s)
I20260928 06:10:59.394323 18883 acceptor_pool.cc:254] collecting diagnostics on the listening RPC socket 0.0.0.0:34961 every 8 connection(s)
[       OK ] Parameters/TestRpc.TestRpcSidecar/SSL_TCP (67 ms)
[ RUN      ] Parameters/TestRpc.TestRpcSidecarLimits/SSL_TCP
I20260928 06:11:01.113574 18907 acceptor_pool.cc:254] collecting diagnostics on the listening RPC socket 0.0.0.0:41547 every 8 connection(s)
I20260928 06:11:01.113593 18908 acceptor_pool.cc:254] collecting diagnostics on the listening RPC socket 0.0.0.0:41547 every 8 connection(s)
W20260928 06:11:01.119930 18665 serialization.cc:72] Serialized kudu.rpc_test.PushStringsRequestPB (2147483654 bytes) is larger than the maximum configured RPC message size (52428800 bytes). Sending anyway, but peer may reject the data.
W20260928 06:11:01.124581 18905 connection.cc:535] server connection from 127.0.0.1:35630 recv error: Network error: RPC frame had a length of 2147483714, but we only support messages up to 52428800 bytes long.
W20260928 06:11:01.124679 18905 connection.cc:158] shutting down server connection from 127.0.0.1:35630 with pending inbound data: 4/2147483714 bytes received; last active 0 ns ago: status Network error: RPC frame had a length of 2147483714, but we only support messages up to 52428800 bytes long.
W20260928 06:11:01.125052 18920 connection.cc:196] Error closing socket: Network error: TlsSocket::Close: Connection reset by peer
I20260928 06:11:01.142942 18932 acceptor_pool.cc:254] collecting diagnostics on the listening RPC socket 0.0.0.0:38925 every 8 connection(s)
I20260928 06:11:01.142994 18933 acceptor_pool.cc:254] collecting diagnostics on the listening RPC socket 0.0.0.0:38925 every 8 connection(s)
W20260928 06:11:05.673477 18931 connection.cc:577] server connection from 127.0.0.1:49214: received bad data: 'Corruption: Invalid packet: message had a length of 2147483710, but we only support messages up to 2147483647 bytes
'
[       OK ] Parameters/TestRpc.TestRpcSidecarLimits/SSL_TCP (6224 ms)
[ RUN      ] Parameters/TestRpc.TestCallTimeoutDoesntAffectNegotiation/SSL_TCP
I20260928 06:11:05.696391 18957 acceptor_pool.cc:254] collecting diagnostics on the listening RPC socket 0.0.0.0:41849 every 8 connection(s)
I20260928 06:11:05.696950 18958 acceptor_pool.cc:254] collecting diagnostics on the listening RPC socket 0.0.0.0:41849 every 8 connection(s)
W20260928 06:11:05.706615 18953 negotiation.cc:266] Injecting 500ms delay in negotiation
I20260928 06:11:05.757072 18665 rpc-test-base.h:595] status: Timed out: connection negotiation to 0.0.0.0:41849 for RPC Sleep timed out after 0.050s (ON_OUTBOUND_QUEUE), seconds elapsed: 0.0509485
[       OK ] Parameters/TestRpc.TestCallTimeoutDoesntAffectNegotiation/SSL_TCP (537 ms)
[ RUN      ] Parameters/TestRpc.TestRpcHandlerLatencyMetric/SSL_TCP
I20260928 06:11:06.247464 18982 acceptor_pool.cc:254] collecting diagnostics on the listening RPC socket 0.0.0.0:43583 every 8 connection(s)
I20260928 06:11:06.247594 18983 acceptor_pool.cc:254] collecting diagnostics on the listening RPC socket 0.0.0.0:43583 every 8 connection(s)
I20260928 06:11:06.294379 18665 rpc-test.cc:1236] Sleep() min lat: 20452
I20260928 06:11:06.294466 18665 rpc-test.cc:1237] Sleep() mean lat: 20452
I20260928 06:11:06.294498 18665 rpc-test.cc:1238] Sleep() max lat: 20452
I20260928 06:11:06.294512 18665 rpc-test.cc:1239] Sleep() #calls: 1
[       OK ] Parameters/TestRpc.TestRpcHandlerLatencyMetric/SSL_TCP (83 ms)
[ RUN      ] Parameters/TestRpc.TimedOutOnResponseMetricServiceQueue/SSL_TCP
I20260928 06:11:06.325500 19008 acceptor_pool.cc:254] collecting diagnostics on the listening RPC socket 0.0.0.0:36009 every 8 connection(s)
I20260928 06:11:06.325587 19009 acceptor_pool.cc:254] collecting diagnostics on the listening RPC socket 0.0.0.0:36009 every 8 connection(s)
W20260928 06:11:06.383213 19010 rpcz_store.cc:267] Call kudu.rpc_test.CalculatorService.Sleep from 127.0.0.1:44014 (request call id 2) took 20 ms (client timeout 20 ms). Trace:
W20260928 06:11:06.383350 19010 rpcz_store.cc:269] 0928 06:11:06.362761 (+     0us) service_pool.cc:170] Inserting onto call queue
0928 06:11:06.383167 (+ 20406us) service_pool.cc:214] Skipping call since client already timed out
0928 06:11:06.383194 (+    27us) inbound_call.cc:173] Queueing failure response
Metrics: {}
[       OK ] Parameters/TestRpc.TimedOutOnResponseMetricServiceQueue/SSL_TCP (88 ms)
[ RUN      ] Parameters/TestRpc.RpcPendingConnectionsMetric/SSL_TCP
I20260928 06:11:06.388108 19031 acceptor_pool.cc:254] collecting diagnostics on the listening RPC socket 0.0.0.0:35793 every 8 connection(s)
I20260928 06:11:06.388183 19032 acceptor_pool.cc:254] collecting diagnostics on the listening RPC socket 0.0.0.0:35793 every 8 connection(s)
W20260928 06:11:06.389403 19027 negotiation.cc:337] Failed RPC negotiation. Trace:
0928 06:11:06.388893 (+     0us) reactor.cc:625] Submitting negotiation task for server connection from 127.0.0.1:43780 (local address 127.0.0.1:35793)
0928 06:11:06.389009 (+   116us) server_negotiation.cc:206] Beginning negotiation
0928 06:11:06.389013 (+     4us) server_negotiation.cc:399] Waiting for connection header
0928 06:11:06.389105 (+    92us) negotiation.cc:327] Negotiation complete: Network error: Server connection negotiation failed: server connection from 127.0.0.1:43780: BlockingRecv error: recv got EOF from 127.0.0.1:43780 (error 108)
Metrics: {"server-negotiator.queue_time_us":46}
[       OK ] Parameters/TestRpc.RpcPendingConnectionsMetric/SSL_TCP (14 ms)
[ RUN      ] Parameters/TestRpc.TestRpcContextClientDeadline/SSL_TCP
I20260928 06:11:06.413555 19047 acceptor_pool.cc:254] collecting diagnostics on the listening RPC socket 0.0.0.0:34349 every 8 connection(s)
I20260928 06:11:06.413568 19048 acceptor_pool.cc:254] collecting diagnostics on the listening RPC socket 0.0.0.0:34349 every 8 connection(s)
[       OK ] Parameters/TestRpc.TestRpcContextClientDeadline/SSL_TCP (65 ms)
[ RUN      ] Parameters/TestRpc.TestApplicationFeatureFlagUnsupportedServer/SSL_TCP
I20260928 06:11:06.479092 19072 acceptor_pool.cc:254] collecting diagnostics on the listening RPC socket 0.0.0.0:39085 every 8 connection(s)
I20260928 06:11:06.479122 19073 acceptor_pool.cc:254] collecting diagnostics on the listening RPC socket 0.0.0.0:39085 every 8 connection(s)
[       OK ] Parameters/TestRpc.TestApplicationFeatureFlagUnsupportedServer/SSL_TCP (40 ms)
[ RUN      ] Parameters/TestRpc.TestCancellationAsync/SSL_TCP
I20260928 06:11:06.516968 19097 acceptor_pool.cc:254] collecting diagnostics on the listening RPC socket 0.0.0.0:42041 every 8 connection(s)
I20260928 06:11:06.517102 19098 acceptor_pool.cc:254] collecting diagnostics on the listening RPC socket 0.0.0.0:42041 every 8 connection(s)
I20260928 06:11:06.517454 18665 rpc-test.cc:1716] Connecting to 0.0.0.0:42041
I20260928 06:11:06.529572 18665 test_util.cc:268] Using random seed: -294140128
I20260928 06:11:06.548283 19101 rpc-test-base.h:240] got call: sleep_micros: 500 pattern: 4294967295 num_repetitions: 2097152 sidecar_idx: 0
I20260928 06:11:06.569479 19100 rpc-test-base.h:240] got call: sleep_micros: 500 pattern: 4294967295 num_repetitions: 2097152 sidecar_idx: 0
I20260928 06:11:06.587148 19101 rpc-test-base.h:240] got call: sleep_micros: 500 pattern: 4294967295 num_repetitions: 2097152 sidecar_idx: 0
I20260928 06:11:06.605582 19100 rpc-test-base.h:240] got call: sleep_micros: 500 pattern: 4294967295 num_repetitions: 2097152 sidecar_idx: 0
I20260928 06:11:06.623270 19101 rpc-test-base.h:240] got call: sleep_micros: 500 pattern: 4294967295 num_repetitions: 2097152 sidecar_idx: 0
I20260928 06:11:06.647820 19101 rpc-test-base.h:240] got call: sleep_micros: 500 pattern: 4294967295 num_repetitions: 2097152 sidecar_idx: 0
I20260928 06:11:06.664978 19100 rpc-test-base.h:240] got call: sleep_micros: 500 pattern: 4294967295 num_repetitions: 2097152 sidecar_idx: 0
I20260928 06:11:06.688349 19100 rpc-test-base.h:240] got call: sleep_micros: 500 pattern: 4294967295 num_repetitions: 2097152 sidecar_idx: 0
W20260928 06:11:06.706425 19094 connection.cc:441] server connection from 127.0.0.1:34822 torn down before Call kudu.rpc.GenericCalculatorService.SleepWithSidecar from 127.0.0.1:34822 (request call id 9) could send its response
[       OK ] Parameters/TestRpc.TestCancellationAsync/SSL_TCP (201 ms)
[ RUN      ] Parameters/TestRpc.TestPerformanceBySocketType/SSL_TCP
I20260928 06:11:06.727773 19122 acceptor_pool.cc:254] collecting diagnostics on the listening RPC socket 0.0.0.0:40483 every 8 connection(s)
I20260928 06:11:06.727783 19123 acceptor_pool.cc:254] collecting diagnostics on the listening RPC socket 0.0.0.0:40483 every 8 connection(s)
I20260928 06:11:06.728085 18665 rpc-test.cc:1846] Connecting to 0.0.0.0:40483
I20260928 06:11:09.175848 18665 rpc-test.cc:1859] Sending 1024MB via ssl-enabled tcp socket: real 2.430s	user 2.592s	sys 1.679s
I20260928 06:11:11.591576 18665 rpc-test.cc:1859] Sending 1024MB via ssl-enabled tcp socket: real 2.416s	user 2.533s	sys 1.703s
I20260928 06:11:13.961107 18665 rpc-test.cc:1859] Sending 1024MB via ssl-enabled tcp socket: real 2.369s	user 2.531s	sys 1.619s
I20260928 06:11:16.194877 18665 rpc-test.cc:1859] Sending 1024MB via ssl-enabled tcp socket: real 2.234s	user 2.275s	sys 1.629s
I20260928 06:11:18.545956 18665 rpc-test.cc:1859] Sending 1024MB via ssl-enabled tcp socket: real 2.351s	user 2.477s	sys 1.650s
[       OK ] Parameters/TestRpc.TestPerformanceBySocketType/SSL_TCP (11840 ms)
[----------] 20 tests from Parameters/TestRpc (38675 ms total)

[----------] 1 test from Parameters/TestRpcSocketTxRxQueue
[ RUN      ] Parameters/TestRpcSocketTxRxQueue.OverCapacity/0
W20260928 06:11:18.819448 19139 negotiation.cc:337] Failed RPC negotiation. Trace:
0928 06:11:18.550865 (+     0us) reactor.cc:625] Submitting negotiation task for client connection to 0.0.0.0:37133 (local address 127.0.0.1:49378)
0928 06:11:18.551004 (+   139us) negotiation.cc:107] Waiting for socket to connect
0928 06:11:18.551021 (+    17us) client_negotiation.cc:174] Beginning negotiation
0928 06:11:18.551124 (+   103us) client_negotiation.cc:252] Sending NEGOTIATE NegotiatePB request
0928 06:11:18.819302 (+268178us) negotiation.cc:327] Negotiation complete: Network error: Client connection negotiation failed: client connection to 0.0.0.0:37133: BlockingRecv error: recv error from unknown peer: Transport endpoint is not connected (error 107)
Metrics: {"client-negotiator.queue_time_us":50}
W20260928 06:11:18.819504 19148 negotiation.cc:337] Failed RPC negotiation. Trace:
0928 06:11:18.552152 (+     0us) reactor.cc:625] Submitting negotiation task for client connection to 0.0.0.0:37133 (local address 127.0.0.1:49384)
0928 06:11:18.552305 (+   153us) negotiation.cc:107] Waiting for socket to connect
0928 06:11:18.552318 (+    13us) client_negotiation.cc:174] Beginning negotiation
0928 06:11:18.552426 (+   108us) client_negotiation.cc:252] Sending NEGOTIATE NegotiatePB request
0928 06:11:18.819382 (+266956us) negotiation.cc:327] Negotiation complete: Network error: Client connection negotiation failed: client connection to 0.0.0.0:37133: BlockingRecv error: recv error from unknown peer: Transport endpoint is not connected (error 107)
Metrics: {"client-negotiator.queue_time_us":56}
W20260928 06:11:18.819682 19184 negotiation.cc:337] Failed RPC negotiation. Trace:
0928 06:11:18.557474 (+     0us) reactor.cc:625] Submitting negotiation task for client connection to 0.0.0.0:37133 (local address 127.0.0.1:49424)
0928 06:11:18.557601 (+   127us) negotiation.cc:107] Waiting for socket to connect
0928 06:11:18.557616 (+    15us) client_negotiation.cc:174] Beginning negotiation
0928 06:11:18.557703 (+    87us) client_negotiation.cc:252] Sending NEGOTIATE NegotiatePB request
0928 06:11:18.819603 (+261900us) negotiation.cc:327] Negotiation complete: Network error: Client connection negotiation failed: client connection to 0.0.0.0:37133: BlockingRecv error: recv error from unknown peer: Transport endpoint is not connected (error 107)
Metrics: {"client-negotiator.queue_time_us":54}
W20260928 06:11:18.819901 19157 negotiation.cc:337] Failed RPC negotiation. Trace:
0928 06:11:18.553457 (+     0us) reactor.cc:625] Submitting negotiation task for client connection to 0.0.0.0:37133 (local address 127.0.0.1:49400)
0928 06:11:18.553582 (+   125us) negotiation.cc:107] Waiting for socket to connect
0928 06:11:18.553593 (+    11us) client_negotiation.cc:174] Beginning negotiation
0928 06:11:18.553684 (+    91us) client_negotiation.cc:252] Sending NEGOTIATE NegotiatePB request
0928 06:11:18.819382 (+265698us) negotiation.cc:327] Negotiation complete: Network error: Client connection negotiation failed: client connection to 0.0.0.0:37133: BlockingRecv error: recv error from unknown peer: Transport endpoint is not connected (error 107)
Metrics: {"client-negotiator.queue_time_us":28}
W20260928 06:11:18.819926 19166 negotiation.cc:337] Failed RPC negotiation. Trace:
0928 06:11:18.554619 (+     0us) reactor.cc:625] Submitting negotiation task for client connection to 0.0.0.0:37133 (local address 127.0.0.1:49406)
0928 06:11:18.554753 (+   134us) negotiation.cc:107] Waiting for socket to connect
0928 06:11:18.554765 (+    12us) client_negotiation.cc:174] Beginning negotiation
0928 06:11:18.554842 (+    77us) client_negotiation.cc:252] Sending NEGOTIATE NegotiatePB request
0928 06:11:18.819302 (+264460us) negotiation.cc:327] Negotiation complete: Network error: Client connection negotiation failed: client connection to 0.0.0.0:37133: BlockingRecv error: recv error from unknown peer: Transport endpoint is not connected (error 107)
Metrics: {"client-negotiator.queue_time_us":45}
W20260928 06:11:18.819926 19173 negotiation.cc:337] Failed RPC negotiation. Trace:
0928 06:11:18.556007 (+     0us) reactor.cc:625] Submitting negotiation task for client connection to 0.0.0.0:37133 (local address 127.0.0.1:49410)
0928 06:11:18.556137 (+   130us) negotiation.cc:107] Waiting for socket to connect
0928 06:11:18.556149 (+    12us) client_negotiation.cc:174] Beginning negotiation
0928 06:11:18.556235 (+    86us) client_negotiation.cc:252] Sending NEGOTIATE NegotiatePB request
0928 06:11:18.819458 (+263223us) negotiation.cc:327] Negotiation complete: Network error: Client connection negotiation failed: client connection to 0.0.0.0:37133: BlockingRecv error: recv error from unknown peer: Transport endpoint is not connected (error 107)
Metrics: {"client-negotiator.queue_time_us":48}
[       OK ] Parameters/TestRpcSocketTxRxQueue.OverCapacity/0 (1034 ms)
[----------] 1 test from Parameters/TestRpcSocketTxRxQueue (1034 ms total)

[----------] Global test environment tear-down
[==========] 21 tests from 2 test suites ran. (39710 ms total)
[  PASSED  ] 20 tests.
[  FAILED  ] 1 test, listed below:
[  FAILED  ] Parameters/TestRpc.TestCallWithChainCertAndChainCA/SSL_TCP, where GetParam() = (true, false)

 1 FAILED TEST