Diagnosed failure

Parameters/TestRpc.TestCallWithChainCertAndChainCA/SSL_TCP: /data0/somelongdirectorytoavoidrpathissues/src/kudu/src/kudu/rpc/rpc-test.cc:270: Failure
Failed
Bad status: Runtime error: could not verify certificate chain (error with cert: subject=CN = localhost, ST = sadfjas, C = AS, emailAddress = sdflkdsajf, O = lskdfjlsad, OU = sldfkja, issuer=C = AS, ST = ASDfkjdhf, L = lskdjf, O = saldfja, OU = skdjf, CN = localhost, emailAddress = sadjflkadsj): : certificate has expired
Google Test trace:
/data0/somelongdirectorytoavoidrpathissues/src/kudu/src/kudu/rpc/rpc-test.cc:267: Connecting to 0.0.0.0:41365
I20260924 23:04:54.552772   383 test_util.cc:175] -----------------------------------------------
I20260924 23:04:54.552827   383 test_util.cc:176] Had fatal failures, leaving test files at /tmp/dist-test-taskhSWH4h/test-tmp/rpc-test.5.Parameters_TestRpc.TestCallWithChainCertAndChainCA_SSL_TCP.1790291094462853-383-0

Full log

Note: This is test shard 6 of 8.
[==========] Running 21 tests from 2 test suites.
[----------] Global test environment set-up.
[----------] 20 tests from Parameters/TestRpc
[ RUN      ] Parameters/TestRpc.TestMessengerCreateDestroy/SSL_TCP
WARNING: Logging before InitGoogleLogging() is written to STDERR
I20260924 23:04:54.481195   383 rpc-test.cc:169] started messenger TestCreateDestroy
[       OK ] Parameters/TestRpc.TestMessengerCreateDestroy/SSL_TCP (16 ms)
[ RUN      ] Parameters/TestRpc.TestNegotiationDeadlock/SSL_TCP
I20260924 23:04:54.495772   403 acceptor_pool.cc:254] collecting diagnostics on the listening RPC socket 0.0.0.0:32965 every 8 connection(s)
I20260924 23:04:54.495790   404 acceptor_pool.cc:254] collecting diagnostics on the listening RPC socket 0.0.0.0:32965 every 8 connection(s)
[       OK ] Parameters/TestRpc.TestNegotiationDeadlock/SSL_TCP (23 ms)
[ RUN      ] Parameters/TestRpc.TestCallWithChainCertAndChainCA/SSL_TCP
I20260924 23:04:54.547894   419 acceptor_pool.cc:254] collecting diagnostics on the listening RPC socket 0.0.0.0:41365 every 8 connection(s)
I20260924 23:04:54.548348   420 acceptor_pool.cc:254] collecting diagnostics on the listening RPC socket 0.0.0.0:41365 every 8 connection(s)
/data0/somelongdirectorytoavoidrpathissues/src/kudu/src/kudu/rpc/rpc-test.cc:270: Failure
Failed
Bad status: Runtime error: could not verify certificate chain (error with cert: subject=CN = localhost, ST = sadfjas, C = AS, emailAddress = sdflkdsajf, O = lskdfjlsad, OU = sldfkja, issuer=C = AS, ST = ASDfkjdhf, L = lskdjf, O = saldfja, OU = skdjf, CN = localhost, emailAddress = sadjflkadsj): : certificate has expired
Google Test trace:
/data0/somelongdirectorytoavoidrpathissues/src/kudu/src/kudu/rpc/rpc-test.cc:267: Connecting to 0.0.0.0:41365
I20260924 23:04:54.552772   383 test_util.cc:175] -----------------------------------------------
I20260924 23:04:54.552827   383 test_util.cc:176] Had fatal failures, leaving test files at /tmp/dist-test-taskhSWH4h/test-tmp/rpc-test.5.Parameters_TestRpc.TestCallWithChainCertAndChainCA_SSL_TCP.1790291094462853-383-0
[  FAILED  ] Parameters/TestRpc.TestCallWithChainCertAndChainCA/SSL_TCP, where GetParam() = (true, false) (47 ms)
[ RUN      ] Parameters/TestRpc.TestCallWithPasswordProtectedKey/SSL_TCP
I20260924 23:04:54.574574   445 acceptor_pool.cc:254] collecting diagnostics on the listening RPC socket 0.0.0.0:35767 every 8 connection(s)
I20260924 23:04:54.574666   444 acceptor_pool.cc:254] collecting diagnostics on the listening RPC socket 0.0.0.0:35767 every 8 connection(s)
[       OK ] Parameters/TestRpc.TestCallWithPasswordProtectedKey/SSL_TCP (36 ms)
[ RUN      ] Parameters/TestRpc.TestCallToBadServer/SSL_TCP
I20260924 23:04:54.599459   383 rpc-test.cc:394] Status: Network error: Client connection negotiation failed: client connection to 0.0.0.0:0: connect: Connection refused (error 111)
I20260924 23:04:54.599794   383 rpc-test.cc:394] Status: Network error: Client connection negotiation failed: client connection to 0.0.0.0:0: connect: Connection refused (error 111)
I20260924 23:04:54.600023   383 rpc-test.cc:394] Status: Network error: Client connection negotiation failed: client connection to 0.0.0.0:0: connect: Connection refused (error 111)
I20260924 23:04:54.600221   383 rpc-test.cc:394] Status: Network error: Client connection negotiation failed: client connection to 0.0.0.0:0: connect: Connection refused (error 111)
I20260924 23:04:54.600394   383 rpc-test.cc:394] Status: Network error: Client connection negotiation failed: client connection to 0.0.0.0:0: connect: Connection refused (error 111)
[       OK ] Parameters/TestRpc.TestCallToBadServer/SSL_TCP (11 ms)
[ RUN      ] Parameters/TestRpc.TestWrongService/SSL_TCP
I20260924 23:04:54.607779   479 acceptor_pool.cc:254] collecting diagnostics on the listening RPC socket 0.0.0.0:40577 every 8 connection(s)
I20260924 23:04:54.607795   480 acceptor_pool.cc:254] collecting diagnostics on the listening RPC socket 0.0.0.0:40577 every 8 connection(s)
I20260924 23:04:54.621946   477 messenger.cc:345] service WrongServiceName not registered on TestServer
[       OK ] Parameters/TestRpc.TestWrongService/SSL_TCP (23 ms)
[ RUN      ] Parameters/TestRpc.TestConnectionKeepalive/SSL_TCP
I20260924 23:04:54.636461   502 acceptor_pool.cc:254] collecting diagnostics on the listening RPC socket 0.0.0.0:37909 every 8 connection(s)
I20260924 23:04:54.636508   503 acceptor_pool.cc:254] collecting diagnostics on the listening RPC socket 0.0.0.0:37909 every 8 connection(s)
I20260924 23:04:54.636613   383 rpc-test.cc:488] Connecting to 0.0.0.0:37909
[       OK ] Parameters/TestRpc.TestConnectionKeepalive/SSL_TCP (1029 ms)
[ RUN      ] Parameters/TestRpc.TestClientConnectionMetrics/SSL_TCP
I20260924 23:04:55.661564   527 acceptor_pool.cc:254] collecting diagnostics on the listening RPC socket 0.0.0.0:43251 every 8 connection(s)
I20260924 23:04:55.661728   383 rpc-test.cc:569] Connecting to 0.0.0.0:43251
I20260924 23:04:55.661801   528 acceptor_pool.cc:254] collecting diagnostics on the listening RPC socket 0.0.0.0:43251 every 8 connection(s)
[       OK ] Parameters/TestRpc.TestClientConnectionMetrics/SSL_TCP (8297 ms)
[ RUN      ] Parameters/TestRpc.TestCredentialsPolicy/SSL_TCP
I20260924 23:05:03.976147   550 acceptor_pool.cc:254] collecting diagnostics on the listening RPC socket 0.0.0.0:38645 every 8 connection(s)
I20260924 23:05:03.976173   551 acceptor_pool.cc:254] collecting diagnostics on the listening RPC socket 0.0.0.0:38645 every 8 connection(s)
I20260924 23:05:03.976320   383 rpc-test.cc:700] Connecting to 0.0.0.0:38645
[       OK ] Parameters/TestRpc.TestCredentialsPolicy/SSL_TCP (45 ms)
[ RUN      ] Parameters/TestRpc.TestCallLongerThanKeepalive/SSL_TCP
I20260924 23:05:04.006088   575 acceptor_pool.cc:254] collecting diagnostics on the listening RPC socket 0.0.0.0:44757 every 8 connection(s)
I20260924 23:05:04.006119   576 acceptor_pool.cc:254] collecting diagnostics on the listening RPC socket 0.0.0.0:44757 every 8 connection(s)
I20260924 23:05:04.033160   579 rpc-test-base.h:222] got call: sleep_micros: 3000000 deferred: true
I20260924 23:05:07.033921   579 rpcz_store.cc:275] Call kudu.rpc.GenericCalculatorService.Sleep from 127.0.0.1:45638 (request call id 0) took 3000 ms. Trace:
I20260924 23:05:07.034034   579 rpcz_store.cc:276] 0924 23:05:04.033119 (+     0us) service_pool.cc:170] Inserting onto call queue
0924 23:05:04.033139 (+    20us) service_pool.cc:227] Handling call
0924 23:05:07.033905 (+3000766us) inbound_call.cc:173] Queueing success response
Metrics: {}
[       OK ] Parameters/TestRpc.TestCallLongerThanKeepalive/SSL_TCP (3039 ms)
[ RUN      ] Parameters/TestRpc.TestRpcSidecar/SSL_TCP
I20260924 23:05:07.053795   600 acceptor_pool.cc:254] collecting diagnostics on the listening RPC socket 0.0.0.0:36079 every 8 connection(s)
I20260924 23:05:07.053813   601 acceptor_pool.cc:254] collecting diagnostics on the listening RPC socket 0.0.0.0:36079 every 8 connection(s)
[       OK ] Parameters/TestRpc.TestRpcSidecar/SSL_TCP (58 ms)
[ RUN      ] Parameters/TestRpc.TestRpcSidecarLimits/SSL_TCP
I20260924 23:05:08.809015   625 acceptor_pool.cc:254] collecting diagnostics on the listening RPC socket 0.0.0.0:36245 every 8 connection(s)
I20260924 23:05:08.809059   626 acceptor_pool.cc:254] collecting diagnostics on the listening RPC socket 0.0.0.0:36245 every 8 connection(s)
W20260924 23:05:08.819303   383 serialization.cc:72] Serialized kudu.rpc_test.PushStringsRequestPB (2147483654 bytes) is larger than the maximum configured RPC message size (52428800 bytes). Sending anyway, but peer may reject the data.
W20260924 23:05:08.822568   622 connection.cc:535] server connection from 127.0.0.1:43698 recv error: Network error: RPC frame had a length of 2147483714, but we only support messages up to 52428800 bytes long.
W20260924 23:05:08.822647   622 connection.cc:158] shutting down server connection from 127.0.0.1:43698 with pending inbound data: 4/2147483714 bytes received; last active 0 ns ago: status Network error: RPC frame had a length of 2147483714, but we only support messages up to 52428800 bytes long.
W20260924 23:05:08.822893   638 connection.cc:196] Error closing socket: Network error: TlsSocket::Close: Connection reset by peer
I20260924 23:05:08.838155   650 acceptor_pool.cc:254] collecting diagnostics on the listening RPC socket 0.0.0.0:35561 every 8 connection(s)
I20260924 23:05:08.838158   651 acceptor_pool.cc:254] collecting diagnostics on the listening RPC socket 0.0.0.0:35561 every 8 connection(s)
W20260924 23:05:12.632436   647 connection.cc:577] server connection from 127.0.0.1:41718: received bad data: 'Corruption: Invalid packet: message had a length of 2147483710, but we only support messages up to 2147483647 bytes
'
[       OK ] Parameters/TestRpc.TestRpcSidecarLimits/SSL_TCP (5539 ms)
[ RUN      ] Parameters/TestRpc.TestCallTimeoutDoesntAffectNegotiation/SSL_TCP
I20260924 23:05:12.676618   675 acceptor_pool.cc:254] collecting diagnostics on the listening RPC socket 0.0.0.0:37059 every 8 connection(s)
I20260924 23:05:12.676661   676 acceptor_pool.cc:254] collecting diagnostics on the listening RPC socket 0.0.0.0:37059 every 8 connection(s)
W20260924 23:05:12.688609   671 negotiation.cc:266] Injecting 500ms delay in negotiation
I20260924 23:05:12.738888   383 rpc-test-base.h:595] status: Timed out: connection negotiation to 0.0.0.0:37059 for RPC Sleep timed out after 0.050s (ON_OUTBOUND_QUEUE), seconds elapsed: 0.0507554
[       OK ] Parameters/TestRpc.TestCallTimeoutDoesntAffectNegotiation/SSL_TCP (558 ms)
[ RUN      ] Parameters/TestRpc.TestRpcHandlerLatencyMetric/SSL_TCP
I20260924 23:05:13.205760   700 acceptor_pool.cc:254] collecting diagnostics on the listening RPC socket 0.0.0.0:41711 every 8 connection(s)
I20260924 23:05:13.205817   701 acceptor_pool.cc:254] collecting diagnostics on the listening RPC socket 0.0.0.0:41711 every 8 connection(s)
I20260924 23:05:13.236299   383 rpc-test.cc:1236] Sleep() min lat: 20319
I20260924 23:05:13.236373   383 rpc-test.cc:1237] Sleep() mean lat: 20319
I20260924 23:05:13.236409   383 rpc-test.cc:1238] Sleep() max lat: 20319
I20260924 23:05:13.236423   383 rpc-test.cc:1239] Sleep() #calls: 1
[       OK ] Parameters/TestRpc.TestRpcHandlerLatencyMetric/SSL_TCP (44 ms)
[ RUN      ] Parameters/TestRpc.TimedOutOnResponseMetricServiceQueue/SSL_TCP
I20260924 23:05:13.244210   726 acceptor_pool.cc:254] collecting diagnostics on the listening RPC socket 0.0.0.0:44877 every 8 connection(s)
I20260924 23:05:13.244246   727 acceptor_pool.cc:254] collecting diagnostics on the listening RPC socket 0.0.0.0:44877 every 8 connection(s)
W20260924 23:05:13.298765   728 rpcz_store.cc:267] Call kudu.rpc_test.CalculatorService.Sleep from 127.0.0.1:45418 (request call id 2) took 20 ms (client timeout 20 ms). Trace:
W20260924 23:05:13.298902   728 rpcz_store.cc:269] 0924 23:05:13.278470 (+     0us) service_pool.cc:170] Inserting onto call queue
0924 23:05:13.298742 (+ 20272us) service_pool.cc:214] Skipping call since client already timed out
0924 23:05:13.298752 (+    10us) inbound_call.cc:173] Queueing failure response
Metrics: {}
[       OK ] Parameters/TestRpc.TimedOutOnResponseMetricServiceQueue/SSL_TCP (62 ms)
[ RUN      ] Parameters/TestRpc.RpcPendingConnectionsMetric/SSL_TCP
I20260924 23:05:13.301895   749 acceptor_pool.cc:254] collecting diagnostics on the listening RPC socket 0.0.0.0:39645 every 8 connection(s)
I20260924 23:05:13.301909   750 acceptor_pool.cc:254] collecting diagnostics on the listening RPC socket 0.0.0.0:39645 every 8 connection(s)
W20260924 23:05:13.310070   745 negotiation.cc:337] Failed RPC negotiation. Trace:
0924 23:05:13.309881 (+     0us) reactor.cc:625] Submitting negotiation task for server connection from 127.0.0.1:44068 (local address 127.0.0.1:39645)
0924 23:05:13.309932 (+    51us) server_negotiation.cc:206] Beginning negotiation
0924 23:05:13.309934 (+     2us) server_negotiation.cc:399] Waiting for connection header
0924 23:05:13.310003 (+    69us) negotiation.cc:327] Negotiation complete: Network error: Server connection negotiation failed: server connection from 127.0.0.1:44068: BlockingRecv error: recv got EOF from 127.0.0.1:44068 (error 108)
Metrics: {"server-negotiator.queue_time_us":18}
[       OK ] Parameters/TestRpc.RpcPendingConnectionsMetric/SSL_TCP (21 ms)
[ RUN      ] Parameters/TestRpc.TestRpcContextClientDeadline/SSL_TCP
I20260924 23:05:13.361608   765 acceptor_pool.cc:254] collecting diagnostics on the listening RPC socket 0.0.0.0:37785 every 8 connection(s)
I20260924 23:05:13.361632   766 acceptor_pool.cc:254] collecting diagnostics on the listening RPC socket 0.0.0.0:37785 every 8 connection(s)
[       OK ] Parameters/TestRpc.TestRpcContextClientDeadline/SSL_TCP (76 ms)
[ RUN      ] Parameters/TestRpc.TestApplicationFeatureFlagUnsupportedServer/SSL_TCP
I20260924 23:05:13.411631   790 acceptor_pool.cc:254] collecting diagnostics on the listening RPC socket 0.0.0.0:41573 every 8 connection(s)
I20260924 23:05:13.411648   791 acceptor_pool.cc:254] collecting diagnostics on the listening RPC socket 0.0.0.0:41573 every 8 connection(s)
[       OK ] Parameters/TestRpc.TestApplicationFeatureFlagUnsupportedServer/SSL_TCP (36 ms)
[ RUN      ] Parameters/TestRpc.TestCancellationAsync/SSL_TCP
I20260924 23:05:13.463119   815 acceptor_pool.cc:254] collecting diagnostics on the listening RPC socket 0.0.0.0:43583 every 8 connection(s)
I20260924 23:05:13.463256   383 rpc-test.cc:1716] Connecting to 0.0.0.0:43583
I20260924 23:05:13.463151   816 acceptor_pool.cc:254] collecting diagnostics on the listening RPC socket 0.0.0.0:43583 every 8 connection(s)
I20260924 23:05:13.471558   383 test_util.cc:268] Using random seed: -1579356604
I20260924 23:05:13.491281   818 rpc-test-base.h:240] got call: sleep_micros: 500 pattern: 4294967295 num_repetitions: 2097152 sidecar_idx: 0
I20260924 23:05:13.505950   818 rpc-test-base.h:240] got call: sleep_micros: 500 pattern: 4294967295 num_repetitions: 2097152 sidecar_idx: 0
I20260924 23:05:13.523137   818 rpc-test-base.h:240] got call: sleep_micros: 500 pattern: 4294967295 num_repetitions: 2097152 sidecar_idx: 0
I20260924 23:05:13.538259   818 rpc-test-base.h:240] got call: sleep_micros: 500 pattern: 4294967295 num_repetitions: 2097152 sidecar_idx: 0
I20260924 23:05:13.551429   818 rpc-test-base.h:240] got call: sleep_micros: 500 pattern: 4294967295 num_repetitions: 2097152 sidecar_idx: 0
I20260924 23:05:13.565575   818 rpc-test-base.h:240] got call: sleep_micros: 500 pattern: 4294967295 num_repetitions: 2097152 sidecar_idx: 0
I20260924 23:05:13.579457   818 rpc-test-base.h:240] got call: sleep_micros: 500 pattern: 4294967295 num_repetitions: 2097152 sidecar_idx: 0
I20260924 23:05:13.593024   818 rpc-test-base.h:240] got call: sleep_micros: 500 pattern: 4294967295 num_repetitions: 2097152 sidecar_idx: 0
W20260924 23:05:13.596444   812 connection.cc:441] server connection from 127.0.0.1:39042 torn down before Call kudu.rpc.GenericCalculatorService.SleepWithSidecar from 127.0.0.1:39042 (request call id 9) could send its response
[       OK ] Parameters/TestRpc.TestCancellationAsync/SSL_TCP (163 ms)
[ RUN      ] Parameters/TestRpc.TestPerformanceBySocketType/SSL_TCP
I20260924 23:05:13.608127   840 acceptor_pool.cc:254] collecting diagnostics on the listening RPC socket 0.0.0.0:36943 every 8 connection(s)
I20260924 23:05:13.608135   841 acceptor_pool.cc:254] collecting diagnostics on the listening RPC socket 0.0.0.0:36943 every 8 connection(s)
I20260924 23:05:13.608258   383 rpc-test.cc:1846] Connecting to 0.0.0.0:36943
I20260924 23:05:15.346510   383 rpc-test.cc:1859] Sending 1024MB via ssl-enabled tcp socket: real 1.730s	user 1.693s	sys 1.345s
I20260924 23:05:17.035238   383 rpc-test.cc:1859] Sending 1024MB via ssl-enabled tcp socket: real 1.689s	user 1.506s	sys 1.452s
I20260924 23:05:18.745903   383 rpc-test.cc:1859] Sending 1024MB via ssl-enabled tcp socket: real 1.711s	user 1.555s	sys 1.434s
I20260924 23:05:20.450991   383 rpc-test.cc:1859] Sending 1024MB via ssl-enabled tcp socket: real 1.705s	user 1.575s	sys 1.411s
I20260924 23:05:22.106596   383 rpc-test.cc:1859] Sending 1024MB via ssl-enabled tcp socket: real 1.655s	user 1.540s	sys 1.359s
[       OK ] Parameters/TestRpc.TestPerformanceBySocketType/SSL_TCP (8510 ms)
[----------] 20 tests from Parameters/TestRpc (27642 ms total)

[----------] 1 test from Parameters/TestRpcSocketTxRxQueue
[ RUN      ] Parameters/TestRpcSocketTxRxQueue.OverCapacity/0
W20260924 23:05:22.376914   857 negotiation.cc:337] Failed RPC negotiation. Trace:
0924 23:05:22.114132 (+     0us) reactor.cc:625] Submitting negotiation task for client connection to 0.0.0.0:38929 (local address 127.0.0.1:34600)
0924 23:05:22.114196 (+    64us) negotiation.cc:107] Waiting for socket to connect
0924 23:05:22.114207 (+    11us) client_negotiation.cc:174] Beginning negotiation
0924 23:05:22.114259 (+    52us) client_negotiation.cc:252] Sending NEGOTIATE NegotiatePB request
0924 23:05:22.376780 (+262521us) negotiation.cc:327] Negotiation complete: Network error: Client connection negotiation failed: client connection to 0.0.0.0:38929: BlockingRecv error: recv error from unknown peer: Transport endpoint is not connected (error 107)
Metrics: {"client-negotiator.queue_time_us":37}
W20260924 23:05:22.376993   902 negotiation.cc:337] Failed RPC negotiation. Trace:
0924 23:05:22.118532 (+     0us) reactor.cc:625] Submitting negotiation task for client connection to 0.0.0.0:38929 (local address 127.0.0.1:34642)
0924 23:05:22.118570 (+    38us) negotiation.cc:107] Waiting for socket to connect
0924 23:05:22.118577 (+     7us) client_negotiation.cc:174] Beginning negotiation
0924 23:05:22.118614 (+    37us) client_negotiation.cc:252] Sending NEGOTIATE NegotiatePB request
0924 23:05:22.376958 (+258344us) negotiation.cc:327] Negotiation complete: Network error: Client connection negotiation failed: client connection to 0.0.0.0:38929: BlockingRecv error: recv error from unknown peer: Transport endpoint is not connected (error 107)
Metrics: {"client-negotiator.queue_time_us":18}
W20260924 23:05:22.377110   893 negotiation.cc:337] Failed RPC negotiation. Trace:
0924 23:05:22.117732 (+     0us) reactor.cc:625] Submitting negotiation task for client connection to 0.0.0.0:38929 (local address 127.0.0.1:34634)
0924 23:05:22.117819 (+    87us) negotiation.cc:107] Waiting for socket to connect
0924 23:05:22.117830 (+    11us) client_negotiation.cc:174] Beginning negotiation
0924 23:05:22.117876 (+    46us) client_negotiation.cc:252] Sending NEGOTIATE NegotiatePB request
0924 23:05:22.377082 (+259206us) negotiation.cc:327] Negotiation complete: Network error: Client connection negotiation failed: client connection to 0.0.0.0:38929: BlockingRecv error: recv error from unknown peer: Transport endpoint is not connected (error 107)
Metrics: {"client-negotiator.queue_time_us":64}
W20260924 23:05:22.377203   884 negotiation.cc:337] Failed RPC negotiation. Trace:
0924 23:05:22.116851 (+     0us) reactor.cc:625] Submitting negotiation task for client connection to 0.0.0.0:38929 (local address 127.0.0.1:34626)
0924 23:05:22.116888 (+    37us) negotiation.cc:107] Waiting for socket to connect
0924 23:05:22.116895 (+     7us) client_negotiation.cc:174] Beginning negotiation
0924 23:05:22.116930 (+    35us) client_negotiation.cc:252] Sending NEGOTIATE NegotiatePB request
0924 23:05:22.376790 (+259860us) negotiation.cc:327] Negotiation complete: Network error: Client connection negotiation failed: client connection to 0.0.0.0:38929: BlockingRecv error: recv error from unknown peer: Transport endpoint is not connected (error 107)
Metrics: {"client-negotiator.queue_time_us":18}
W20260924 23:05:22.376919   875 negotiation.cc:337] Failed RPC negotiation. Trace:
0924 23:05:22.116042 (+     0us) reactor.cc:625] Submitting negotiation task for client connection to 0.0.0.0:38929 (local address 127.0.0.1:34614)
0924 23:05:22.116079 (+    37us) negotiation.cc:107] Waiting for socket to connect
0924 23:05:22.116087 (+     8us) client_negotiation.cc:174] Beginning negotiation
0924 23:05:22.116126 (+    39us) client_negotiation.cc:252] Sending NEGOTIATE NegotiatePB request
0924 23:05:22.376810 (+260684us) negotiation.cc:327] Negotiation complete: Network error: Client connection negotiation failed: client connection to 0.0.0.0:38929: BlockingRecv error: recv error from unknown peer: Transport endpoint is not connected (error 107)
Metrics: {"client-negotiator.queue_time_us":18}
W20260924 23:05:22.376924   866 negotiation.cc:337] Failed RPC negotiation. Trace:
0924 23:05:22.115133 (+     0us) reactor.cc:625] Submitting negotiation task for client connection to 0.0.0.0:38929 (local address 127.0.0.1:34610)
0924 23:05:22.115198 (+    65us) negotiation.cc:107] Waiting for socket to connect
0924 23:05:22.115208 (+    10us) client_negotiation.cc:174] Beginning negotiation
0924 23:05:22.115251 (+    43us) client_negotiation.cc:252] Sending NEGOTIATE NegotiatePB request
0924 23:05:22.376809 (+261558us) negotiation.cc:327] Negotiation complete: Network error: Client connection negotiation failed: client connection to 0.0.0.0:38929: BlockingRecv error: recv error from unknown peer: Transport endpoint is not connected (error 107)
Metrics: {"client-negotiator.queue_time_us":42}
[       OK ] Parameters/TestRpcSocketTxRxQueue.OverCapacity/0 (1030 ms)
[----------] 1 test from Parameters/TestRpcSocketTxRxQueue (1030 ms total)

[----------] Global test environment tear-down
[==========] 21 tests from 2 test suites ran. (28673 ms total)
[  PASSED  ] 20 tests.
[  FAILED  ] 1 test, listed below:
[  FAILED  ] Parameters/TestRpc.TestCallWithChainCertAndChainCA/SSL_TCP, where GetParam() = (true, false)

 1 FAILED TEST