Diagnosed failure

Parameters/TestRpc.TestCallWithChainCertAndChainCA/SSL_TCP: /data0/somelongdirectorytoavoidrpathissues/src/kudu/src/kudu/rpc/rpc-test.cc:270: Failure
Failed
Bad status: Runtime error: could not verify certificate chain (error with cert: subject=CN = localhost, ST = sadfjas, C = AS, emailAddress = sdflkdsajf, O = lskdfjlsad, OU = sldfkja, issuer=C = AS, ST = ASDfkjdhf, L = lskdjf, O = saldfja, OU = skdjf, CN = localhost, emailAddress = sadjflkadsj): : certificate has expired
Google Test trace:
/data0/somelongdirectorytoavoidrpathissues/src/kudu/src/kudu/rpc/rpc-test.cc:267: Connecting to 0.0.0.0:38221
I20260928 22:45:50.523556  1487 test_util.cc:175] -----------------------------------------------
I20260928 22:45:50.523624  1487 test_util.cc:176] Had fatal failures, leaving test files at /tmp/dist-test-task7cO5nY/test-tmp/rpc-test.5.Parameters_TestRpc.TestCallWithChainCertAndChainCA_SSL_TCP.1790635550449915-1487-0

Full log

Note: This is test shard 6 of 8.
[==========] Running 21 tests from 2 test suites.
[----------] Global test environment set-up.
[----------] 20 tests from Parameters/TestRpc
[ RUN      ] Parameters/TestRpc.TestMessengerCreateDestroy/SSL_TCP
WARNING: Logging before InitGoogleLogging() is written to STDERR
I20260928 22:45:50.489717  1487 rpc-test.cc:169] started messenger TestCreateDestroy
[       OK ] Parameters/TestRpc.TestMessengerCreateDestroy/SSL_TCP (38 ms)
[ RUN      ] Parameters/TestRpc.TestNegotiationDeadlock/SSL_TCP
I20260928 22:45:50.498427  1507 acceptor_pool.cc:254] collecting diagnostics on the listening RPC socket 0.0.0.0:44897 every 8 connection(s)
I20260928 22:45:50.498440  1508 acceptor_pool.cc:254] collecting diagnostics on the listening RPC socket 0.0.0.0:44897 every 8 connection(s)
[       OK ] Parameters/TestRpc.TestNegotiationDeadlock/SSL_TCP (14 ms)
[ RUN      ] Parameters/TestRpc.TestCallWithChainCertAndChainCA/SSL_TCP
I20260928 22:45:50.519647  1523 acceptor_pool.cc:254] collecting diagnostics on the listening RPC socket 0.0.0.0:38221 every 8 connection(s)
I20260928 22:45:50.519676  1524 acceptor_pool.cc:254] collecting diagnostics on the listening RPC socket 0.0.0.0:38221 every 8 connection(s)
/data0/somelongdirectorytoavoidrpathissues/src/kudu/src/kudu/rpc/rpc-test.cc:270: Failure
Failed
Bad status: Runtime error: could not verify certificate chain (error with cert: subject=CN = localhost, ST = sadfjas, C = AS, emailAddress = sdflkdsajf, O = lskdfjlsad, OU = sldfkja, issuer=C = AS, ST = ASDfkjdhf, L = lskdjf, O = saldfja, OU = skdjf, CN = localhost, emailAddress = sadjflkadsj): : certificate has expired
Google Test trace:
/data0/somelongdirectorytoavoidrpathissues/src/kudu/src/kudu/rpc/rpc-test.cc:267: Connecting to 0.0.0.0:38221
I20260928 22:45:50.523556  1487 test_util.cc:175] -----------------------------------------------
I20260928 22:45:50.523624  1487 test_util.cc:176] Had fatal failures, leaving test files at /tmp/dist-test-task7cO5nY/test-tmp/rpc-test.5.Parameters_TestRpc.TestCallWithChainCertAndChainCA_SSL_TCP.1790635550449915-1487-0
[  FAILED  ] Parameters/TestRpc.TestCallWithChainCertAndChainCA/SSL_TCP, where GetParam() = (true, false) (17 ms)
[ RUN      ] Parameters/TestRpc.TestCallWithPasswordProtectedKey/SSL_TCP
I20260928 22:45:50.530848  1548 acceptor_pool.cc:254] collecting diagnostics on the listening RPC socket 0.0.0.0:34369 every 8 connection(s)
I20260928 22:45:50.530912  1549 acceptor_pool.cc:254] collecting diagnostics on the listening RPC socket 0.0.0.0:34369 every 8 connection(s)
[       OK ] Parameters/TestRpc.TestCallWithPasswordProtectedKey/SSL_TCP (20 ms)
[ RUN      ] Parameters/TestRpc.TestCallToBadServer/SSL_TCP
I20260928 22:45:50.577939  1487 rpc-test.cc:394] Status: Network error: Client connection negotiation failed: client connection to 0.0.0.0:0: connect: Connection refused (error 111)
I20260928 22:45:50.578269  1487 rpc-test.cc:394] Status: Network error: Client connection negotiation failed: client connection to 0.0.0.0:0: connect: Connection refused (error 111)
I20260928 22:45:50.578521  1487 rpc-test.cc:394] Status: Network error: Client connection negotiation failed: client connection to 0.0.0.0:0: connect: Connection refused (error 111)
I20260928 22:45:50.578737  1487 rpc-test.cc:394] Status: Network error: Client connection negotiation failed: client connection to 0.0.0.0:0: connect: Connection refused (error 111)
I20260928 22:45:50.578936  1487 rpc-test.cc:394] Status: Network error: Client connection negotiation failed: client connection to 0.0.0.0:0: connect: Connection refused (error 111)
[       OK ] Parameters/TestRpc.TestCallToBadServer/SSL_TCP (35 ms)
[ RUN      ] Parameters/TestRpc.TestWrongService/SSL_TCP
I20260928 22:45:50.588737  1583 acceptor_pool.cc:254] collecting diagnostics on the listening RPC socket 0.0.0.0:45885 every 8 connection(s)
I20260928 22:45:50.588754  1584 acceptor_pool.cc:254] collecting diagnostics on the listening RPC socket 0.0.0.0:45885 every 8 connection(s)
I20260928 22:45:50.608682  1581 messenger.cc:345] service WrongServiceName not registered on TestServer
[       OK ] Parameters/TestRpc.TestWrongService/SSL_TCP (30 ms)
[ RUN      ] Parameters/TestRpc.TestConnectionKeepalive/SSL_TCP
I20260928 22:45:50.629891  1606 acceptor_pool.cc:254] collecting diagnostics on the listening RPC socket 0.0.0.0:35985 every 8 connection(s)
I20260928 22:45:50.629927  1607 acceptor_pool.cc:254] collecting diagnostics on the listening RPC socket 0.0.0.0:35985 every 8 connection(s)
I20260928 22:45:50.630089  1487 rpc-test.cc:488] Connecting to 0.0.0.0:35985
[       OK ] Parameters/TestRpc.TestConnectionKeepalive/SSL_TCP (1051 ms)
[ RUN      ] Parameters/TestRpc.TestClientConnectionMetrics/SSL_TCP
I20260928 22:45:51.667917  1631 acceptor_pool.cc:254] collecting diagnostics on the listening RPC socket 0.0.0.0:44045 every 8 connection(s)
I20260928 22:45:51.667968  1632 acceptor_pool.cc:254] collecting diagnostics on the listening RPC socket 0.0.0.0:44045 every 8 connection(s)
I20260928 22:45:51.668112  1487 rpc-test.cc:569] Connecting to 0.0.0.0:44045
[       OK ] Parameters/TestRpc.TestClientConnectionMetrics/SSL_TCP (8718 ms)
[ RUN      ] Parameters/TestRpc.TestCredentialsPolicy/SSL_TCP
I20260928 22:46:00.390970  1654 acceptor_pool.cc:254] collecting diagnostics on the listening RPC socket 0.0.0.0:40277 every 8 connection(s)
I20260928 22:46:00.391040  1655 acceptor_pool.cc:254] collecting diagnostics on the listening RPC socket 0.0.0.0:40277 every 8 connection(s)
I20260928 22:46:00.391248  1487 rpc-test.cc:700] Connecting to 0.0.0.0:40277
[       OK ] Parameters/TestRpc.TestCredentialsPolicy/SSL_TCP (41 ms)
[ RUN      ] Parameters/TestRpc.TestCallLongerThanKeepalive/SSL_TCP
I20260928 22:46:00.436110  1679 acceptor_pool.cc:254] collecting diagnostics on the listening RPC socket 0.0.0.0:35055 every 8 connection(s)
I20260928 22:46:00.436151  1680 acceptor_pool.cc:254] collecting diagnostics on the listening RPC socket 0.0.0.0:35055 every 8 connection(s)
I20260928 22:46:00.447286  1683 rpc-test-base.h:222] got call: sleep_micros: 3000000 deferred: true
I20260928 22:46:03.447940  1683 rpcz_store.cc:275] Call kudu.rpc.GenericCalculatorService.Sleep from 127.0.0.1:35166 (request call id 0) took 3000 ms. Trace:
I20260928 22:46:03.448047  1683 rpcz_store.cc:276] 0928 22:46:00.447233 (+     0us) service_pool.cc:170] Inserting onto call queue
0928 22:46:00.447270 (+    37us) service_pool.cc:227] Handling call
0928 22:46:03.447924 (+3000654us) inbound_call.cc:173] Queueing success response
Metrics: {}
[       OK ] Parameters/TestRpc.TestCallLongerThanKeepalive/SSL_TCP (3028 ms)
[ RUN      ] Parameters/TestRpc.TestRpcSidecar/SSL_TCP
I20260928 22:46:03.473142  1704 acceptor_pool.cc:254] collecting diagnostics on the listening RPC socket 0.0.0.0:46029 every 8 connection(s)
I20260928 22:46:03.473222  1705 acceptor_pool.cc:254] collecting diagnostics on the listening RPC socket 0.0.0.0:46029 every 8 connection(s)
[       OK ] Parameters/TestRpc.TestRpcSidecar/SSL_TCP (75 ms)
[ RUN      ] Parameters/TestRpc.TestRpcSidecarLimits/SSL_TCP
I20260928 22:46:05.269078  1729 acceptor_pool.cc:254] collecting diagnostics on the listening RPC socket 0.0.0.0:43869 every 8 connection(s)
I20260928 22:46:05.269125  1730 acceptor_pool.cc:254] collecting diagnostics on the listening RPC socket 0.0.0.0:43869 every 8 connection(s)
W20260928 22:46:05.273914  1487 serialization.cc:72] Serialized kudu.rpc_test.PushStringsRequestPB (2147483654 bytes) is larger than the maximum configured RPC message size (52428800 bytes). Sending anyway, but peer may reject the data.
W20260928 22:46:05.277268  1726 connection.cc:535] server connection from 127.0.0.1:45046 recv error: Network error: RPC frame had a length of 2147483714, but we only support messages up to 52428800 bytes long.
W20260928 22:46:05.277318  1726 connection.cc:158] shutting down server connection from 127.0.0.1:45046 with pending inbound data: 4/2147483714 bytes received; last active 0 ns ago: status Network error: RPC frame had a length of 2147483714, but we only support messages up to 52428800 bytes long.
W20260928 22:46:05.277539  1742 connection.cc:196] Error closing socket: Network error: TlsSocket::Close: Connection reset by peer
I20260928 22:46:05.295823  1754 acceptor_pool.cc:254] collecting diagnostics on the listening RPC socket 0.0.0.0:44859 every 8 connection(s)
I20260928 22:46:05.295879  1755 acceptor_pool.cc:254] collecting diagnostics on the listening RPC socket 0.0.0.0:44859 every 8 connection(s)
W20260928 22:46:09.168382  1753 connection.cc:577] server connection from 127.0.0.1:46212: received bad data: 'Corruption: Invalid packet: message had a length of 2147483710, but we only support messages up to 2147483647 bytes
'
[       OK ] Parameters/TestRpc.TestRpcSidecarLimits/SSL_TCP (5644 ms)
[ RUN      ] Parameters/TestRpc.TestCallTimeoutDoesntAffectNegotiation/SSL_TCP
I20260928 22:46:09.188534  1779 acceptor_pool.cc:254] collecting diagnostics on the listening RPC socket 0.0.0.0:39081 every 8 connection(s)
I20260928 22:46:09.188637  1780 acceptor_pool.cc:254] collecting diagnostics on the listening RPC socket 0.0.0.0:39081 every 8 connection(s)
W20260928 22:46:09.200184  1775 negotiation.cc:266] Injecting 500ms delay in negotiation
I20260928 22:46:09.250517  1487 rpc-test-base.h:595] status: Timed out: connection negotiation to 0.0.0.0:39081 for RPC Sleep timed out after 0.050s (ON_OUTBOUND_QUEUE), seconds elapsed: 0.0506872
[       OK ] Parameters/TestRpc.TestCallTimeoutDoesntAffectNegotiation/SSL_TCP (534 ms)
[ RUN      ] Parameters/TestRpc.TestRpcHandlerLatencyMetric/SSL_TCP
I20260928 22:46:09.726083  1804 acceptor_pool.cc:254] collecting diagnostics on the listening RPC socket 0.0.0.0:42859 every 8 connection(s)
I20260928 22:46:09.726122  1805 acceptor_pool.cc:254] collecting diagnostics on the listening RPC socket 0.0.0.0:42859 every 8 connection(s)
I20260928 22:46:09.761786  1487 rpc-test.cc:1236] Sleep() min lat: 20276
I20260928 22:46:09.761863  1487 rpc-test.cc:1237] Sleep() mean lat: 20276
I20260928 22:46:09.761895  1487 rpc-test.cc:1238] Sleep() max lat: 20276
I20260928 22:46:09.761909  1487 rpc-test.cc:1239] Sleep() #calls: 1
[       OK ] Parameters/TestRpc.TestRpcHandlerLatencyMetric/SSL_TCP (58 ms)
[ RUN      ] Parameters/TestRpc.TimedOutOnResponseMetricServiceQueue/SSL_TCP
I20260928 22:46:09.768801  1830 acceptor_pool.cc:254] collecting diagnostics on the listening RPC socket 0.0.0.0:39029 every 8 connection(s)
I20260928 22:46:09.768828  1831 acceptor_pool.cc:254] collecting diagnostics on the listening RPC socket 0.0.0.0:39029 every 8 connection(s)
W20260928 22:46:09.822580  1832 rpcz_store.cc:267] Call kudu.rpc_test.CalculatorService.Sleep from 127.0.0.1:53484 (request call id 2) took 20 ms (client timeout 20 ms). Trace:
W20260928 22:46:09.822702  1832 rpcz_store.cc:269] 0928 22:46:09.802294 (+     0us) service_pool.cc:170] Inserting onto call queue
0928 22:46:09.822560 (+ 20266us) service_pool.cc:214] Skipping call since client already timed out
0928 22:46:09.822568 (+     8us) inbound_call.cc:173] Queueing failure response
Metrics: {}
[       OK ] Parameters/TestRpc.TimedOutOnResponseMetricServiceQueue/SSL_TCP (60 ms)
[ RUN      ] Parameters/TestRpc.RpcPendingConnectionsMetric/SSL_TCP
I20260928 22:46:09.826016  1853 acceptor_pool.cc:254] collecting diagnostics on the listening RPC socket 0.0.0.0:45447 every 8 connection(s)
I20260928 22:46:09.826093  1854 acceptor_pool.cc:254] collecting diagnostics on the listening RPC socket 0.0.0.0:45447 every 8 connection(s)
W20260928 22:46:09.835263  1849 negotiation.cc:337] Failed RPC negotiation. Trace:
0928 22:46:09.834993 (+     0us) reactor.cc:625] Submitting negotiation task for server connection from 127.0.0.1:39572 (local address 127.0.0.1:45447)
0928 22:46:09.835081 (+    88us) server_negotiation.cc:206] Beginning negotiation
0928 22:46:09.835083 (+     2us) server_negotiation.cc:399] Waiting for connection header
0928 22:46:09.835177 (+    94us) negotiation.cc:327] Negotiation complete: Network error: Server connection negotiation failed: server connection from 127.0.0.1:39572: BlockingRecv error: recv got EOF from 127.0.0.1:39572 (error 108)
Metrics: {"server-negotiator.queue_time_us":50}
[       OK ] Parameters/TestRpc.RpcPendingConnectionsMetric/SSL_TCP (21 ms)
[ RUN      ] Parameters/TestRpc.TestRpcContextClientDeadline/SSL_TCP
I20260928 22:46:09.855921  1869 acceptor_pool.cc:254] collecting diagnostics on the listening RPC socket 0.0.0.0:41603 every 8 connection(s)
I20260928 22:46:09.855971  1870 acceptor_pool.cc:254] collecting diagnostics on the listening RPC socket 0.0.0.0:41603 every 8 connection(s)
[       OK ] Parameters/TestRpc.TestRpcContextClientDeadline/SSL_TCP (55 ms)
[ RUN      ] Parameters/TestRpc.TestApplicationFeatureFlagUnsupportedServer/SSL_TCP
I20260928 22:46:09.929266  1894 acceptor_pool.cc:254] collecting diagnostics on the listening RPC socket 0.0.0.0:45069 every 8 connection(s)
I20260928 22:46:09.929343  1895 acceptor_pool.cc:254] collecting diagnostics on the listening RPC socket 0.0.0.0:45069 every 8 connection(s)
[       OK ] Parameters/TestRpc.TestApplicationFeatureFlagUnsupportedServer/SSL_TCP (54 ms)
[ RUN      ] Parameters/TestRpc.TestCancellationAsync/SSL_TCP
I20260928 22:46:09.965699  1919 acceptor_pool.cc:254] collecting diagnostics on the listening RPC socket 0.0.0.0:45689 every 8 connection(s)
I20260928 22:46:09.965750  1920 acceptor_pool.cc:254] collecting diagnostics on the listening RPC socket 0.0.0.0:45689 every 8 connection(s)
I20260928 22:46:09.965909  1487 rpc-test.cc:1716] Connecting to 0.0.0.0:45689
I20260928 22:46:09.978190  1487 test_util.cc:268] Using random seed: -720233652
I20260928 22:46:09.996768  1923 rpc-test-base.h:240] got call: sleep_micros: 500 pattern: 4294967295 num_repetitions: 2097152 sidecar_idx: 0
I20260928 22:46:10.007906  1923 rpc-test-base.h:240] got call: sleep_micros: 500 pattern: 4294967295 num_repetitions: 2097152 sidecar_idx: 0
I20260928 22:46:10.019510  1923 rpc-test-base.h:240] got call: sleep_micros: 500 pattern: 4294967295 num_repetitions: 2097152 sidecar_idx: 0
I20260928 22:46:10.031118  1923 rpc-test-base.h:240] got call: sleep_micros: 500 pattern: 4294967295 num_repetitions: 2097152 sidecar_idx: 0
I20260928 22:46:10.043401  1923 rpc-test-base.h:240] got call: sleep_micros: 500 pattern: 4294967295 num_repetitions: 2097152 sidecar_idx: 0
I20260928 22:46:10.060209  1923 rpc-test-base.h:240] got call: sleep_micros: 500 pattern: 4294967295 num_repetitions: 2097152 sidecar_idx: 0
I20260928 22:46:10.077989  1923 rpc-test-base.h:240] got call: sleep_micros: 500 pattern: 4294967295 num_repetitions: 2097152 sidecar_idx: 0
I20260928 22:46:10.095963  1923 rpc-test-base.h:240] got call: sleep_micros: 500 pattern: 4294967295 num_repetitions: 2097152 sidecar_idx: 0
W20260928 22:46:10.099177  1916 connection.cc:441] server connection from 127.0.0.1:53340 torn down before Call kudu.rpc.GenericCalculatorService.SleepWithSidecar from 127.0.0.1:53340 (request call id 9) could send its response
[       OK ] Parameters/TestRpc.TestCancellationAsync/SSL_TCP (143 ms)
[ RUN      ] Parameters/TestRpc.TestPerformanceBySocketType/SSL_TCP
I20260928 22:46:10.131584  1944 acceptor_pool.cc:254] collecting diagnostics on the listening RPC socket 0.0.0.0:39989 every 8 connection(s)
I20260928 22:46:10.131630  1945 acceptor_pool.cc:254] collecting diagnostics on the listening RPC socket 0.0.0.0:39989 every 8 connection(s)
I20260928 22:46:10.131778  1487 rpc-test.cc:1846] Connecting to 0.0.0.0:39989
I20260928 22:46:11.717511  1487 rpc-test.cc:1859] Sending 1024MB via ssl-enabled tcp socket: real 1.577s	user 1.436s	sys 1.386s
I20260928 22:46:13.357487  1487 rpc-test.cc:1859] Sending 1024MB via ssl-enabled tcp socket: real 1.640s	user 1.462s	sys 1.456s
I20260928 22:46:14.988619  1487 rpc-test.cc:1859] Sending 1024MB via ssl-enabled tcp socket: real 1.631s	user 1.501s	sys 1.410s
I20260928 22:46:16.648684  1487 rpc-test.cc:1859] Sending 1024MB via ssl-enabled tcp socket: real 1.660s	user 1.443s	sys 1.517s
I20260928 22:46:18.304546  1487 rpc-test.cc:1859] Sending 1024MB via ssl-enabled tcp socket: real 1.656s	user 1.523s	sys 1.427s
[       OK ] Parameters/TestRpc.TestPerformanceBySocketType/SSL_TCP (8207 ms)
[----------] 20 tests from Parameters/TestRpc (27855 ms total)

[----------] 1 test from Parameters/TestRpcSocketTxRxQueue
[ RUN      ] Parameters/TestRpcSocketTxRxQueue.OverCapacity/0
W20260928 22:46:18.579715  1997 negotiation.cc:337] Failed RPC negotiation. Trace:
0928 22:46:18.320328 (+     0us) reactor.cc:625] Submitting negotiation task for client connection to 0.0.0.0:34881 (local address 127.0.0.1:57976)
0928 22:46:18.320390 (+    62us) negotiation.cc:107] Waiting for socket to connect
0928 22:46:18.320398 (+     8us) client_negotiation.cc:174] Beginning negotiation
0928 22:46:18.320436 (+    38us) client_negotiation.cc:252] Sending NEGOTIATE NegotiatePB request
0928 22:46:18.579668 (+259232us) negotiation.cc:327] Negotiation complete: Network error: Client connection negotiation failed: client connection to 0.0.0.0:34881: BlockingRecv error: recv error from unknown peer: Transport endpoint is not connected (error 107)
Metrics: {"client-negotiator.queue_time_us":40}
W20260928 22:46:18.579715  2006 negotiation.cc:337] Failed RPC negotiation. Trace:
0928 22:46:18.321270 (+     0us) reactor.cc:625] Submitting negotiation task for client connection to 0.0.0.0:34881 (local address 127.0.0.1:57986)
0928 22:46:18.321313 (+    43us) negotiation.cc:107] Waiting for socket to connect
0928 22:46:18.321321 (+     8us) client_negotiation.cc:174] Beginning negotiation
0928 22:46:18.321376 (+    55us) client_negotiation.cc:252] Sending NEGOTIATE NegotiatePB request
0928 22:46:18.579661 (+258285us) negotiation.cc:327] Negotiation complete: Network error: Client connection negotiation failed: client connection to 0.0.0.0:34881: BlockingRecv error: recv error from unknown peer: Transport endpoint is not connected (error 107)
Metrics: {"client-negotiator.queue_time_us":17}
W20260928 22:46:18.579718  1961 negotiation.cc:337] Failed RPC negotiation. Trace:
0928 22:46:18.316404 (+     0us) reactor.cc:625] Submitting negotiation task for client connection to 0.0.0.0:34881 (local address 127.0.0.1:57920)
0928 22:46:18.316484 (+    80us) negotiation.cc:107] Waiting for socket to connect
0928 22:46:18.316496 (+    12us) client_negotiation.cc:174] Beginning negotiation
0928 22:46:18.316558 (+    62us) client_negotiation.cc:252] Sending NEGOTIATE NegotiatePB request
0928 22:46:18.579584 (+263026us) negotiation.cc:327] Negotiation complete: Network error: Client connection negotiation failed: client connection to 0.0.0.0:34881: BlockingRecv error: recv error from unknown peer: Transport endpoint is not connected (error 107)
Metrics: {"client-negotiator.queue_time_us":43}
W20260928 22:46:18.580001  1979 negotiation.cc:337] Failed RPC negotiation. Trace:
0928 22:46:18.318482 (+     0us) reactor.cc:625] Submitting negotiation task for client connection to 0.0.0.0:34881 (local address 127.0.0.1:57948)
0928 22:46:18.318541 (+    59us) negotiation.cc:107] Waiting for socket to connect
0928 22:46:18.318551 (+    10us) client_negotiation.cc:174] Beginning negotiation
0928 22:46:18.318593 (+    42us) client_negotiation.cc:252] Sending NEGOTIATE NegotiatePB request
0928 22:46:18.579584 (+260991us) negotiation.cc:327] Negotiation complete: Network error: Client connection negotiation failed: client connection to 0.0.0.0:34881: BlockingRecv error: recv error from unknown peer: Transport endpoint is not connected (error 107)
Metrics: {"client-negotiator.queue_time_us":34}
W20260928 22:46:18.579717  1970 negotiation.cc:337] Failed RPC negotiation. Trace:
0928 22:46:18.317488 (+     0us) reactor.cc:625] Submitting negotiation task for client connection to 0.0.0.0:34881 (local address 127.0.0.1:57936)
0928 22:46:18.317551 (+    63us) negotiation.cc:107] Waiting for socket to connect
0928 22:46:18.317562 (+    11us) client_negotiation.cc:174] Beginning negotiation
0928 22:46:18.317611 (+    49us) client_negotiation.cc:252] Sending NEGOTIATE NegotiatePB request
0928 22:46:18.579572 (+261961us) negotiation.cc:327] Negotiation complete: Network error: Client connection negotiation failed: client connection to 0.0.0.0:34881: BlockingRecv error: recv error from unknown peer: Transport endpoint is not connected (error 107)
Metrics: {"client-negotiator.queue_time_us":34}
W20260928 22:46:18.580175  1988 negotiation.cc:337] Failed RPC negotiation. Trace:
0928 22:46:18.319464 (+     0us) reactor.cc:625] Submitting negotiation task for client connection to 0.0.0.0:34881 (local address 127.0.0.1:57962)
0928 22:46:18.319499 (+    35us) negotiation.cc:107] Waiting for socket to connect
0928 22:46:18.319508 (+     9us) client_negotiation.cc:174] Beginning negotiation
0928 22:46:18.319551 (+    43us) client_negotiation.cc:252] Sending NEGOTIATE NegotiatePB request
0928 22:46:18.579572 (+260021us) negotiation.cc:327] Negotiation complete: Network error: Client connection negotiation failed: client connection to 0.0.0.0:34881: BlockingRecv error: recv error from unknown peer: Transport endpoint is not connected (error 107)
Metrics: {"client-negotiator.queue_time_us":16}
[       OK ] Parameters/TestRpcSocketTxRxQueue.OverCapacity/0 (1033 ms)
[----------] 1 test from Parameters/TestRpcSocketTxRxQueue (1033 ms total)

[----------] Global test environment tear-down
[==========] 21 tests from 2 test suites ran. (28889 ms total)
[  PASSED  ] 20 tests.
[  FAILED  ] 1 test, listed below:
[  FAILED  ] Parameters/TestRpc.TestCallWithChainCertAndChainCA/SSL_TCP, where GetParam() = (true, false)

 1 FAILED TEST