Diagnosed failure
Parameters/TestRpc.TestCallWithChainCertAndChainCA/SSL_UnixSocket: /data0/somelongdirectorytoavoidrpathissues/src/kudu/src/kudu/rpc/rpc-test.cc:270: Failure
Failed
Bad status: Runtime error: could not verify certificate chain (error with cert: subject=CN = localhost, ST = sadfjas, C = AS, emailAddress = sdflkdsajf, O = lskdfjlsad, OU = sldfkja, issuer=C = AS, ST = ASDfkjdhf, L = lskdjf, O = saldfja, OU = skdjf, CN = localhost, emailAddress = sadjflkadsj): : certificate has expired
Google Test trace:
/data0/somelongdirectorytoavoidrpathissues/src/kudu/src/kudu/rpc/rpc-test.cc:267: Connecting to unix:/tmp/dist-test-taskOpr5ap/test-tmp/rpc-test-b68351efe20946f7ba7672da09649a48.sock
I20260923 19:30:55.433784 379 test_util.cc:175] -----------------------------------------------
I20260923 19:30:55.433892 379 test_util.cc:176] Had fatal failures, leaving test files at /tmp/dist-test-taskOpr5ap/test-tmp/rpc-test.6.Parameters_TestRpc.TestCallWithChainCertAndChainCA_SSL_UnixSocket.1790191855287239-379-0
Full log
Note: This is test shard 7 of 8.
[==========] Running 21 tests from 2 test suites.
[----------] Global test environment set-up.
[----------] 20 tests from Parameters/TestRpc
[ RUN ] Parameters/TestRpc.TestMessengerCreateDestroy/SSL_UnixSocket
WARNING: Logging before InitGoogleLogging() is written to STDERR
I20260923 19:30:55.340421 379 rpc-test.cc:169] started messenger TestCreateDestroy
[ OK ] Parameters/TestRpc.TestMessengerCreateDestroy/SSL_UnixSocket (35 ms)
[ RUN ] Parameters/TestRpc.TestNegotiationDeadlock/SSL_UnixSocket
I20260923 19:30:55.383466 399 acceptor_pool.cc:254] collecting diagnostics on the listening RPC socket unix:/tmp/dist-test-taskOpr5ap/test-tmp/rpc-test-063253103ff947e1adf58cf80feb8580.sock every 8 connection(s)
I20260923 19:30:55.383760 400 acceptor_pool.cc:254] collecting diagnostics on the listening RPC socket unix:/tmp/dist-test-taskOpr5ap/test-tmp/rpc-test-063253103ff947e1adf58cf80feb8580.sock every 8 connection(s)
[ OK ] Parameters/TestRpc.TestNegotiationDeadlock/SSL_UnixSocket (59 ms)
[ RUN ] Parameters/TestRpc.TestCallWithChainCertAndChainCA/SSL_UnixSocket
I20260923 19:30:55.421537 415 acceptor_pool.cc:254] collecting diagnostics on the listening RPC socket unix:/tmp/dist-test-taskOpr5ap/test-tmp/rpc-test-b68351efe20946f7ba7672da09649a48.sock every 8 connection(s)
I20260923 19:30:55.421922 416 acceptor_pool.cc:254] collecting diagnostics on the listening RPC socket unix:/tmp/dist-test-taskOpr5ap/test-tmp/rpc-test-b68351efe20946f7ba7672da09649a48.sock every 8 connection(s)
/data0/somelongdirectorytoavoidrpathissues/src/kudu/src/kudu/rpc/rpc-test.cc:270: Failure
Failed
Bad status: Runtime error: could not verify certificate chain (error with cert: subject=CN = localhost, ST = sadfjas, C = AS, emailAddress = sdflkdsajf, O = lskdfjlsad, OU = sldfkja, issuer=C = AS, ST = ASDfkjdhf, L = lskdjf, O = saldfja, OU = skdjf, CN = localhost, emailAddress = sadjflkadsj): : certificate has expired
Google Test trace:
/data0/somelongdirectorytoavoidrpathissues/src/kudu/src/kudu/rpc/rpc-test.cc:267: Connecting to unix:/tmp/dist-test-taskOpr5ap/test-tmp/rpc-test-b68351efe20946f7ba7672da09649a48.sock
I20260923 19:30:55.433784 379 test_util.cc:175] -----------------------------------------------
I20260923 19:30:55.433892 379 test_util.cc:176] Had fatal failures, leaving test files at /tmp/dist-test-taskOpr5ap/test-tmp/rpc-test.6.Parameters_TestRpc.TestCallWithChainCertAndChainCA_SSL_UnixSocket.1790191855287239-379-0
[ FAILED ] Parameters/TestRpc.TestCallWithChainCertAndChainCA/SSL_UnixSocket, where GetParam() = (true, true) (30 ms)
[ RUN ] Parameters/TestRpc.TestCallWithPasswordProtectedKey/SSL_UnixSocket
I20260923 19:30:55.448622 440 acceptor_pool.cc:254] collecting diagnostics on the listening RPC socket unix:/tmp/dist-test-taskOpr5ap/test-tmp/rpc-test-262c72f7acc643f4adcd4f08f9854dea.sock every 8 connection(s)
I20260923 19:30:55.448922 441 acceptor_pool.cc:254] collecting diagnostics on the listening RPC socket unix:/tmp/dist-test-taskOpr5ap/test-tmp/rpc-test-262c72f7acc643f4adcd4f08f9854dea.sock every 8 connection(s)
W20260923 19:30:55.481163 437 connection.cc:196] Error closing socket: Network error: TlsSocket::Close: Broken pipe
[ OK ] Parameters/TestRpc.TestCallWithPasswordProtectedKey/SSL_UnixSocket (51 ms)
[ RUN ] Parameters/TestRpc.TestCallToBadServer/SSL_UnixSocket
I20260923 19:30:55.513073 379 rpc-test.cc:394] Status: Network error: Client connection negotiation failed: client connection to 0.0.0.0:0: connect: Connection refused (error 111)
I20260923 19:30:55.513877 379 rpc-test.cc:394] Status: Network error: Client connection negotiation failed: client connection to 0.0.0.0:0: connect: Connection refused (error 111)
I20260923 19:30:55.514549 379 rpc-test.cc:394] Status: Network error: Client connection negotiation failed: client connection to 0.0.0.0:0: connect: Connection refused (error 111)
I20260923 19:30:55.515168 379 rpc-test.cc:394] Status: Network error: Client connection negotiation failed: client connection to 0.0.0.0:0: connect: Connection refused (error 111)
I20260923 19:30:55.515864 379 rpc-test.cc:394] Status: Network error: Client connection negotiation failed: client connection to 0.0.0.0:0: connect: Connection refused (error 111)
[ OK ] Parameters/TestRpc.TestCallToBadServer/SSL_UnixSocket (32 ms)
[ RUN ] Parameters/TestRpc.TestWrongService/SSL_UnixSocket
I20260923 19:30:55.532905 475 acceptor_pool.cc:254] collecting diagnostics on the listening RPC socket unix:/tmp/dist-test-taskOpr5ap/test-tmp/rpc-test-ce355e28738147d8b934332fb9fdf64b.sock every 8 connection(s)
I20260923 19:30:55.533187 476 acceptor_pool.cc:254] collecting diagnostics on the listening RPC socket unix:/tmp/dist-test-taskOpr5ap/test-tmp/rpc-test-ce355e28738147d8b934332fb9fdf64b.sock every 8 connection(s)
I20260923 19:30:55.568473 472 messenger.cc:345] service WrongServiceName not registered on TestServer
W20260923 19:30:55.570340 472 connection.cc:196] Error closing socket: Network error: TlsSocket::Close: Broken pipe
[ OK ] Parameters/TestRpc.TestWrongService/SSL_UnixSocket (55 ms)
[ RUN ] Parameters/TestRpc.TestConnectionKeepalive/SSL_UnixSocket
I20260923 19:30:55.613742 498 acceptor_pool.cc:254] collecting diagnostics on the listening RPC socket unix:/tmp/dist-test-taskOpr5ap/test-tmp/rpc-test-174cd8ee5f814a35a367538bea044451.sock every 8 connection(s)
I20260923 19:30:55.614010 499 acceptor_pool.cc:254] collecting diagnostics on the listening RPC socket unix:/tmp/dist-test-taskOpr5ap/test-tmp/rpc-test-174cd8ee5f814a35a367538bea044451.sock every 8 connection(s)
I20260923 19:30:55.614940 379 rpc-test.cc:488] Connecting to unix:/tmp/dist-test-taskOpr5ap/test-tmp/rpc-test-174cd8ee5f814a35a367538bea044451.sock
W20260923 19:30:56.076515 511 connection.cc:196] Error closing socket: Network error: TlsSocket::Close: Broken pipe
[ OK ] Parameters/TestRpc.TestConnectionKeepalive/SSL_UnixSocket (1082 ms)
[ RUN ] Parameters/TestRpc.TestClientConnectionMetrics/SSL_UnixSocket
I20260923 19:30:56.671702 523 acceptor_pool.cc:254] collecting diagnostics on the listening RPC socket unix:/tmp/dist-test-taskOpr5ap/test-tmp/rpc-test-d6d3d50fba744858b8b538212e9293e2.sock every 8 connection(s)
I20260923 19:30:56.671916 524 acceptor_pool.cc:254] collecting diagnostics on the listening RPC socket unix:/tmp/dist-test-taskOpr5ap/test-tmp/rpc-test-d6d3d50fba744858b8b538212e9293e2.sock every 8 connection(s)
I20260923 19:30:56.672883 379 rpc-test.cc:569] Connecting to unix:/tmp/dist-test-taskOpr5ap/test-tmp/rpc-test-d6d3d50fba744858b8b538212e9293e2.sock
W20260923 19:31:19.068851 520 connection.cc:196] Error closing socket: Network error: TlsSocket::Close: Broken pipe
[ OK ] Parameters/TestRpc.TestClientConnectionMetrics/SSL_UnixSocket (22418 ms)
[ RUN ] Parameters/TestRpc.TestCredentialsPolicy/SSL_UnixSocket
I20260923 19:31:19.113385 546 acceptor_pool.cc:254] collecting diagnostics on the listening RPC socket unix:/tmp/dist-test-taskOpr5ap/test-tmp/rpc-test-01172c3485ce467b959e9fb436fdbbc8.sock every 8 connection(s)
I20260923 19:31:19.113561 547 acceptor_pool.cc:254] collecting diagnostics on the listening RPC socket unix:/tmp/dist-test-taskOpr5ap/test-tmp/rpc-test-01172c3485ce467b959e9fb436fdbbc8.sock every 8 connection(s)
I20260923 19:31:19.114516 379 rpc-test.cc:700] Connecting to unix:/tmp/dist-test-taskOpr5ap/test-tmp/rpc-test-01172c3485ce467b959e9fb436fdbbc8.sock
W20260923 19:31:19.134109 545 connection.cc:196] Error closing socket: Network error: TlsSocket::Close: Broken pipe
[ OK ] Parameters/TestRpc.TestCredentialsPolicy/SSL_UnixSocket (70 ms)
[ RUN ] Parameters/TestRpc.TestCallLongerThanKeepalive/SSL_UnixSocket
I20260923 19:31:19.170536 571 acceptor_pool.cc:254] collecting diagnostics on the listening RPC socket unix:/tmp/dist-test-taskOpr5ap/test-tmp/rpc-test-b2f607dd050b4ea98b0ca8c503c091d9.sock every 8 connection(s)
I20260923 19:31:19.170765 572 acceptor_pool.cc:254] collecting diagnostics on the listening RPC socket unix:/tmp/dist-test-taskOpr5ap/test-tmp/rpc-test-b2f607dd050b4ea98b0ca8c503c091d9.sock every 8 connection(s)
I20260923 19:31:19.188899 575 rpc-test-base.h:222] got call: sleep_micros: 3000000 deferred: true
I20260923 19:31:22.190692 575 rpcz_store.cc:275] Call kudu.rpc.GenericCalculatorService.Sleep from unix:<unnamed> (request call id 0) took 3001 ms. Trace:
I20260923 19:31:22.190858 575 rpcz_store.cc:276] 0923 19:31:19.188791 (+ 0us) service_pool.cc:170] Inserting onto call queue
0923 19:31:19.188853 (+ 62us) service_pool.cc:227] Handling call
0923 19:31:22.190642 (+3001789us) inbound_call.cc:173] Queueing success response
Metrics: {}
[ OK ] Parameters/TestRpc.TestCallLongerThanKeepalive/SSL_UnixSocket (3051 ms)
[ RUN ] Parameters/TestRpc.TestRpcSidecar/SSL_UnixSocket
I20260923 19:31:22.213019 596 acceptor_pool.cc:254] collecting diagnostics on the listening RPC socket unix:/tmp/dist-test-taskOpr5ap/test-tmp/rpc-test-f0789f16ba59404aabeb6f1e43ee430f.sock every 8 connection(s)
I20260923 19:31:22.213310 597 acceptor_pool.cc:254] collecting diagnostics on the listening RPC socket unix:/tmp/dist-test-taskOpr5ap/test-tmp/rpc-test-f0789f16ba59404aabeb6f1e43ee430f.sock every 8 connection(s)
W20260923 19:31:22.308367 593 connection.cc:196] Error closing socket: Network error: TlsSocket::Close: Broken pipe
[ OK ] Parameters/TestRpc.TestRpcSidecar/SSL_UnixSocket (114 ms)
[ RUN ] Parameters/TestRpc.TestRpcSidecarLimits/SSL_UnixSocket
I20260923 19:31:24.488734 621 acceptor_pool.cc:254] collecting diagnostics on the listening RPC socket unix:/tmp/dist-test-taskOpr5ap/test-tmp/rpc-test-839f2011ea034ecb923f62794daa50b9.sock every 8 connection(s)
I20260923 19:31:24.488998 622 acceptor_pool.cc:254] collecting diagnostics on the listening RPC socket unix:/tmp/dist-test-taskOpr5ap/test-tmp/rpc-test-839f2011ea034ecb923f62794daa50b9.sock every 8 connection(s)
W20260923 19:31:24.499342 379 serialization.cc:72] Serialized kudu.rpc_test.PushStringsRequestPB (2147483654 bytes) is larger than the maximum configured RPC message size (52428800 bytes). Sending anyway, but peer may reject the data.
W20260923 19:31:24.506418 618 connection.cc:535] server connection from unix:<unnamed> recv error: Network error: RPC frame had a length of 2147483714, but we only support messages up to 52428800 bytes long.
W20260923 19:31:24.506575 618 connection.cc:158] shutting down server connection from unix:<unnamed> with pending inbound data: 4/2147483714 bytes received; last active 0 ns ago: status Network error: RPC frame had a length of 2147483714, but we only support messages up to 52428800 bytes long.
W20260923 19:31:24.507157 634 connection.cc:196] Error closing socket: Network error: TlsSocket::Close: Broken pipe
I20260923 19:31:24.525758 646 acceptor_pool.cc:254] collecting diagnostics on the listening RPC socket unix:/tmp/dist-test-taskOpr5ap/test-tmp/rpc-test-839f2011ea034ecb923f62794daa50b9.sock every 8 connection(s)
I20260923 19:31:24.525944 647 acceptor_pool.cc:254] collecting diagnostics on the listening RPC socket unix:/tmp/dist-test-taskOpr5ap/test-tmp/rpc-test-839f2011ea034ecb923f62794daa50b9.sock every 8 connection(s)
W20260923 19:31:30.536826 643 connection.cc:577] server connection from unix:<unnamed>: received bad data: 'Corruption: Invalid packet: message had a length of 2147483710, but we only support messages up to 2147483647 bytes
'
W20260923 19:31:30.537572 659 connection.cc:196] Error closing socket: Network error: TlsSocket::Close: Broken pipe
[ OK ] Parameters/TestRpc.TestRpcSidecarLimits/SSL_UnixSocket (8698 ms)
[ RUN ] Parameters/TestRpc.TestCallTimeoutDoesntAffectNegotiation/SSL_UnixSocket
I20260923 19:31:31.019920 671 acceptor_pool.cc:254] collecting diagnostics on the listening RPC socket unix:/tmp/dist-test-taskOpr5ap/test-tmp/rpc-test-4fd43b50dbc74c1d9011bcce8bb2dddc.sock every 8 connection(s)
I20260923 19:31:31.020176 672 acceptor_pool.cc:254] collecting diagnostics on the listening RPC socket unix:/tmp/dist-test-taskOpr5ap/test-tmp/rpc-test-4fd43b50dbc74c1d9011bcce8bb2dddc.sock every 8 connection(s)
W20260923 19:31:31.034152 667 negotiation.cc:266] Injecting 500ms delay in negotiation
I20260923 19:31:31.084743 379 rpc-test-base.h:595] status: Timed out: connection negotiation to unix:/tmp/dist-test-taskOpr5ap/test-tmp/rpc-test-4fd43b50dbc74c1d9011bcce8bb2dddc.sock for RPC Sleep timed out after 0.050s (ON_OUTBOUND_QUEUE), seconds elapsed: 0.0512582
[ OK ] Parameters/TestRpc.TestCallTimeoutDoesntAffectNegotiation/SSL_UnixSocket (533 ms)
[ RUN ] Parameters/TestRpc.TestRpcHandlerLatencyMetric/SSL_UnixSocket
I20260923 19:31:31.564399 696 acceptor_pool.cc:254] collecting diagnostics on the listening RPC socket unix:/tmp/dist-test-taskOpr5ap/test-tmp/rpc-test-4d0cb68519e14c09b6116bbbb9f4705c.sock every 8 connection(s)
I20260923 19:31:31.564591 697 acceptor_pool.cc:254] collecting diagnostics on the listening RPC socket unix:/tmp/dist-test-taskOpr5ap/test-tmp/rpc-test-4d0cb68519e14c09b6116bbbb9f4705c.sock every 8 connection(s)
I20260923 19:31:31.609035 379 rpc-test.cc:1236] Sleep() min lat: 20731
I20260923 19:31:31.609148 379 rpc-test.cc:1237] Sleep() mean lat: 20731
I20260923 19:31:31.609189 379 rpc-test.cc:1238] Sleep() max lat: 20731
I20260923 19:31:31.609208 379 rpc-test.cc:1239] Sleep() #calls: 1
[ OK ] Parameters/TestRpc.TestRpcHandlerLatencyMetric/SSL_UnixSocket (69 ms)
[ RUN ] Parameters/TestRpc.TimedOutOnResponseMetricServiceQueue/SSL_UnixSocket
I20260923 19:31:31.627672 722 acceptor_pool.cc:254] collecting diagnostics on the listening RPC socket unix:/tmp/dist-test-taskOpr5ap/test-tmp/rpc-test-702a3fea43d14b8ea429e14fbe8374e3.sock every 8 connection(s)
I20260923 19:31:31.627838 723 acceptor_pool.cc:254] collecting diagnostics on the listening RPC socket unix:/tmp/dist-test-taskOpr5ap/test-tmp/rpc-test-702a3fea43d14b8ea429e14fbe8374e3.sock every 8 connection(s)
W20260923 19:31:31.694682 724 rpcz_store.cc:267] Call kudu.rpc_test.CalculatorService.Sleep from unix:<unnamed> (request call id 2) took 20 ms (client timeout 20 ms). Trace:
W20260923 19:31:31.694854 724 rpcz_store.cc:269] 0923 19:31:31.674304 (+ 0us) service_pool.cc:170] Inserting onto call queue
0923 19:31:31.694625 (+ 20321us) service_pool.cc:214] Skipping call since client already timed out
0923 19:31:31.694666 (+ 41us) inbound_call.cc:173] Queueing failure response
Metrics: {}
W20260923 19:31:31.696484 719 connection.cc:196] Error closing socket: Network error: TlsSocket::Close: Broken pipe
[ OK ] Parameters/TestRpc.TimedOutOnResponseMetricServiceQueue/SSL_UnixSocket (85 ms)
[ RUN ] Parameters/TestRpc.RpcPendingConnectionsMetric/SSL_UnixSocket
I20260923 19:31:31.704939 745 acceptor_pool.cc:254] collecting diagnostics on the listening RPC socket 0.0.0.0:40613 every 8 connection(s)
I20260923 19:31:31.705184 746 acceptor_pool.cc:254] collecting diagnostics on the listening RPC socket 0.0.0.0:40613 every 8 connection(s)
W20260923 19:31:31.716892 741 negotiation.cc:337] Failed RPC negotiation. Trace:
0923 19:31:31.715927 (+ 0us) reactor.cc:625] Submitting negotiation task for server connection from 127.0.0.1:50944 (local address 127.0.0.1:40613)
0923 19:31:31.716202 (+ 275us) server_negotiation.cc:206] Beginning negotiation
0923 19:31:31.716211 (+ 9us) server_negotiation.cc:399] Waiting for connection header
0923 19:31:31.716454 (+ 243us) negotiation.cc:327] Negotiation complete: Network error: Server connection negotiation failed: server connection from 127.0.0.1:50944: BlockingRecv error: recv got EOF from 127.0.0.1:50944 (error 108)
Metrics: {"server-negotiator.queue_time_us":88}
[ OK ] Parameters/TestRpc.RpcPendingConnectionsMetric/SSL_UnixSocket (29 ms)
[ RUN ] Parameters/TestRpc.TestRpcContextClientDeadline/SSL_UnixSocket
I20260923 19:31:31.747123 761 acceptor_pool.cc:254] collecting diagnostics on the listening RPC socket unix:/tmp/dist-test-taskOpr5ap/test-tmp/rpc-test-34ed4a0f0fdf4e17b867491c5ce90b37.sock every 8 connection(s)
I20260923 19:31:31.747371 762 acceptor_pool.cc:254] collecting diagnostics on the listening RPC socket unix:/tmp/dist-test-taskOpr5ap/test-tmp/rpc-test-34ed4a0f0fdf4e17b867491c5ce90b37.sock every 8 connection(s)
[ OK ] Parameters/TestRpc.TestRpcContextClientDeadline/SSL_UnixSocket (71 ms)
[ RUN ] Parameters/TestRpc.TestApplicationFeatureFlagUnsupportedServer/SSL_UnixSocket
I20260923 19:31:31.814512 786 acceptor_pool.cc:254] collecting diagnostics on the listening RPC socket unix:/tmp/dist-test-taskOpr5ap/test-tmp/rpc-test-947dda345466422ca759333f213a26b7.sock every 8 connection(s)
I20260923 19:31:31.814826 787 acceptor_pool.cc:254] collecting diagnostics on the listening RPC socket unix:/tmp/dist-test-taskOpr5ap/test-tmp/rpc-test-947dda345466422ca759333f213a26b7.sock every 8 connection(s)
[ OK ] Parameters/TestRpc.TestApplicationFeatureFlagUnsupportedServer/SSL_UnixSocket (48 ms)
[ RUN ] Parameters/TestRpc.TestCancellationAsync/SSL_UnixSocket
I20260923 19:31:31.871683 811 acceptor_pool.cc:254] collecting diagnostics on the listening RPC socket unix:/tmp/dist-test-taskOpr5ap/test-tmp/rpc-test-0ac5b6d8a7ba49a9a90c3046e6f02229.sock every 8 connection(s)
I20260923 19:31:31.871816 812 acceptor_pool.cc:254] collecting diagnostics on the listening RPC socket unix:/tmp/dist-test-taskOpr5ap/test-tmp/rpc-test-0ac5b6d8a7ba49a9a90c3046e6f02229.sock every 8 connection(s)
I20260923 19:31:31.872728 379 rpc-test.cc:1716] Connecting to unix:/tmp/dist-test-taskOpr5ap/test-tmp/rpc-test-0ac5b6d8a7ba49a9a90c3046e6f02229.sock
I20260923 19:31:31.915911 379 test_util.cc:268] Using random seed: -2016664463
I20260923 19:31:31.952468 815 rpc-test-base.h:240] got call: sleep_micros: 500 pattern: 4294967295 num_repetitions: 2097152 sidecar_idx: 0
I20260923 19:31:31.983108 814 rpc-test-base.h:240] got call: sleep_micros: 500 pattern: 4294967295 num_repetitions: 2097152 sidecar_idx: 0
I20260923 19:31:32.015674 815 rpc-test-base.h:240] got call: sleep_micros: 500 pattern: 4294967295 num_repetitions: 2097152 sidecar_idx: 0
I20260923 19:31:32.047796 813 rpc-test-base.h:240] got call: sleep_micros: 500 pattern: 4294967295 num_repetitions: 2097152 sidecar_idx: 0
I20260923 19:31:32.085783 815 rpc-test-base.h:240] got call: sleep_micros: 500 pattern: 4294967295 num_repetitions: 2097152 sidecar_idx: 0
I20260923 19:31:32.121692 813 rpc-test-base.h:240] got call: sleep_micros: 500 pattern: 4294967295 num_repetitions: 2097152 sidecar_idx: 0
I20260923 19:31:32.157567 815 rpc-test-base.h:240] got call: sleep_micros: 500 pattern: 4294967295 num_repetitions: 2097152 sidecar_idx: 0
W20260923 19:31:32.159940 808 connection.cc:196] Error closing socket: Network error: TlsSocket::Close: Broken pipe
W20260923 19:31:32.162608 808 connection.cc:441] server connection from unix:<unnamed> torn down before Call kudu.rpc.GenericCalculatorService.SleepWithSidecar from unix:<unnamed> (request call id 8) could send its response
W20260923 19:31:32.190757 808 connection.cc:441] server connection from unix:<unnamed> torn down before Call kudu.rpc.GenericCalculatorService.SleepWithSidecar from unix:<unnamed> (request call id 9) could send its response
[ OK ] Parameters/TestRpc.TestCancellationAsync/SSL_UnixSocket (345 ms)
[ RUN ] Parameters/TestRpc.TestPerformanceBySocketType/SSL_UnixSocket
I20260923 19:31:32.218698 836 acceptor_pool.cc:254] collecting diagnostics on the listening RPC socket unix:/tmp/dist-test-taskOpr5ap/test-tmp/rpc-test-409d19b0b4c749a0bca32249ee74e2ae.sock every 8 connection(s)
I20260923 19:31:32.218948 837 acceptor_pool.cc:254] collecting diagnostics on the listening RPC socket unix:/tmp/dist-test-taskOpr5ap/test-tmp/rpc-test-409d19b0b4c749a0bca32249ee74e2ae.sock every 8 connection(s)
I20260923 19:31:32.219882 379 rpc-test.cc:1846] Connecting to unix:/tmp/dist-test-taskOpr5ap/test-tmp/rpc-test-409d19b0b4c749a0bca32249ee74e2ae.sock
I20260923 19:31:35.586695 379 rpc-test.cc:1859] Sending 1024MB via ssl-enabled unix socket: real 3.345s user 3.303s sys 2.341s
I20260923 19:31:38.832849 379 rpc-test.cc:1859] Sending 1024MB via ssl-enabled unix socket: real 3.246s user 3.025s sys 2.442s
I20260923 19:31:42.216572 379 rpc-test.cc:1859] Sending 1024MB via ssl-enabled unix socket: real 3.384s user 3.379s sys 2.332s
I20260923 19:31:45.607926 379 rpc-test.cc:1859] Sending 1024MB via ssl-enabled unix socket: real 3.391s user 3.468s sys 2.285s
I20260923 19:31:48.905478 379 rpc-test.cc:1859] Sending 1024MB via ssl-enabled unix socket: real 3.297s user 3.287s sys 2.265s
W20260923 19:31:48.907847 833 connection.cc:196] Error closing socket: Network error: TlsSocket::Close: Broken pipe
[ OK ] Parameters/TestRpc.TestPerformanceBySocketType/SSL_UnixSocket (16718 ms)
[----------] 20 tests from Parameters/TestRpc (53606 ms total)
[----------] 1 test from Parameters/TestRpcSocketTxRxQueue
[ RUN ] Parameters/TestRpcSocketTxRxQueue.AcceptorRxQueueSizeMetric/0
I20260923 19:31:48.926340 861 acceptor_pool.cc:254] collecting diagnostics on the listening RPC socket 0.0.0.0:35617 every 1 connection(s)
I20260923 19:31:48.926661 862 acceptor_pool.cc:254] collecting diagnostics on the listening RPC socket 0.0.0.0:35617 every 1 connection(s)
W20260923 19:31:48.928550 857 negotiation.cc:337] Failed RPC negotiation. Trace:
0923 19:31:48.928118 (+ 0us) reactor.cc:625] Submitting negotiation task for server connection from 127.0.0.1:37026 (local address 127.0.0.1:35617)
0923 19:31:48.928301 (+ 183us) server_negotiation.cc:206] Beginning negotiation
0923 19:31:48.928305 (+ 4us) server_negotiation.cc:399] Waiting for connection header
0923 19:31:48.928428 (+ 123us) negotiation.cc:327] Negotiation complete: Network error: Server connection negotiation failed: server connection from 127.0.0.1:37026: BlockingRecv error: recv got EOF from 127.0.0.1:37026 (error 108)
Metrics: {"server-negotiator.queue_time_us":63}
[ OK ] Parameters/TestRpcSocketTxRxQueue.AcceptorRxQueueSizeMetric/0 (18 ms)
[----------] 1 test from Parameters/TestRpcSocketTxRxQueue (18 ms total)
[----------] Global test environment tear-down
[==========] 21 tests from 2 test suites ran. (53625 ms total)
[ PASSED ] 20 tests.
[ FAILED ] 1 test, listed below:
[ FAILED ] Parameters/TestRpc.TestCallWithChainCertAndChainCA/SSL_UnixSocket, where GetParam() = (true, true)
1 FAILED TEST