Diagnosed failure

Parameters/TestRpc.TestCallWithChainCertAndChainCA/SSL_UnixSocket: /data0/somelongdirectorytoavoidrpathissues/src/kudu/src/kudu/rpc/rpc-test.cc:270: Failure
Failed
Bad status: Runtime error: could not verify certificate chain (error with cert: subject=CN = localhost, ST = sadfjas, C = AS, emailAddress = sdflkdsajf, O = lskdfjlsad, OU = sldfkja, issuer=C = AS, ST = ASDfkjdhf, L = lskdjf, O = saldfja, OU = skdjf, CN = localhost, emailAddress = sadjflkadsj): : certificate has expired
Google Test trace:
/data0/somelongdirectorytoavoidrpathissues/src/kudu/src/kudu/rpc/rpc-test.cc:267: Connecting to unix:/tmp/dist-test-taskBnFvBi/test-tmp/rpc-test-85b9bcdb059b43168d797ccafef75bf3.sock
I20260926 16:17:39.588871  6039 test_util.cc:175] -----------------------------------------------
I20260926 16:17:39.589058  6039 test_util.cc:176] Had fatal failures, leaving test files at /tmp/dist-test-taskBnFvBi/test-tmp/rpc-test.6.Parameters_TestRpc.TestCallWithChainCertAndChainCA_SSL_UnixSocket.1790439458221176-6039-0

Full log

Note: This is test shard 7 of 8.
[==========] Running 21 tests from 2 test suites.
[----------] Global test environment set-up.
[----------] 20 tests from Parameters/TestRpc
[ RUN      ] Parameters/TestRpc.TestMessengerCreateDestroy/SSL_UnixSocket
WARNING: Logging before InitGoogleLogging() is written to STDERR
I20260926 16:17:38.325007  6039 rpc-test.cc:169] started messenger TestCreateDestroy
[       OK ] Parameters/TestRpc.TestMessengerCreateDestroy/SSL_UnixSocket (1180 ms)
[ RUN      ] Parameters/TestRpc.TestNegotiationDeadlock/SSL_UnixSocket
I20260926 16:17:39.484067  6061 acceptor_pool.cc:254] collecting diagnostics on the listening RPC socket unix:/tmp/dist-test-taskBnFvBi/test-tmp/rpc-test-561dda8897a24092bcb248da22ebf6d8.sock every 8 connection(s)
I20260926 16:17:39.485605  6062 acceptor_pool.cc:254] collecting diagnostics on the listening RPC socket unix:/tmp/dist-test-taskBnFvBi/test-tmp/rpc-test-561dda8897a24092bcb248da22ebf6d8.sock every 8 connection(s)
[       OK ] Parameters/TestRpc.TestNegotiationDeadlock/SSL_UnixSocket (84 ms)
[ RUN      ] Parameters/TestRpc.TestCallWithChainCertAndChainCA/SSL_UnixSocket
I20260926 16:17:39.559508  6077 acceptor_pool.cc:254] collecting diagnostics on the listening RPC socket unix:/tmp/dist-test-taskBnFvBi/test-tmp/rpc-test-85b9bcdb059b43168d797ccafef75bf3.sock every 8 connection(s)
I20260926 16:17:39.561760  6078 acceptor_pool.cc:254] collecting diagnostics on the listening RPC socket unix:/tmp/dist-test-taskBnFvBi/test-tmp/rpc-test-85b9bcdb059b43168d797ccafef75bf3.sock every 8 connection(s)
/data0/somelongdirectorytoavoidrpathissues/src/kudu/src/kudu/rpc/rpc-test.cc:270: Failure
Failed
Bad status: Runtime error: could not verify certificate chain (error with cert: subject=CN = localhost, ST = sadfjas, C = AS, emailAddress = sdflkdsajf, O = lskdfjlsad, OU = sldfkja, issuer=C = AS, ST = ASDfkjdhf, L = lskdjf, O = saldfja, OU = skdjf, CN = localhost, emailAddress = sadjflkadsj): : certificate has expired
Google Test trace:
/data0/somelongdirectorytoavoidrpathissues/src/kudu/src/kudu/rpc/rpc-test.cc:267: Connecting to unix:/tmp/dist-test-taskBnFvBi/test-tmp/rpc-test-85b9bcdb059b43168d797ccafef75bf3.sock
I20260926 16:17:39.588871  6039 test_util.cc:175] -----------------------------------------------
I20260926 16:17:39.589058  6039 test_util.cc:176] Had fatal failures, leaving test files at /tmp/dist-test-taskBnFvBi/test-tmp/rpc-test.6.Parameters_TestRpc.TestCallWithChainCertAndChainCA_SSL_UnixSocket.1790439458221176-6039-0
[  FAILED  ] Parameters/TestRpc.TestCallWithChainCertAndChainCA/SSL_UnixSocket, where GetParam() = (true, true) (51 ms)
[ RUN      ] Parameters/TestRpc.TestCallWithPasswordProtectedKey/SSL_UnixSocket
I20260926 16:17:39.624828  6102 acceptor_pool.cc:254] collecting diagnostics on the listening RPC socket unix:/tmp/dist-test-taskBnFvBi/test-tmp/rpc-test-0c7883fd4695410981934d3a2a7e3f4a.sock every 8 connection(s)
I20260926 16:17:39.625595  6103 acceptor_pool.cc:254] collecting diagnostics on the listening RPC socket unix:/tmp/dist-test-taskBnFvBi/test-tmp/rpc-test-0c7883fd4695410981934d3a2a7e3f4a.sock every 8 connection(s)
W20260926 16:17:39.668514  6099 connection.cc:196] Error closing socket: Network error: TlsSocket::Close: Broken pipe
[       OK ] Parameters/TestRpc.TestCallWithPasswordProtectedKey/SSL_UnixSocket (85 ms)
[ RUN      ] Parameters/TestRpc.TestCallToBadServer/SSL_UnixSocket
I20260926 16:17:39.701443  6039 rpc-test.cc:394] Status: Network error: Client connection negotiation failed: client connection to 0.0.0.0:0: connect: Connection refused (error 111)
I20260926 16:17:39.702745  6039 rpc-test.cc:394] Status: Network error: Client connection negotiation failed: client connection to 0.0.0.0:0: connect: Connection refused (error 111)
I20260926 16:17:39.703930  6039 rpc-test.cc:394] Status: Network error: Client connection negotiation failed: client connection to 0.0.0.0:0: connect: Connection refused (error 111)
I20260926 16:17:39.705168  6039 rpc-test.cc:394] Status: Network error: Client connection negotiation failed: client connection to 0.0.0.0:0: connect: Connection refused (error 111)
I20260926 16:17:39.706411  6039 rpc-test.cc:394] Status: Network error: Client connection negotiation failed: client connection to 0.0.0.0:0: connect: Connection refused (error 111)
[       OK ] Parameters/TestRpc.TestCallToBadServer/SSL_UnixSocket (34 ms)
[ RUN      ] Parameters/TestRpc.TestWrongService/SSL_UnixSocket
I20260926 16:17:39.732259  6137 acceptor_pool.cc:254] collecting diagnostics on the listening RPC socket unix:/tmp/dist-test-taskBnFvBi/test-tmp/rpc-test-ae9a812b8a48456ca84b904f871ff7bc.sock every 8 connection(s)
I20260926 16:17:39.733129  6138 acceptor_pool.cc:254] collecting diagnostics on the listening RPC socket unix:/tmp/dist-test-taskBnFvBi/test-tmp/rpc-test-ae9a812b8a48456ca84b904f871ff7bc.sock every 8 connection(s)
I20260926 16:17:39.759302  6134 messenger.cc:345] service WrongServiceName not registered on TestServer
[       OK ] Parameters/TestRpc.TestWrongService/SSL_UnixSocket (58 ms)
[ RUN      ] Parameters/TestRpc.TestConnectionKeepalive/SSL_UnixSocket
I20260926 16:17:39.793408  6160 acceptor_pool.cc:254] collecting diagnostics on the listening RPC socket unix:/tmp/dist-test-taskBnFvBi/test-tmp/rpc-test-039f7ee5a986419e85ae63877695bdd7.sock every 8 connection(s)
I20260926 16:17:39.794298  6161 acceptor_pool.cc:254] collecting diagnostics on the listening RPC socket unix:/tmp/dist-test-taskBnFvBi/test-tmp/rpc-test-039f7ee5a986419e85ae63877695bdd7.sock every 8 connection(s)
I20260926 16:17:39.797745  6039 rpc-test.cc:488] Connecting to unix:/tmp/dist-test-taskBnFvBi/test-tmp/rpc-test-039f7ee5a986419e85ae63877695bdd7.sock
W20260926 16:17:40.271113  6173 connection.cc:196] Error closing socket: Network error: TlsSocket::Close: Broken pipe
[       OK ] Parameters/TestRpc.TestConnectionKeepalive/SSL_UnixSocket (1066 ms)
[ RUN      ] Parameters/TestRpc.TestClientConnectionMetrics/SSL_UnixSocket
I20260926 16:17:40.861639  6185 acceptor_pool.cc:254] collecting diagnostics on the listening RPC socket unix:/tmp/dist-test-taskBnFvBi/test-tmp/rpc-test-3d9b311c8af34897b9c3ff21696a7a2e.sock every 8 connection(s)
I20260926 16:17:40.862416  6186 acceptor_pool.cc:254] collecting diagnostics on the listening RPC socket unix:/tmp/dist-test-taskBnFvBi/test-tmp/rpc-test-3d9b311c8af34897b9c3ff21696a7a2e.sock every 8 connection(s)
I20260926 16:17:40.865690  6039 rpc-test.cc:569] Connecting to unix:/tmp/dist-test-taskBnFvBi/test-tmp/rpc-test-3d9b311c8af34897b9c3ff21696a7a2e.sock
W20260926 16:19:57.144169  6182 connection.cc:196] Error closing socket: Network error: TlsSocket::Close: Broken pipe
[       OK ] Parameters/TestRpc.TestClientConnectionMetrics/SSL_UnixSocket (136318 ms)
[ RUN      ] Parameters/TestRpc.TestCredentialsPolicy/SSL_UnixSocket
I20260926 16:19:57.182245  6221 acceptor_pool.cc:254] collecting diagnostics on the listening RPC socket unix:/tmp/dist-test-taskBnFvBi/test-tmp/rpc-test-cfa543edd96742a6aa199dea59cc555a.sock every 8 connection(s)
I20260926 16:19:57.183161  6222 acceptor_pool.cc:254] collecting diagnostics on the listening RPC socket unix:/tmp/dist-test-taskBnFvBi/test-tmp/rpc-test-cfa543edd96742a6aa199dea59cc555a.sock every 8 connection(s)
I20260926 16:19:57.186316  6039 rpc-test.cc:700] Connecting to unix:/tmp/dist-test-taskBnFvBi/test-tmp/rpc-test-cfa543edd96742a6aa199dea59cc555a.sock
W20260926 16:19:57.224747  6220 connection.cc:196] Error closing socket: Network error: TlsSocket::Close: Broken pipe
[       OK ] Parameters/TestRpc.TestCredentialsPolicy/SSL_UnixSocket (93 ms)
[ RUN      ] Parameters/TestRpc.TestCallLongerThanKeepalive/SSL_UnixSocket
I20260926 16:19:57.278469  6246 acceptor_pool.cc:254] collecting diagnostics on the listening RPC socket unix:/tmp/dist-test-taskBnFvBi/test-tmp/rpc-test-f41f8c2405514eb2b3b02c4fc7e72d93.sock every 8 connection(s)
I20260926 16:19:57.279196  6247 acceptor_pool.cc:254] collecting diagnostics on the listening RPC socket unix:/tmp/dist-test-taskBnFvBi/test-tmp/rpc-test-f41f8c2405514eb2b3b02c4fc7e72d93.sock every 8 connection(s)
I20260926 16:19:57.317794  6250 rpc-test-base.h:222] got call: sleep_micros: 3000000 deferred: true
I20260926 16:20:00.322240  6250 rpcz_store.cc:275] Call kudu.rpc.GenericCalculatorService.Sleep from unix:<unnamed> (request call id 0) took 3004 ms. Trace:
I20260926 16:20:00.322700  6250 rpcz_store.cc:276] 0926 16:19:57.317642 (+     0us) service_pool.cc:170] Inserting onto call queue
0926 16:19:57.317741 (+    99us) service_pool.cc:227] Handling call
0926 16:20:00.322064 (+3004323us) inbound_call.cc:173] Queueing success response
Metrics: {}
W20260926 16:20:00.327529  6243 connection.cc:196] Error closing socket: Network error: TlsSocket::Close: Broken pipe
[       OK ] Parameters/TestRpc.TestCallLongerThanKeepalive/SSL_UnixSocket (3088 ms)
[ RUN      ] Parameters/TestRpc.TestRpcSidecar/SSL_UnixSocket
I20260926 16:20:00.361799  6272 acceptor_pool.cc:254] collecting diagnostics on the listening RPC socket unix:/tmp/dist-test-taskBnFvBi/test-tmp/rpc-test-fb0991841ebf48bea3c3de7a571ae0e0.sock every 8 connection(s)
I20260926 16:20:00.362738  6273 acceptor_pool.cc:254] collecting diagnostics on the listening RPC socket unix:/tmp/dist-test-taskBnFvBi/test-tmp/rpc-test-fb0991841ebf48bea3c3de7a571ae0e0.sock every 8 connection(s)
W20260926 16:20:00.868250  6269 connection.cc:196] Error closing socket: Network error: TlsSocket::Close: Broken pipe
[       OK ] Parameters/TestRpc.TestRpcSidecar/SSL_UnixSocket (537 ms)
[ RUN      ] Parameters/TestRpc.TestRpcSidecarLimits/SSL_UnixSocket
I20260926 16:20:17.349759  6298 acceptor_pool.cc:254] collecting diagnostics on the listening RPC socket unix:/tmp/dist-test-taskBnFvBi/test-tmp/rpc-test-859b783af78647f585b5e2a720c0563e.sock every 8 connection(s)
I20260926 16:20:17.350572  6299 acceptor_pool.cc:254] collecting diagnostics on the listening RPC socket unix:/tmp/dist-test-taskBnFvBi/test-tmp/rpc-test-859b783af78647f585b5e2a720c0563e.sock every 8 connection(s)
W20260926 16:20:17.366643  6039 serialization.cc:72] Serialized kudu.rpc_test.PushStringsRequestPB (2147483654 bytes) is larger than the maximum configured RPC message size (52428800 bytes). Sending anyway, but peer may reject the data.
W20260926 16:20:17.377275  6295 connection.cc:535] server connection from unix:<unnamed> recv error: Network error: RPC frame had a length of 2147483714, but we only support messages up to 52428800 bytes long.
W20260926 16:20:17.377624  6295 connection.cc:158] shutting down server connection from unix:<unnamed> with pending inbound data: 4/2147483714 bytes received; last active 0 ns ago: status Network error: RPC frame had a length of 2147483714, but we only support messages up to 52428800 bytes long.
W20260926 16:20:17.378432  6311 connection.cc:698] client connection to unix:/tmp/dist-test-taskBnFvBi/test-tmp/rpc-test-859b783af78647f585b5e2a720c0563e.sock send error: Network error: failed to write to TLS socket: Broken pipe
W20260926 16:20:17.379118  6311 connection.cc:196] Error closing socket: Network error: TlsSocket::Close: Success
[       OK ] Parameters/TestRpc.TestRpcSidecarLimits/SSL_UnixSocket (17322 ms)
[ RUN      ] Parameters/TestRpc.TestCallTimeoutDoesntAffectNegotiation/SSL_UnixSocket
I20260926 16:20:18.219583  6323 acceptor_pool.cc:254] collecting diagnostics on the listening RPC socket unix:/tmp/dist-test-taskBnFvBi/test-tmp/rpc-test-a73f9fb26b1041e6b0043605e3ea738f.sock every 8 connection(s)
I20260926 16:20:18.220327  6324 acceptor_pool.cc:254] collecting diagnostics on the listening RPC socket unix:/tmp/dist-test-taskBnFvBi/test-tmp/rpc-test-a73f9fb26b1041e6b0043605e3ea738f.sock every 8 connection(s)
W20260926 16:20:18.250255  6319 negotiation.cc:266] Injecting 500ms delay in negotiation
I20260926 16:20:18.300753  6039 rpc-test-base.h:595] status: Timed out: connection negotiation to unix:/tmp/dist-test-taskBnFvBi/test-tmp/rpc-test-a73f9fb26b1041e6b0043605e3ea738f.sock for RPC Sleep timed out after 0.050s (ON_OUTBOUND_QUEUE), seconds elapsed: 0.0514702
W20260926 16:20:18.763550  6320 connection.cc:196] Error closing socket: Network error: TlsSocket::Close: Broken pipe
[       OK ] Parameters/TestRpc.TestCallTimeoutDoesntAffectNegotiation/SSL_UnixSocket (581 ms)
[ RUN      ] Parameters/TestRpc.TestRpcHandlerLatencyMetric/SSL_UnixSocket
I20260926 16:20:18.805910  6349 acceptor_pool.cc:254] collecting diagnostics on the listening RPC socket unix:/tmp/dist-test-taskBnFvBi/test-tmp/rpc-test-bd67848b63ef4596a6e64ac359f7e191.sock every 8 connection(s)
I20260926 16:20:18.806658  6350 acceptor_pool.cc:254] collecting diagnostics on the listening RPC socket unix:/tmp/dist-test-taskBnFvBi/test-tmp/rpc-test-bd67848b63ef4596a6e64ac359f7e191.sock every 8 connection(s)
I20260926 16:20:18.884280  6039 rpc-test.cc:1236] Sleep() min lat: 21529
I20260926 16:20:18.884486  6039 rpc-test.cc:1237] Sleep() mean lat: 21529
I20260926 16:20:18.884670  6039 rpc-test.cc:1238] Sleep() max lat: 21529
I20260926 16:20:18.884792  6039 rpc-test.cc:1239] Sleep() #calls: 1
W20260926 16:20:18.887835  6346 connection.cc:196] Error closing socket: Network error: TlsSocket::Close: Broken pipe
[       OK ] Parameters/TestRpc.TestRpcHandlerLatencyMetric/SSL_UnixSocket (115 ms)
[ RUN      ] Parameters/TestRpc.TimedOutOnResponseMetricServiceQueue/SSL_UnixSocket
I20260926 16:20:18.909557  6375 acceptor_pool.cc:254] collecting diagnostics on the listening RPC socket unix:/tmp/dist-test-taskBnFvBi/test-tmp/rpc-test-0b336ca559fc457db4bee762f69182b9.sock every 8 connection(s)
I20260926 16:20:18.910286  6376 acceptor_pool.cc:254] collecting diagnostics on the listening RPC socket unix:/tmp/dist-test-taskBnFvBi/test-tmp/rpc-test-0b336ca559fc457db4bee762f69182b9.sock every 8 connection(s)
W20260926 16:20:18.987397  6377 rpcz_store.cc:267] Call kudu.rpc_test.CalculatorService.Sleep from unix:<unnamed> (request call id 2) took 20 ms (client timeout 20 ms). Trace:
W20260926 16:20:18.987761  6377 rpcz_store.cc:269] 0926 16:20:18.966928 (+     0us) service_pool.cc:170] Inserting onto call queue
0926 16:20:18.987269 (+ 20341us) service_pool.cc:214] Skipping call since client already timed out
0926 16:20:18.987345 (+    76us) inbound_call.cc:173] Queueing failure response
Metrics: {}
W20260926 16:20:18.990139  6372 connection.cc:196] Error closing socket: Network error: TlsSocket::Close: Broken pipe
[       OK ] Parameters/TestRpc.TimedOutOnResponseMetricServiceQueue/SSL_UnixSocket (101 ms)
[ RUN      ] Parameters/TestRpc.RpcPendingConnectionsMetric/SSL_UnixSocket
I20260926 16:20:19.004778  6398 acceptor_pool.cc:254] collecting diagnostics on the listening RPC socket 0.0.0.0:41091 every 8 connection(s)
I20260926 16:20:19.005494  6399 acceptor_pool.cc:254] collecting diagnostics on the listening RPC socket 0.0.0.0:41091 every 8 connection(s)
W20260926 16:20:19.010442  6394 negotiation.cc:337] Failed RPC negotiation. Trace:
0926 16:20:19.009291 (+     0us) reactor.cc:625] Submitting negotiation task for server connection from 127.0.0.1:44122 (local address 127.0.0.1:41091)
0926 16:20:19.009665 (+   374us) server_negotiation.cc:206] Beginning negotiation
0926 16:20:19.009682 (+    17us) server_negotiation.cc:399] Waiting for connection header
0926 16:20:19.009918 (+   236us) negotiation.cc:327] Negotiation complete: Network error: Server connection negotiation failed: server connection from 127.0.0.1:44122: BlockingRecv error: recv got EOF from 127.0.0.1:44122 (error 108)
Metrics: {"server-negotiator.queue_time_us":96}
[       OK ] Parameters/TestRpc.RpcPendingConnectionsMetric/SSL_UnixSocket (29 ms)
[ RUN      ] Parameters/TestRpc.TestRpcContextClientDeadline/SSL_UnixSocket
I20260926 16:20:19.045915  6414 acceptor_pool.cc:254] collecting diagnostics on the listening RPC socket unix:/tmp/dist-test-taskBnFvBi/test-tmp/rpc-test-f6d69a2e1b5d433bbec1fd9429d64f92.sock every 8 connection(s)
I20260926 16:20:19.046665  6415 acceptor_pool.cc:254] collecting diagnostics on the listening RPC socket unix:/tmp/dist-test-taskBnFvBi/test-tmp/rpc-test-f6d69a2e1b5d433bbec1fd9429d64f92.sock every 8 connection(s)
W20260926 16:20:19.125330  6411 connection.cc:196] Error closing socket: Network error: TlsSocket::Close: Broken pipe
[       OK ] Parameters/TestRpc.TestRpcContextClientDeadline/SSL_UnixSocket (105 ms)
[ RUN      ] Parameters/TestRpc.TestApplicationFeatureFlagUnsupportedServer/SSL_UnixSocket
I20260926 16:20:19.147174  6439 acceptor_pool.cc:254] collecting diagnostics on the listening RPC socket unix:/tmp/dist-test-taskBnFvBi/test-tmp/rpc-test-33de689d49d64254b41ac1a9bf517a9b.sock every 8 connection(s)
I20260926 16:20:19.147886  6440 acceptor_pool.cc:254] collecting diagnostics on the listening RPC socket unix:/tmp/dist-test-taskBnFvBi/test-tmp/rpc-test-33de689d49d64254b41ac1a9bf517a9b.sock every 8 connection(s)
[       OK ] Parameters/TestRpc.TestApplicationFeatureFlagUnsupportedServer/SSL_UnixSocket (75 ms)
[ RUN      ] Parameters/TestRpc.TestCancellationAsync/SSL_UnixSocket
I20260926 16:20:19.232885  6464 acceptor_pool.cc:254] collecting diagnostics on the listening RPC socket unix:/tmp/dist-test-taskBnFvBi/test-tmp/rpc-test-5953771b9ab64cca9269dcecfdb320a0.sock every 8 connection(s)
I20260926 16:20:19.233613  6465 acceptor_pool.cc:254] collecting diagnostics on the listening RPC socket unix:/tmp/dist-test-taskBnFvBi/test-tmp/rpc-test-5953771b9ab64cca9269dcecfdb320a0.sock every 8 connection(s)
I20260926 16:20:19.236806  6039 rpc-test.cc:1716] Connecting to unix:/tmp/dist-test-taskBnFvBi/test-tmp/rpc-test-5953771b9ab64cca9269dcecfdb320a0.sock
I20260926 16:20:19.261967  6039 test_util.cc:268] Using random seed: 897545717
I20260926 16:20:19.480690  6468 rpc-test-base.h:240] got call: sleep_micros: 500 pattern: 4294967295 num_repetitions: 2097152 sidecar_idx: 0
I20260926 16:20:19.696802  6467 rpc-test-base.h:240] got call: sleep_micros: 500 pattern: 4294967295 num_repetitions: 2097152 sidecar_idx: 0
I20260926 16:20:19.909319  6468 rpc-test-base.h:240] got call: sleep_micros: 500 pattern: 4294967295 num_repetitions: 2097152 sidecar_idx: 0
I20260926 16:20:20.117085  6468 rpc-test-base.h:240] got call: sleep_micros: 500 pattern: 4294967295 num_repetitions: 2097152 sidecar_idx: 0
I20260926 16:20:20.330138  6468 rpc-test-base.h:240] got call: sleep_micros: 500 pattern: 4294967295 num_repetitions: 2097152 sidecar_idx: 0
I20260926 16:20:20.516646  6467 rpc-test-base.h:240] got call: sleep_micros: 500 pattern: 4294967295 num_repetitions: 2097152 sidecar_idx: 0
I20260926 16:20:20.730575  6467 rpc-test-base.h:240] got call: sleep_micros: 500 pattern: 4294967295 num_repetitions: 2097152 sidecar_idx: 0
I20260926 16:20:20.955117  6467 rpc-test-base.h:240] got call: sleep_micros: 500 pattern: 4294967295 num_repetitions: 2097152 sidecar_idx: 0
I20260926 16:20:21.156800  6468 rpc-test-base.h:240] got call: sleep_micros: 500 pattern: 4294967295 num_repetitions: 2097152 sidecar_idx: 0
W20260926 16:20:21.186400  6461 connection.cc:196] Error closing socket: Network error: TlsSocket::Close: Broken pipe
W20260926 16:20:21.198153  6461 connection.cc:441] server connection from unix:<unnamed> torn down before Call kudu.rpc.GenericCalculatorService.SleepWithSidecar from unix:<unnamed> (request call id 8) could send its response
W20260926 16:20:21.294878  6461 connection.cc:441] server connection from unix:<unnamed> torn down before Call kudu.rpc.GenericCalculatorService.SleepWithSidecar from unix:<unnamed> (request call id 9) could send its response
[       OK ] Parameters/TestRpc.TestCancellationAsync/SSL_UnixSocket (2097 ms)
[ RUN      ] Parameters/TestRpc.TestPerformanceBySocketType/SSL_UnixSocket
I20260926 16:20:21.395615  6489 acceptor_pool.cc:254] collecting diagnostics on the listening RPC socket unix:/tmp/dist-test-taskBnFvBi/test-tmp/rpc-test-5e44b56d62224b8db40269c01e96772b.sock every 8 connection(s)
I20260926 16:20:21.396399  6490 acceptor_pool.cc:254] collecting diagnostics on the listening RPC socket unix:/tmp/dist-test-taskBnFvBi/test-tmp/rpc-test-5e44b56d62224b8db40269c01e96772b.sock every 8 connection(s)
I20260926 16:20:21.399462  6039 rpc-test.cc:1846] Connecting to unix:/tmp/dist-test-taskBnFvBi/test-tmp/rpc-test-5e44b56d62224b8db40269c01e96772b.sock
I20260926 16:20:42.719486  6039 rpc-test.cc:1859] Sending 1024MB via ssl-enabled unix socket: real 21.298s	user 19.081s	sys 12.867s
I20260926 16:21:03.866868  6039 rpc-test.cc:1859] Sending 1024MB via ssl-enabled unix socket: real 21.147s	user 18.563s	sys 13.040s
I20260926 16:21:25.019584  6039 rpc-test.cc:1859] Sending 1024MB via ssl-enabled unix socket: real 21.152s	user 18.781s	sys 12.803s
I20260926 16:21:46.195775  6039 rpc-test.cc:1859] Sending 1024MB via ssl-enabled unix socket: real 21.176s	user 18.631s	sys 12.992s
I20260926 16:22:07.474663  6039 rpc-test.cc:1859] Sending 1024MB via ssl-enabled unix socket: real 21.278s	user 18.533s	sys 13.228s
W20260926 16:22:07.480969  6486 connection.cc:196] Error closing socket: Network error: TlsSocket::Close: Broken pipe
[       OK ] Parameters/TestRpc.TestPerformanceBySocketType/SSL_UnixSocket (106188 ms)
[----------] 20 tests from Parameters/TestRpc (269220 ms total)

[----------] 1 test from Parameters/TestRpcSocketTxRxQueue
[ RUN      ] Parameters/TestRpcSocketTxRxQueue.AcceptorRxQueueSizeMetric/0
I20260926 16:22:07.503450  6524 acceptor_pool.cc:254] collecting diagnostics on the listening RPC socket 0.0.0.0:40401 every 1 connection(s)
I20260926 16:22:07.504433  6525 acceptor_pool.cc:254] collecting diagnostics on the listening RPC socket 0.0.0.0:40401 every 1 connection(s)
W20260926 16:22:07.509516  6520 negotiation.cc:337] Failed RPC negotiation. Trace:
0926 16:22:07.508146 (+     0us) reactor.cc:625] Submitting negotiation task for server connection from 127.0.0.1:43820 (local address 127.0.0.1:40401)
0926 16:22:07.508621 (+   475us) server_negotiation.cc:206] Beginning negotiation
0926 16:22:07.508645 (+    24us) server_negotiation.cc:399] Waiting for connection header
0926 16:22:07.508883 (+   238us) negotiation.cc:327] Negotiation complete: Network error: Server connection negotiation failed: server connection from 127.0.0.1:43820: BlockingRecv error: recv got EOF from 127.0.0.1:43820 (error 108)
Metrics: {"server-negotiator.queue_time_us":133}
[       OK ] Parameters/TestRpcSocketTxRxQueue.AcceptorRxQueueSizeMetric/0 (24 ms)
[----------] 1 test from Parameters/TestRpcSocketTxRxQueue (24 ms total)

[----------] Global test environment tear-down
[==========] 21 tests from 2 test suites ran. (269245 ms total)
[  PASSED  ] 20 tests.
[  FAILED  ] 1 test, listed below:
[  FAILED  ] Parameters/TestRpc.TestCallWithChainCertAndChainCA/SSL_UnixSocket, where GetParam() = (true, true)

 1 FAILED TEST