Diagnosed failure

Parameters/TestRpc.TestCallWithChainCertAndChainCA/SSL_TCP: /data0/somelongdirectorytoavoidrpathissues/src/kudu/src/kudu/rpc/rpc-test.cc:270: Failure
Failed
Bad status: Runtime error: could not verify certificate chain (error with cert: subject=CN = localhost, ST = sadfjas, C = AS, emailAddress = sdflkdsajf, O = lskdfjlsad, OU = sldfkja, issuer=C = AS, ST = ASDfkjdhf, L = lskdjf, O = saldfja, OU = skdjf, CN = localhost, emailAddress = sadjflkadsj): : certificate has expired
Google Test trace:
/data0/somelongdirectorytoavoidrpathissues/src/kudu/src/kudu/rpc/rpc-test.cc:267: Connecting to 0.0.0.0:35053
I20260924 07:12:45.975298 20353 test_util.cc:175] -----------------------------------------------
I20260924 07:12:45.975363 20353 test_util.cc:176] Had fatal failures, leaving test files at /tmp/dist-test-taskiUFO_E/test-tmp/rpc-test.5.Parameters_TestRpc.TestCallWithChainCertAndChainCA_SSL_TCP.1790233965912808-20353-0

Full log

Note: This is test shard 6 of 8.
[==========] Running 21 tests from 2 test suites.
[----------] Global test environment set-up.
[----------] 20 tests from Parameters/TestRpc
[ RUN      ] Parameters/TestRpc.TestMessengerCreateDestroy/SSL_TCP
WARNING: Logging before InitGoogleLogging() is written to STDERR
I20260924 07:12:45.941928 20353 rpc-test.cc:169] started messenger TestCreateDestroy
[       OK ] Parameters/TestRpc.TestMessengerCreateDestroy/SSL_TCP (27 ms)
[ RUN      ] Parameters/TestRpc.TestNegotiationDeadlock/SSL_TCP
I20260924 07:12:45.949717 20374 acceptor_pool.cc:254] collecting diagnostics on the listening RPC socket 0.0.0.0:43019 every 8 connection(s)
I20260924 07:12:45.949710 20373 acceptor_pool.cc:254] collecting diagnostics on the listening RPC socket 0.0.0.0:43019 every 8 connection(s)
[       OK ] Parameters/TestRpc.TestNegotiationDeadlock/SSL_TCP (14 ms)
[ RUN      ] Parameters/TestRpc.TestCallWithChainCertAndChainCA/SSL_TCP
I20260924 07:12:45.970882 20389 acceptor_pool.cc:254] collecting diagnostics on the listening RPC socket 0.0.0.0:35053 every 8 connection(s)
I20260924 07:12:45.970908 20390 acceptor_pool.cc:254] collecting diagnostics on the listening RPC socket 0.0.0.0:35053 every 8 connection(s)
/data0/somelongdirectorytoavoidrpathissues/src/kudu/src/kudu/rpc/rpc-test.cc:270: Failure
Failed
Bad status: Runtime error: could not verify certificate chain (error with cert: subject=CN = localhost, ST = sadfjas, C = AS, emailAddress = sdflkdsajf, O = lskdfjlsad, OU = sldfkja, issuer=C = AS, ST = ASDfkjdhf, L = lskdjf, O = saldfja, OU = skdjf, CN = localhost, emailAddress = sadjflkadsj): : certificate has expired
Google Test trace:
/data0/somelongdirectorytoavoidrpathissues/src/kudu/src/kudu/rpc/rpc-test.cc:267: Connecting to 0.0.0.0:35053
I20260924 07:12:45.975298 20353 test_util.cc:175] -----------------------------------------------
I20260924 07:12:45.975363 20353 test_util.cc:176] Had fatal failures, leaving test files at /tmp/dist-test-taskiUFO_E/test-tmp/rpc-test.5.Parameters_TestRpc.TestCallWithChainCertAndChainCA_SSL_TCP.1790233965912808-20353-0
[  FAILED  ] Parameters/TestRpc.TestCallWithChainCertAndChainCA/SSL_TCP, where GetParam() = (true, false) (17 ms)
[ RUN      ] Parameters/TestRpc.TestCallWithPasswordProtectedKey/SSL_TCP
I20260924 07:12:45.993465 20414 acceptor_pool.cc:254] collecting diagnostics on the listening RPC socket 0.0.0.0:36525 every 8 connection(s)
I20260924 07:12:45.993505 20415 acceptor_pool.cc:254] collecting diagnostics on the listening RPC socket 0.0.0.0:36525 every 8 connection(s)
[       OK ] Parameters/TestRpc.TestCallWithPasswordProtectedKey/SSL_TCP (32 ms)
[ RUN      ] Parameters/TestRpc.TestCallToBadServer/SSL_TCP
I20260924 07:12:46.019052 20353 rpc-test.cc:394] Status: Network error: Client connection negotiation failed: client connection to 0.0.0.0:0: connect: Connection refused (error 111)
I20260924 07:12:46.019413 20353 rpc-test.cc:394] Status: Network error: Client connection negotiation failed: client connection to 0.0.0.0:0: connect: Connection refused (error 111)
I20260924 07:12:46.019887 20353 rpc-test.cc:394] Status: Network error: Client connection negotiation failed: client connection to 0.0.0.0:0: connect: Connection refused (error 111)
I20260924 07:12:46.020460 20353 rpc-test.cc:394] Status: Network error: Client connection negotiation failed: client connection to 0.0.0.0:0: connect: Connection refused (error 111)
I20260924 07:12:46.020855 20353 rpc-test.cc:394] Status: Network error: Client connection negotiation failed: client connection to 0.0.0.0:0: connect: Connection refused (error 111)
[       OK ] Parameters/TestRpc.TestCallToBadServer/SSL_TCP (13 ms)
[ RUN      ] Parameters/TestRpc.TestWrongService/SSL_TCP
I20260924 07:12:46.030790 20449 acceptor_pool.cc:254] collecting diagnostics on the listening RPC socket 0.0.0.0:34261 every 8 connection(s)
I20260924 07:12:46.030800 20450 acceptor_pool.cc:254] collecting diagnostics on the listening RPC socket 0.0.0.0:34261 every 8 connection(s)
I20260924 07:12:46.045091 20447 messenger.cc:345] service WrongServiceName not registered on TestServer
[       OK ] Parameters/TestRpc.TestWrongService/SSL_TCP (25 ms)
[ RUN      ] Parameters/TestRpc.TestConnectionKeepalive/SSL_TCP
I20260924 07:12:46.076323 20472 acceptor_pool.cc:254] collecting diagnostics on the listening RPC socket 0.0.0.0:35207 every 8 connection(s)
I20260924 07:12:46.076378 20473 acceptor_pool.cc:254] collecting diagnostics on the listening RPC socket 0.0.0.0:35207 every 8 connection(s)
I20260924 07:12:46.076589 20353 rpc-test.cc:488] Connecting to 0.0.0.0:35207
[       OK ] Parameters/TestRpc.TestConnectionKeepalive/SSL_TCP (1093 ms)
[ RUN      ] Parameters/TestRpc.TestClientConnectionMetrics/SSL_TCP
I20260924 07:12:47.155782 20497 acceptor_pool.cc:254] collecting diagnostics on the listening RPC socket 0.0.0.0:38869 every 8 connection(s)
I20260924 07:12:47.155813 20498 acceptor_pool.cc:254] collecting diagnostics on the listening RPC socket 0.0.0.0:38869 every 8 connection(s)
I20260924 07:12:47.155983 20353 rpc-test.cc:569] Connecting to 0.0.0.0:38869
[       OK ] Parameters/TestRpc.TestClientConnectionMetrics/SSL_TCP (11242 ms)
[ RUN      ] Parameters/TestRpc.TestCredentialsPolicy/SSL_TCP
I20260924 07:12:58.392230 20520 acceptor_pool.cc:254] collecting diagnostics on the listening RPC socket 0.0.0.0:35475 every 8 connection(s)
I20260924 07:12:58.392403 20521 acceptor_pool.cc:254] collecting diagnostics on the listening RPC socket 0.0.0.0:35475 every 8 connection(s)
I20260924 07:12:58.392573 20353 rpc-test.cc:700] Connecting to 0.0.0.0:35475
[       OK ] Parameters/TestRpc.TestCredentialsPolicy/SSL_TCP (29 ms)
[ RUN      ] Parameters/TestRpc.TestCallLongerThanKeepalive/SSL_TCP
I20260924 07:12:58.424137 20545 acceptor_pool.cc:254] collecting diagnostics on the listening RPC socket 0.0.0.0:35163 every 8 connection(s)
I20260924 07:12:58.424176 20546 acceptor_pool.cc:254] collecting diagnostics on the listening RPC socket 0.0.0.0:35163 every 8 connection(s)
I20260924 07:12:58.444732 20549 rpc-test-base.h:222] got call: sleep_micros: 3000000 deferred: true
I20260924 07:13:01.445441 20549 rpcz_store.cc:275] Call kudu.rpc.GenericCalculatorService.Sleep from 127.0.0.1:54768 (request call id 0) took 3000 ms. Trace:
I20260924 07:13:01.445556 20549 rpcz_store.cc:276] 0924 07:12:58.444659 (+     0us) service_pool.cc:170] Inserting onto call queue
0924 07:12:58.444697 (+    38us) service_pool.cc:227] Handling call
0924 07:13:01.445425 (+3000728us) inbound_call.cc:173] Queueing success response
Metrics: {}
[       OK ] Parameters/TestRpc.TestCallLongerThanKeepalive/SSL_TCP (3034 ms)
[ RUN      ] Parameters/TestRpc.TestRpcSidecar/SSL_TCP
I20260924 07:13:01.466243 20570 acceptor_pool.cc:254] collecting diagnostics on the listening RPC socket 0.0.0.0:33637 every 8 connection(s)
I20260924 07:13:01.466275 20571 acceptor_pool.cc:254] collecting diagnostics on the listening RPC socket 0.0.0.0:33637 every 8 connection(s)
[       OK ] Parameters/TestRpc.TestRpcSidecar/SSL_TCP (59 ms)
[ RUN      ] Parameters/TestRpc.TestRpcSidecarLimits/SSL_TCP
I20260924 07:13:03.117241 20596 acceptor_pool.cc:254] collecting diagnostics on the listening RPC socket 0.0.0.0:41745 every 8 connection(s)
I20260924 07:13:03.117460 20595 acceptor_pool.cc:254] collecting diagnostics on the listening RPC socket 0.0.0.0:41745 every 8 connection(s)
W20260924 07:13:03.144574 20353 serialization.cc:72] Serialized kudu.rpc_test.PushStringsRequestPB (2147483654 bytes) is larger than the maximum configured RPC message size (52428800 bytes). Sending anyway, but peer may reject the data.
W20260924 07:13:03.148203 20594 connection.cc:535] server connection from 127.0.0.1:55738 recv error: Network error: RPC frame had a length of 2147483714, but we only support messages up to 52428800 bytes long.
W20260924 07:13:03.148288 20594 connection.cc:158] shutting down server connection from 127.0.0.1:55738 with pending inbound data: 4/2147483714 bytes received; last active 0 ns ago: status Network error: RPC frame had a length of 2147483714, but we only support messages up to 52428800 bytes long.
W20260924 07:13:03.148520 20608 connection.cc:196] Error closing socket: Network error: TlsSocket::Close: Connection reset by peer
I20260924 07:13:03.174614 20620 acceptor_pool.cc:254] collecting diagnostics on the listening RPC socket 0.0.0.0:34921 every 8 connection(s)
I20260924 07:13:03.174628 20621 acceptor_pool.cc:254] collecting diagnostics on the listening RPC socket 0.0.0.0:34921 every 8 connection(s)
W20260924 07:13:06.846223 20617 connection.cc:577] server connection from 127.0.0.1:58488: received bad data: 'Corruption: Invalid packet: message had a length of 2147483710, but we only support messages up to 2147483647 bytes
'
[       OK ] Parameters/TestRpc.TestRpcSidecarLimits/SSL_TCP (5341 ms)
[ RUN      ] Parameters/TestRpc.TestCallTimeoutDoesntAffectNegotiation/SSL_TCP
I20260924 07:13:06.870436 20646 acceptor_pool.cc:254] collecting diagnostics on the listening RPC socket 0.0.0.0:39719 every 8 connection(s)
I20260924 07:13:06.870411 20645 acceptor_pool.cc:254] collecting diagnostics on the listening RPC socket 0.0.0.0:39719 every 8 connection(s)
W20260924 07:13:06.876268 20641 negotiation.cc:266] Injecting 500ms delay in negotiation
I20260924 07:13:06.926630 20353 rpc-test-base.h:595] status: Timed out: connection negotiation to 0.0.0.0:39719 for RPC Sleep timed out after 0.050s (ON_OUTBOUND_QUEUE), seconds elapsed: 0.0507124
[       OK ] Parameters/TestRpc.TestCallTimeoutDoesntAffectNegotiation/SSL_TCP (532 ms)
[ RUN      ] Parameters/TestRpc.TestRpcHandlerLatencyMetric/SSL_TCP
I20260924 07:13:07.396337 20670 acceptor_pool.cc:254] collecting diagnostics on the listening RPC socket 0.0.0.0:36107 every 8 connection(s)
I20260924 07:13:07.396387 20671 acceptor_pool.cc:254] collecting diagnostics on the listening RPC socket 0.0.0.0:36107 every 8 connection(s)
I20260924 07:13:07.445786 20353 rpc-test.cc:1236] Sleep() min lat: 20328
I20260924 07:13:07.445863 20353 rpc-test.cc:1237] Sleep() mean lat: 20328
I20260924 07:13:07.445894 20353 rpc-test.cc:1238] Sleep() max lat: 20328
I20260924 07:13:07.445907 20353 rpc-test.cc:1239] Sleep() #calls: 1
[       OK ] Parameters/TestRpc.TestRpcHandlerLatencyMetric/SSL_TCP (65 ms)
[ RUN      ] Parameters/TestRpc.TimedOutOnResponseMetricServiceQueue/SSL_TCP
I20260924 07:13:07.459676 20696 acceptor_pool.cc:254] collecting diagnostics on the listening RPC socket 0.0.0.0:36735 every 8 connection(s)
I20260924 07:13:07.459699 20697 acceptor_pool.cc:254] collecting diagnostics on the listening RPC socket 0.0.0.0:36735 every 8 connection(s)
W20260924 07:13:07.528697 20698 rpcz_store.cc:267] Call kudu.rpc_test.CalculatorService.Sleep from 127.0.0.1:46734 (request call id 2) took 20 ms (client timeout 20 ms). Trace:
W20260924 07:13:07.528792 20698 rpcz_store.cc:269] 0924 07:13:07.508395 (+     0us) service_pool.cc:170] Inserting onto call queue
0924 07:13:07.528667 (+ 20272us) service_pool.cc:214] Skipping call since client already timed out
0924 07:13:07.528681 (+    14us) inbound_call.cc:173] Queueing failure response
Metrics: {}
[       OK ] Parameters/TestRpc.TimedOutOnResponseMetricServiceQueue/SSL_TCP (82 ms)
[ RUN      ] Parameters/TestRpc.RpcPendingConnectionsMetric/SSL_TCP
I20260924 07:13:07.532529 20719 acceptor_pool.cc:254] collecting diagnostics on the listening RPC socket 0.0.0.0:39063 every 8 connection(s)
I20260924 07:13:07.532579 20720 acceptor_pool.cc:254] collecting diagnostics on the listening RPC socket 0.0.0.0:39063 every 8 connection(s)
W20260924 07:13:07.533246 20715 negotiation.cc:337] Failed RPC negotiation. Trace:
0924 07:13:07.533014 (+     0us) reactor.cc:625] Submitting negotiation task for server connection from 127.0.0.1:44506 (local address 127.0.0.1:39063)
0924 07:13:07.533088 (+    74us) server_negotiation.cc:206] Beginning negotiation
0924 07:13:07.533090 (+     2us) server_negotiation.cc:399] Waiting for connection header
0924 07:13:07.533195 (+   105us) negotiation.cc:327] Negotiation complete: Network error: Server connection negotiation failed: server connection from 127.0.0.1:44506: BlockingRecv error: recv got EOF from 127.0.0.1:44506 (error 108)
Metrics: {"server-negotiator.queue_time_us":42}
[       OK ] Parameters/TestRpc.RpcPendingConnectionsMetric/SSL_TCP (13 ms)
[ RUN      ] Parameters/TestRpc.TestRpcContextClientDeadline/SSL_TCP
I20260924 07:13:07.558718 20735 acceptor_pool.cc:254] collecting diagnostics on the listening RPC socket 0.0.0.0:34011 every 8 connection(s)
I20260924 07:13:07.558754 20736 acceptor_pool.cc:254] collecting diagnostics on the listening RPC socket 0.0.0.0:34011 every 8 connection(s)
[       OK ] Parameters/TestRpc.TestRpcContextClientDeadline/SSL_TCP (51 ms)
[ RUN      ] Parameters/TestRpc.TestApplicationFeatureFlagUnsupportedServer/SSL_TCP
I20260924 07:13:07.607478 20760 acceptor_pool.cc:254] collecting diagnostics on the listening RPC socket 0.0.0.0:35515 every 8 connection(s)
I20260924 07:13:07.607527 20761 acceptor_pool.cc:254] collecting diagnostics on the listening RPC socket 0.0.0.0:35515 every 8 connection(s)
[       OK ] Parameters/TestRpc.TestApplicationFeatureFlagUnsupportedServer/SSL_TCP (31 ms)
[ RUN      ] Parameters/TestRpc.TestCancellationAsync/SSL_TCP
I20260924 07:13:07.660197 20785 acceptor_pool.cc:254] collecting diagnostics on the listening RPC socket 0.0.0.0:41423 every 8 connection(s)
I20260924 07:13:07.660221 20786 acceptor_pool.cc:254] collecting diagnostics on the listening RPC socket 0.0.0.0:41423 every 8 connection(s)
I20260924 07:13:07.660377 20353 rpc-test.cc:1716] Connecting to 0.0.0.0:41423
I20260924 07:13:07.670176 20353 test_util.cc:268] Using random seed: 1424384156
I20260924 07:13:07.687176 20788 rpc-test-base.h:240] got call: sleep_micros: 500 pattern: 4294967295 num_repetitions: 2097152 sidecar_idx: 0
I20260924 07:13:07.699879 20788 rpc-test-base.h:240] got call: sleep_micros: 500 pattern: 4294967295 num_repetitions: 2097152 sidecar_idx: 0
I20260924 07:13:07.713898 20788 rpc-test-base.h:240] got call: sleep_micros: 500 pattern: 4294967295 num_repetitions: 2097152 sidecar_idx: 0
I20260924 07:13:07.727946 20788 rpc-test-base.h:240] got call: sleep_micros: 500 pattern: 4294967295 num_repetitions: 2097152 sidecar_idx: 0
I20260924 07:13:07.741891 20788 rpc-test-base.h:240] got call: sleep_micros: 500 pattern: 4294967295 num_repetitions: 2097152 sidecar_idx: 0
I20260924 07:13:07.756160 20788 rpc-test-base.h:240] got call: sleep_micros: 500 pattern: 4294967295 num_repetitions: 2097152 sidecar_idx: 0
I20260924 07:13:07.770277 20788 rpc-test-base.h:240] got call: sleep_micros: 500 pattern: 4294967295 num_repetitions: 2097152 sidecar_idx: 0
I20260924 07:13:07.783813 20788 rpc-test-base.h:240] got call: sleep_micros: 500 pattern: 4294967295 num_repetitions: 2097152 sidecar_idx: 0
W20260924 07:13:07.787303 20784 connection.cc:441] server connection from 127.0.0.1:57780 torn down before Call kudu.rpc.GenericCalculatorService.SleepWithSidecar from 127.0.0.1:57780 (request call id 9) could send its response
[       OK ] Parameters/TestRpc.TestCancellationAsync/SSL_TCP (161 ms)
[ RUN      ] Parameters/TestRpc.TestPerformanceBySocketType/SSL_TCP
I20260924 07:13:07.811378 20810 acceptor_pool.cc:254] collecting diagnostics on the listening RPC socket 0.0.0.0:43749 every 8 connection(s)
I20260924 07:13:07.811399 20811 acceptor_pool.cc:254] collecting diagnostics on the listening RPC socket 0.0.0.0:43749 every 8 connection(s)
I20260924 07:13:07.811563 20353 rpc-test.cc:1846] Connecting to 0.0.0.0:43749
I20260924 07:13:09.684799 20353 rpc-test.cc:1859] Sending 1024MB via ssl-enabled tcp socket: real 1.861s	user 1.711s	sys 1.549s
I20260924 07:13:11.584626 20353 rpc-test.cc:1859] Sending 1024MB via ssl-enabled tcp socket: real 1.900s	user 1.717s	sys 1.608s
I20260924 07:13:13.396842 20353 rpc-test.cc:1859] Sending 1024MB via ssl-enabled tcp socket: real 1.812s	user 1.716s	sys 1.479s
I20260924 07:13:15.269680 20353 rpc-test.cc:1859] Sending 1024MB via ssl-enabled tcp socket: real 1.873s	user 1.745s	sys 1.547s
I20260924 07:13:17.115350 20353 rpc-test.cc:1859] Sending 1024MB via ssl-enabled tcp socket: real 1.846s	user 1.720s	sys 1.526s
[       OK ] Parameters/TestRpc.TestPerformanceBySocketType/SSL_TCP (9329 ms)
[----------] 20 tests from Parameters/TestRpc (31202 ms total)

[----------] 1 test from Parameters/TestRpcSocketTxRxQueue
[ RUN      ] Parameters/TestRpcSocketTxRxQueue.OverCapacity/0
W20260924 07:13:17.385584 20826 negotiation.cc:337] Failed RPC negotiation. Trace:
0924 07:13:17.120011 (+     0us) reactor.cc:625] Submitting negotiation task for client connection to 0.0.0.0:43071 (local address 127.0.0.1:58826)
0924 07:13:17.120126 (+   115us) negotiation.cc:107] Waiting for socket to connect
0924 07:13:17.120136 (+    10us) client_negotiation.cc:174] Beginning negotiation
0924 07:13:17.120188 (+    52us) client_negotiation.cc:252] Sending NEGOTIATE NegotiatePB request
0924 07:13:17.385418 (+265230us) negotiation.cc:327] Negotiation complete: Network error: Client connection negotiation failed: client connection to 0.0.0.0:43071: BlockingRecv error: recv error from unknown peer: Transport endpoint is not connected (error 107)
Metrics: {"client-negotiator.queue_time_us":86}
W20260924 07:13:17.385608 20863 negotiation.cc:337] Failed RPC negotiation. Trace:
0924 07:13:17.124504 (+     0us) reactor.cc:625] Submitting negotiation task for client connection to 0.0.0.0:43071 (local address 127.0.0.1:58868)
0924 07:13:17.124663 (+   159us) negotiation.cc:107] Waiting for socket to connect
0924 07:13:17.124672 (+     9us) client_negotiation.cc:174] Beginning negotiation
0924 07:13:17.124716 (+    44us) client_negotiation.cc:252] Sending NEGOTIATE NegotiatePB request
0924 07:13:17.385530 (+260814us) negotiation.cc:327] Negotiation complete: Network error: Client connection negotiation failed: client connection to 0.0.0.0:43071: BlockingRecv error: recv error from unknown peer: Transport endpoint is not connected (error 107)
Metrics: {"client-negotiator.queue_time_us":136}
W20260924 07:13:17.385784 20836 negotiation.cc:337] Failed RPC negotiation. Trace:
0924 07:13:17.120957 (+     0us) reactor.cc:625] Submitting negotiation task for client connection to 0.0.0.0:43071 (local address 127.0.0.1:58830)
0924 07:13:17.121033 (+    76us) negotiation.cc:107] Waiting for socket to connect
0924 07:13:17.121043 (+    10us) client_negotiation.cc:174] Beginning negotiation
0924 07:13:17.121089 (+    46us) client_negotiation.cc:252] Sending NEGOTIATE NegotiatePB request
0924 07:13:17.385417 (+264328us) negotiation.cc:327] Negotiation complete: Network error: Client connection negotiation failed: client connection to 0.0.0.0:43071: BlockingRecv error: recv error from unknown peer: Transport endpoint is not connected (error 107)
Metrics: {"client-negotiator.queue_time_us":49}
W20260924 07:13:17.385625 20854 negotiation.cc:337] Failed RPC negotiation. Trace:
0924 07:13:17.123486 (+     0us) reactor.cc:625] Submitting negotiation task for client connection to 0.0.0.0:43071 (local address 127.0.0.1:58858)
0924 07:13:17.123524 (+    38us) negotiation.cc:107] Waiting for socket to connect
0924 07:13:17.123532 (+     8us) client_negotiation.cc:174] Beginning negotiation
0924 07:13:17.123572 (+    40us) client_negotiation.cc:252] Sending NEGOTIATE NegotiatePB request
0924 07:13:17.385579 (+262007us) negotiation.cc:327] Negotiation complete: Network error: Client connection negotiation failed: client connection to 0.0.0.0:43071: BlockingRecv error: recv error from unknown peer: Transport endpoint is not connected (error 107)
Metrics: {"client-negotiator.queue_time_us":19}
W20260924 07:13:17.385584 20872 negotiation.cc:337] Failed RPC negotiation. Trace:
0924 07:13:17.125414 (+     0us) reactor.cc:625] Submitting negotiation task for client connection to 0.0.0.0:43071 (local address 127.0.0.1:58882)
0924 07:13:17.125479 (+    65us) negotiation.cc:107] Waiting for socket to connect
0924 07:13:17.125488 (+     9us) client_negotiation.cc:174] Beginning negotiation
0924 07:13:17.125530 (+    42us) client_negotiation.cc:252] Sending NEGOTIATE NegotiatePB request
0924 07:13:17.385473 (+259943us) negotiation.cc:327] Negotiation complete: Network error: Client connection negotiation failed: client connection to 0.0.0.0:43071: BlockingRecv error: recv error from unknown peer: Transport endpoint is not connected (error 107)
Metrics: {"client-negotiator.queue_time_us":43}
W20260924 07:13:17.386045 20845 negotiation.cc:337] Failed RPC negotiation. Trace:
0924 07:13:17.122203 (+     0us) reactor.cc:625] Submitting negotiation task for client connection to 0.0.0.0:43071 (local address 127.0.0.1:58842)
0924 07:13:17.122250 (+    47us) negotiation.cc:107] Waiting for socket to connect
0924 07:13:17.122261 (+    11us) client_negotiation.cc:174] Beginning negotiation
0924 07:13:17.122324 (+    63us) client_negotiation.cc:252] Sending NEGOTIATE NegotiatePB request
0924 07:13:17.385417 (+263093us) negotiation.cc:327] Negotiation complete: Network error: Client connection negotiation failed: client connection to 0.0.0.0:43071: BlockingRecv error: recv error from unknown peer: Transport endpoint is not connected (error 107)
Metrics: {"client-negotiator.queue_time_us":20}
[       OK ] Parameters/TestRpcSocketTxRxQueue.OverCapacity/0 (1025 ms)
[----------] 1 test from Parameters/TestRpcSocketTxRxQueue (1025 ms total)

[----------] Global test environment tear-down
[==========] 21 tests from 2 test suites ran. (32228 ms total)
[  PASSED  ] 20 tests.
[  FAILED  ] 1 test, listed below:
[  FAILED  ] Parameters/TestRpc.TestCallWithChainCertAndChainCA/SSL_TCP, where GetParam() = (true, false)

 1 FAILED TEST