Diagnosed failure
Parameters/TestRpc.TestCallWithChainCertAndChainCA/SSL_UnixSocket: /data0/somelongdirectorytoavoidrpathissues/src/kudu/src/kudu/rpc/rpc-test.cc:270: Failure
Failed
Bad status: Runtime error: could not verify certificate chain (error with cert: subject=CN = localhost, ST = sadfjas, C = AS, emailAddress = sdflkdsajf, O = lskdfjlsad, OU = sldfkja, issuer=C = AS, ST = ASDfkjdhf, L = lskdjf, O = saldfja, OU = skdjf, CN = localhost, emailAddress = sadjflkadsj): : certificate has expired
Google Test trace:
/data0/somelongdirectorytoavoidrpathissues/src/kudu/src/kudu/rpc/rpc-test.cc:267: Connecting to unix:/tmp/dist-test-taskX73JxG/test-tmp/rpc-test-65c4bfa5481e48afbdc33494dc5c232e.sock
I20260928 22:45:43.414134 383 test_util.cc:175] -----------------------------------------------
I20260928 22:45:43.414280 383 test_util.cc:176] Had fatal failures, leaving test files at /tmp/dist-test-taskX73JxG/test-tmp/rpc-test.6.Parameters_TestRpc.TestCallWithChainCertAndChainCA_SSL_UnixSocket.1790635543318136-383-0
Full log
Note: This is test shard 7 of 8.
[==========] Running 21 tests from 2 test suites.
[----------] Global test environment set-up.
[----------] 20 tests from Parameters/TestRpc
[ RUN ] Parameters/TestRpc.TestMessengerCreateDestroy/SSL_UnixSocket
WARNING: Logging before InitGoogleLogging() is written to STDERR
I20260928 22:45:43.344808 383 rpc-test.cc:169] started messenger TestCreateDestroy
[ OK ] Parameters/TestRpc.TestMessengerCreateDestroy/SSL_UnixSocket (25 ms)
[ RUN ] Parameters/TestRpc.TestNegotiationDeadlock/SSL_UnixSocket
I20260928 22:45:43.384676 404 acceptor_pool.cc:254] collecting diagnostics on the listening RPC socket unix:/tmp/dist-test-taskX73JxG/test-tmp/rpc-test-9c7df718182b4712819c277289a697e2.sock every 8 connection(s)
I20260928 22:45:43.384677 403 acceptor_pool.cc:254] collecting diagnostics on the listening RPC socket unix:/tmp/dist-test-taskX73JxG/test-tmp/rpc-test-9c7df718182b4712819c277289a697e2.sock every 8 connection(s)
[ OK ] Parameters/TestRpc.TestNegotiationDeadlock/SSL_UnixSocket (47 ms)
[ RUN ] Parameters/TestRpc.TestCallWithChainCertAndChainCA/SSL_UnixSocket
I20260928 22:45:43.409088 419 acceptor_pool.cc:254] collecting diagnostics on the listening RPC socket unix:/tmp/dist-test-taskX73JxG/test-tmp/rpc-test-65c4bfa5481e48afbdc33494dc5c232e.sock every 8 connection(s)
I20260928 22:45:43.409123 420 acceptor_pool.cc:254] collecting diagnostics on the listening RPC socket unix:/tmp/dist-test-taskX73JxG/test-tmp/rpc-test-65c4bfa5481e48afbdc33494dc5c232e.sock every 8 connection(s)
/data0/somelongdirectorytoavoidrpathissues/src/kudu/src/kudu/rpc/rpc-test.cc:270: Failure
Failed
Bad status: Runtime error: could not verify certificate chain (error with cert: subject=CN = localhost, ST = sadfjas, C = AS, emailAddress = sdflkdsajf, O = lskdfjlsad, OU = sldfkja, issuer=C = AS, ST = ASDfkjdhf, L = lskdjf, O = saldfja, OU = skdjf, CN = localhost, emailAddress = sadjflkadsj): : certificate has expired
Google Test trace:
/data0/somelongdirectorytoavoidrpathissues/src/kudu/src/kudu/rpc/rpc-test.cc:267: Connecting to unix:/tmp/dist-test-taskX73JxG/test-tmp/rpc-test-65c4bfa5481e48afbdc33494dc5c232e.sock
I20260928 22:45:43.414134 383 test_util.cc:175] -----------------------------------------------
I20260928 22:45:43.414280 383 test_util.cc:176] Had fatal failures, leaving test files at /tmp/dist-test-taskX73JxG/test-tmp/rpc-test.6.Parameters_TestRpc.TestCallWithChainCertAndChainCA_SSL_UnixSocket.1790635543318136-383-0
[ FAILED ] Parameters/TestRpc.TestCallWithChainCertAndChainCA/SSL_UnixSocket, where GetParam() = (true, true) (20 ms)
[ RUN ] Parameters/TestRpc.TestCallWithPasswordProtectedKey/SSL_UnixSocket
I20260928 22:45:43.429556 444 acceptor_pool.cc:254] collecting diagnostics on the listening RPC socket unix:/tmp/dist-test-taskX73JxG/test-tmp/rpc-test-ee16a2da8acc4eafaef7346377d167fb.sock every 8 connection(s)
I20260928 22:45:43.429597 445 acceptor_pool.cc:254] collecting diagnostics on the listening RPC socket unix:/tmp/dist-test-taskX73JxG/test-tmp/rpc-test-ee16a2da8acc4eafaef7346377d167fb.sock every 8 connection(s)
W20260928 22:45:43.443567 441 connection.cc:196] Error closing socket: Network error: TlsSocket::Close: Broken pipe
[ OK ] Parameters/TestRpc.TestCallWithPasswordProtectedKey/SSL_UnixSocket (30 ms)
[ RUN ] Parameters/TestRpc.TestCallToBadServer/SSL_UnixSocket
I20260928 22:45:43.459697 383 rpc-test.cc:394] Status: Network error: Client connection negotiation failed: client connection to 0.0.0.0:0: connect: Connection refused (error 111)
I20260928 22:45:43.460088 383 rpc-test.cc:394] Status: Network error: Client connection negotiation failed: client connection to 0.0.0.0:0: connect: Connection refused (error 111)
I20260928 22:45:43.460361 383 rpc-test.cc:394] Status: Network error: Client connection negotiation failed: client connection to 0.0.0.0:0: connect: Connection refused (error 111)
I20260928 22:45:43.460812 383 rpc-test.cc:394] Status: Network error: Client connection negotiation failed: client connection to 0.0.0.0:0: connect: Connection refused (error 111)
I20260928 22:45:43.461099 383 rpc-test.cc:394] Status: Network error: Client connection negotiation failed: client connection to 0.0.0.0:0: connect: Connection refused (error 111)
[ OK ] Parameters/TestRpc.TestCallToBadServer/SSL_UnixSocket (16 ms)
[ RUN ] Parameters/TestRpc.TestWrongService/SSL_UnixSocket
I20260928 22:45:43.485837 479 acceptor_pool.cc:254] collecting diagnostics on the listening RPC socket unix:/tmp/dist-test-taskX73JxG/test-tmp/rpc-test-5313325b21ff45ed98446e180a4cee31.sock every 8 connection(s)
I20260928 22:45:43.485898 480 acceptor_pool.cc:254] collecting diagnostics on the listening RPC socket unix:/tmp/dist-test-taskX73JxG/test-tmp/rpc-test-5313325b21ff45ed98446e180a4cee31.sock every 8 connection(s)
I20260928 22:45:43.503414 476 messenger.cc:345] service WrongServiceName not registered on TestServer
[ OK ] Parameters/TestRpc.TestWrongService/SSL_UnixSocket (44 ms)
[ RUN ] Parameters/TestRpc.TestConnectionKeepalive/SSL_UnixSocket
I20260928 22:45:43.525962 502 acceptor_pool.cc:254] collecting diagnostics on the listening RPC socket unix:/tmp/dist-test-taskX73JxG/test-tmp/rpc-test-55bb1214737448bf8d6f4fc2544f36e7.sock every 8 connection(s)
I20260928 22:45:43.526005 503 acceptor_pool.cc:254] collecting diagnostics on the listening RPC socket unix:/tmp/dist-test-taskX73JxG/test-tmp/rpc-test-55bb1214737448bf8d6f4fc2544f36e7.sock every 8 connection(s)
I20260928 22:45:43.526485 383 rpc-test.cc:488] Connecting to unix:/tmp/dist-test-taskX73JxG/test-tmp/rpc-test-55bb1214737448bf8d6f4fc2544f36e7.sock
W20260928 22:45:44.007787 515 connection.cc:196] Error closing socket: Network error: TlsSocket::Close: Broken pipe
[ OK ] Parameters/TestRpc.TestConnectionKeepalive/SSL_UnixSocket (1051 ms)
[ RUN ] Parameters/TestRpc.TestClientConnectionMetrics/SSL_UnixSocket
I20260928 22:45:44.578342 527 acceptor_pool.cc:254] collecting diagnostics on the listening RPC socket unix:/tmp/dist-test-taskX73JxG/test-tmp/rpc-test-74e57d3b5dff4523867470d12ca49a72.sock every 8 connection(s)
I20260928 22:45:44.578358 528 acceptor_pool.cc:254] collecting diagnostics on the listening RPC socket unix:/tmp/dist-test-taskX73JxG/test-tmp/rpc-test-74e57d3b5dff4523867470d12ca49a72.sock every 8 connection(s)
I20260928 22:45:44.578554 383 rpc-test.cc:569] Connecting to unix:/tmp/dist-test-taskX73JxG/test-tmp/rpc-test-74e57d3b5dff4523867470d12ca49a72.sock
W20260928 22:45:56.000494 524 connection.cc:196] Error closing socket: Network error: TlsSocket::Close: Broken pipe
[ OK ] Parameters/TestRpc.TestClientConnectionMetrics/SSL_UnixSocket (11444 ms)
[ RUN ] Parameters/TestRpc.TestCredentialsPolicy/SSL_UnixSocket
I20260928 22:45:56.027585 550 acceptor_pool.cc:254] collecting diagnostics on the listening RPC socket unix:/tmp/dist-test-taskX73JxG/test-tmp/rpc-test-eabd4a94ee3845a3a4d600a2959f4ecb.sock every 8 connection(s)
I20260928 22:45:56.027647 551 acceptor_pool.cc:254] collecting diagnostics on the listening RPC socket unix:/tmp/dist-test-taskX73JxG/test-tmp/rpc-test-eabd4a94ee3845a3a4d600a2959f4ecb.sock every 8 connection(s)
I20260928 22:45:56.027884 383 rpc-test.cc:700] Connecting to unix:/tmp/dist-test-taskX73JxG/test-tmp/rpc-test-eabd4a94ee3845a3a4d600a2959f4ecb.sock
W20260928 22:45:56.048671 549 connection.cc:196] Error closing socket: Network error: TlsSocket::Close: Broken pipe
[ OK ] Parameters/TestRpc.TestCredentialsPolicy/SSL_UnixSocket (52 ms)
[ RUN ] Parameters/TestRpc.TestCallLongerThanKeepalive/SSL_UnixSocket
I20260928 22:45:56.071174 575 acceptor_pool.cc:254] collecting diagnostics on the listening RPC socket unix:/tmp/dist-test-taskX73JxG/test-tmp/rpc-test-37668e36d13e493f915eb2f54a16d8df.sock every 8 connection(s)
I20260928 22:45:56.071223 576 acceptor_pool.cc:254] collecting diagnostics on the listening RPC socket unix:/tmp/dist-test-taskX73JxG/test-tmp/rpc-test-37668e36d13e493f915eb2f54a16d8df.sock every 8 connection(s)
I20260928 22:45:56.086229 579 rpc-test-base.h:222] got call: sleep_micros: 3000000 deferred: true
I20260928 22:45:59.087173 579 rpcz_store.cc:275] Call kudu.rpc.GenericCalculatorService.Sleep from unix:<unnamed> (request call id 0) took 3001 ms. Trace:
I20260928 22:45:59.087306 579 rpcz_store.cc:276] 0928 22:45:56.086127 (+ 0us) service_pool.cc:170] Inserting onto call queue
0928 22:45:56.086206 (+ 79us) service_pool.cc:227] Handling call
0928 22:45:59.087152 (+3000946us) inbound_call.cc:173] Queueing success response
Metrics: {}
W20260928 22:45:59.088490 572 connection.cc:196] Error closing socket: Network error: TlsSocket::Close: Broken pipe
[ OK ] Parameters/TestRpc.TestCallLongerThanKeepalive/SSL_UnixSocket (3035 ms)
[ RUN ] Parameters/TestRpc.TestRpcSidecar/SSL_UnixSocket
I20260928 22:45:59.099993 600 acceptor_pool.cc:254] collecting diagnostics on the listening RPC socket unix:/tmp/dist-test-taskX73JxG/test-tmp/rpc-test-760bae743f744499aa04d421a4bffa35.sock every 8 connection(s)
I20260928 22:45:59.099999 601 acceptor_pool.cc:254] collecting diagnostics on the listening RPC socket unix:/tmp/dist-test-taskX73JxG/test-tmp/rpc-test-760bae743f744499aa04d421a4bffa35.sock every 8 connection(s)
W20260928 22:45:59.144793 597 connection.cc:196] Error closing socket: Network error: TlsSocket::Close: Broken pipe
[ OK ] Parameters/TestRpc.TestRpcSidecar/SSL_UnixSocket (56 ms)
[ RUN ] Parameters/TestRpc.TestRpcSidecarLimits/SSL_UnixSocket
I20260928 22:46:00.901780 625 acceptor_pool.cc:254] collecting diagnostics on the listening RPC socket unix:/tmp/dist-test-taskX73JxG/test-tmp/rpc-test-0b06d2470b3e4583b2387274498fa8c8.sock every 8 connection(s)
I20260928 22:46:00.901830 626 acceptor_pool.cc:254] collecting diagnostics on the listening RPC socket unix:/tmp/dist-test-taskX73JxG/test-tmp/rpc-test-0b06d2470b3e4583b2387274498fa8c8.sock every 8 connection(s)
W20260928 22:46:00.921710 383 serialization.cc:72] Serialized kudu.rpc_test.PushStringsRequestPB (2147483654 bytes) is larger than the maximum configured RPC message size (52428800 bytes). Sending anyway, but peer may reject the data.
W20260928 22:46:00.925310 622 connection.cc:535] server connection from unix:<unnamed> recv error: Network error: RPC frame had a length of 2147483714, but we only support messages up to 52428800 bytes long.
W20260928 22:46:00.925433 622 connection.cc:158] shutting down server connection from unix:<unnamed> with pending inbound data: 4/2147483714 bytes received; last active 0 ns ago: status Network error: RPC frame had a length of 2147483714, but we only support messages up to 52428800 bytes long.
W20260928 22:46:00.925634 638 connection.cc:196] Error closing socket: Network error: TlsSocket::Close: Broken pipe
I20260928 22:46:00.943456 651 acceptor_pool.cc:254] collecting diagnostics on the listening RPC socket unix:/tmp/dist-test-taskX73JxG/test-tmp/rpc-test-0b06d2470b3e4583b2387274498fa8c8.sock every 8 connection(s)
I20260928 22:46:00.943457 650 acceptor_pool.cc:254] collecting diagnostics on the listening RPC socket unix:/tmp/dist-test-taskX73JxG/test-tmp/rpc-test-0b06d2470b3e4583b2387274498fa8c8.sock every 8 connection(s)
W20260928 22:46:06.646919 647 connection.cc:577] server connection from unix:<unnamed>: received bad data: 'Corruption: Invalid packet: message had a length of 2147483710, but we only support messages up to 2147483647 bytes
'
W20260928 22:46:06.647399 663 connection.cc:196] Error closing socket: Network error: TlsSocket::Close: Broken pipe
[ OK ] Parameters/TestRpc.TestRpcSidecarLimits/SSL_UnixSocket (7503 ms)
[ RUN ] Parameters/TestRpc.TestCallTimeoutDoesntAffectNegotiation/SSL_UnixSocket
I20260928 22:46:06.676903 675 acceptor_pool.cc:254] collecting diagnostics on the listening RPC socket unix:/tmp/dist-test-taskX73JxG/test-tmp/rpc-test-ad9d570ed9ee4712bb3e40326cd35acb.sock every 8 connection(s)
I20260928 22:46:06.676956 676 acceptor_pool.cc:254] collecting diagnostics on the listening RPC socket unix:/tmp/dist-test-taskX73JxG/test-tmp/rpc-test-ad9d570ed9ee4712bb3e40326cd35acb.sock every 8 connection(s)
W20260928 22:46:06.697285 671 negotiation.cc:266] Injecting 500ms delay in negotiation
I20260928 22:46:06.747896 383 rpc-test-base.h:595] status: Timed out: connection negotiation to unix:/tmp/dist-test-taskX73JxG/test-tmp/rpc-test-ad9d570ed9ee4712bb3e40326cd35acb.sock for RPC Sleep timed out after 0.050s (ON_OUTBOUND_QUEUE), seconds elapsed: 0.0512724
W20260928 22:46:07.202497 672 connection.cc:196] Error closing socket: Network error: TlsSocket::Close: Broken pipe
[ OK ] Parameters/TestRpc.TestCallTimeoutDoesntAffectNegotiation/SSL_UnixSocket (552 ms)
[ RUN ] Parameters/TestRpc.TestRpcHandlerLatencyMetric/SSL_UnixSocket
I20260928 22:46:07.212123 700 acceptor_pool.cc:254] collecting diagnostics on the listening RPC socket unix:/tmp/dist-test-taskX73JxG/test-tmp/rpc-test-464fc6c4e1ff45748f532a1bc461c49e.sock every 8 connection(s)
I20260928 22:46:07.212222 701 acceptor_pool.cc:254] collecting diagnostics on the listening RPC socket unix:/tmp/dist-test-taskX73JxG/test-tmp/rpc-test-464fc6c4e1ff45748f532a1bc461c49e.sock every 8 connection(s)
I20260928 22:46:07.259969 383 rpc-test.cc:1236] Sleep() min lat: 20357
I20260928 22:46:07.260102 383 rpc-test.cc:1237] Sleep() mean lat: 20357
I20260928 22:46:07.260143 383 rpc-test.cc:1238] Sleep() max lat: 20357
I20260928 22:46:07.260166 383 rpc-test.cc:1239] Sleep() #calls: 1
[ OK ] Parameters/TestRpc.TestRpcHandlerLatencyMetric/SSL_UnixSocket (58 ms)
[ RUN ] Parameters/TestRpc.TimedOutOnResponseMetricServiceQueue/SSL_UnixSocket
I20260928 22:46:07.271992 726 acceptor_pool.cc:254] collecting diagnostics on the listening RPC socket unix:/tmp/dist-test-taskX73JxG/test-tmp/rpc-test-de849a25c51f4be3b786cc34cb9dbc25.sock every 8 connection(s)
I20260928 22:46:07.272060 727 acceptor_pool.cc:254] collecting diagnostics on the listening RPC socket unix:/tmp/dist-test-taskX73JxG/test-tmp/rpc-test-de849a25c51f4be3b786cc34cb9dbc25.sock every 8 connection(s)
W20260928 22:46:07.331871 728 rpcz_store.cc:267] Call kudu.rpc_test.CalculatorService.Sleep from unix:<unnamed> (request call id 2) took 20 ms (client timeout 20 ms). Trace:
W20260928 22:46:07.332011 728 rpcz_store.cc:269] 0928 22:46:07.311488 (+ 0us) service_pool.cc:170] Inserting onto call queue
0928 22:46:07.331803 (+ 20315us) service_pool.cc:214] Skipping call since client already timed out
0928 22:46:07.331815 (+ 12us) inbound_call.cc:173] Queueing failure response
Metrics: {}
W20260928 22:46:07.333073 723 connection.cc:196] Error closing socket: Network error: TlsSocket::Close: Broken pipe
[ OK ] Parameters/TestRpc.TimedOutOnResponseMetricServiceQueue/SSL_UnixSocket (71 ms)
[ RUN ] Parameters/TestRpc.RpcPendingConnectionsMetric/SSL_UnixSocket
I20260928 22:46:07.336294 750 acceptor_pool.cc:254] collecting diagnostics on the listening RPC socket 0.0.0.0:33311 every 8 connection(s)
I20260928 22:46:07.336293 749 acceptor_pool.cc:254] collecting diagnostics on the listening RPC socket 0.0.0.0:33311 every 8 connection(s)
W20260928 22:46:07.345495 745 negotiation.cc:337] Failed RPC negotiation. Trace:
0928 22:46:07.345260 (+ 0us) reactor.cc:625] Submitting negotiation task for server connection from 127.0.0.1:36522 (local address 127.0.0.1:33311)
0928 22:46:07.345348 (+ 88us) server_negotiation.cc:206] Beginning negotiation
0928 22:46:07.345351 (+ 3us) server_negotiation.cc:399] Waiting for connection header
0928 22:46:07.345432 (+ 81us) negotiation.cc:327] Negotiation complete: Network error: Server connection negotiation failed: server connection from 127.0.0.1:36522: BlockingRecv error: recv got EOF from 127.0.0.1:36522 (error 108)
Metrics: {"server-negotiator.queue_time_us":51}
[ OK ] Parameters/TestRpc.RpcPendingConnectionsMetric/SSL_UnixSocket (22 ms)
[ RUN ] Parameters/TestRpc.TestRpcContextClientDeadline/SSL_UnixSocket
I20260928 22:46:07.388835 765 acceptor_pool.cc:254] collecting diagnostics on the listening RPC socket unix:/tmp/dist-test-taskX73JxG/test-tmp/rpc-test-dc32246524654a329a03b06e329cda88.sock every 8 connection(s)
I20260928 22:46:07.388900 766 acceptor_pool.cc:254] collecting diagnostics on the listening RPC socket unix:/tmp/dist-test-taskX73JxG/test-tmp/rpc-test-dc32246524654a329a03b06e329cda88.sock every 8 connection(s)
[ OK ] Parameters/TestRpc.TestRpcContextClientDeadline/SSL_UnixSocket (67 ms)
[ RUN ] Parameters/TestRpc.TestApplicationFeatureFlagUnsupportedServer/SSL_UnixSocket
I20260928 22:46:07.451313 790 acceptor_pool.cc:254] collecting diagnostics on the listening RPC socket unix:/tmp/dist-test-taskX73JxG/test-tmp/rpc-test-2cc7976d30c740158a473131d5f78500.sock every 8 connection(s)
I20260928 22:46:07.451357 791 acceptor_pool.cc:254] collecting diagnostics on the listening RPC socket unix:/tmp/dist-test-taskX73JxG/test-tmp/rpc-test-2cc7976d30c740158a473131d5f78500.sock every 8 connection(s)
[ OK ] Parameters/TestRpc.TestApplicationFeatureFlagUnsupportedServer/SSL_UnixSocket (74 ms)
[ RUN ] Parameters/TestRpc.TestCancellationAsync/SSL_UnixSocket
I20260928 22:46:07.517383 815 acceptor_pool.cc:254] collecting diagnostics on the listening RPC socket unix:/tmp/dist-test-taskX73JxG/test-tmp/rpc-test-c1a9cb3bd26e45b38c40d7ca84a50600.sock every 8 connection(s)
I20260928 22:46:07.517395 816 acceptor_pool.cc:254] collecting diagnostics on the listening RPC socket unix:/tmp/dist-test-taskX73JxG/test-tmp/rpc-test-c1a9cb3bd26e45b38c40d7ca84a50600.sock every 8 connection(s)
I20260928 22:46:07.517601 383 rpc-test.cc:1716] Connecting to unix:/tmp/dist-test-taskX73JxG/test-tmp/rpc-test-c1a9cb3bd26e45b38c40d7ca84a50600.sock
I20260928 22:46:07.529496 383 test_util.cc:268] Using random seed: -722682346
I20260928 22:46:07.550812 819 rpc-test-base.h:240] got call: sleep_micros: 500 pattern: 4294967295 num_repetitions: 2097152 sidecar_idx: 0
I20260928 22:46:07.565172 819 rpc-test-base.h:240] got call: sleep_micros: 500 pattern: 4294967295 num_repetitions: 2097152 sidecar_idx: 0
I20260928 22:46:07.580749 819 rpc-test-base.h:240] got call: sleep_micros: 500 pattern: 4294967295 num_repetitions: 2097152 sidecar_idx: 0
I20260928 22:46:07.596613 819 rpc-test-base.h:240] got call: sleep_micros: 500 pattern: 4294967295 num_repetitions: 2097152 sidecar_idx: 0
I20260928 22:46:07.614355 819 rpc-test-base.h:240] got call: sleep_micros: 500 pattern: 4294967295 num_repetitions: 2097152 sidecar_idx: 0
I20260928 22:46:07.629595 819 rpc-test-base.h:240] got call: sleep_micros: 500 pattern: 4294967295 num_repetitions: 2097152 sidecar_idx: 0
I20260928 22:46:07.644445 819 rpc-test-base.h:240] got call: sleep_micros: 500 pattern: 4294967295 num_repetitions: 2097152 sidecar_idx: 0
I20260928 22:46:07.659176 819 rpc-test-base.h:240] got call: sleep_micros: 500 pattern: 4294967295 num_repetitions: 2097152 sidecar_idx: 0
W20260928 22:46:07.661224 812 connection.cc:196] Error closing socket: Network error: TlsSocket::Close: Broken pipe
W20260928 22:46:07.662828 812 connection.cc:441] server connection from unix:<unnamed> torn down before Call kudu.rpc.GenericCalculatorService.SleepWithSidecar from unix:<unnamed> (request call id 9) could send its response
[ OK ] Parameters/TestRpc.TestCancellationAsync/SSL_UnixSocket (165 ms)
[ RUN ] Parameters/TestRpc.TestPerformanceBySocketType/SSL_UnixSocket
I20260928 22:46:07.690821 840 acceptor_pool.cc:254] collecting diagnostics on the listening RPC socket unix:/tmp/dist-test-taskX73JxG/test-tmp/rpc-test-76a38ab6e8a44e06ba44299c86b12842.sock every 8 connection(s)
I20260928 22:46:07.691030 383 rpc-test.cc:1846] Connecting to unix:/tmp/dist-test-taskX73JxG/test-tmp/rpc-test-76a38ab6e8a44e06ba44299c86b12842.sock
I20260928 22:46:07.690833 841 acceptor_pool.cc:254] collecting diagnostics on the listening RPC socket unix:/tmp/dist-test-taskX73JxG/test-tmp/rpc-test-76a38ab6e8a44e06ba44299c86b12842.sock every 8 connection(s)
I20260928 22:46:09.547883 383 rpc-test.cc:1859] Sending 1024MB via ssl-enabled unix socket: real 1.820s user 1.788s sys 1.410s
I20260928 22:46:11.365850 383 rpc-test.cc:1859] Sending 1024MB via ssl-enabled unix socket: real 1.818s user 1.983s sys 1.149s
I20260928 22:46:13.133119 383 rpc-test.cc:1859] Sending 1024MB via ssl-enabled unix socket: real 1.767s user 1.876s sys 1.161s
I20260928 22:46:14.906006 383 rpc-test.cc:1859] Sending 1024MB via ssl-enabled unix socket: real 1.773s user 1.867s sys 1.191s
I20260928 22:46:16.694746 383 rpc-test.cc:1859] Sending 1024MB via ssl-enabled unix socket: real 1.789s user 1.948s sys 1.131s
W20260928 22:46:16.695675 837 connection.cc:196] Error closing socket: Network error: TlsSocket::Close: Broken pipe
[ OK ] Parameters/TestRpc.TestPerformanceBySocketType/SSL_UnixSocket (9032 ms)
[----------] 20 tests from Parameters/TestRpc (33375 ms total)
[----------] 1 test from Parameters/TestRpcSocketTxRxQueue
[ RUN ] Parameters/TestRpcSocketTxRxQueue.AcceptorRxQueueSizeMetric/0
I20260928 22:46:16.703792 866 acceptor_pool.cc:254] collecting diagnostics on the listening RPC socket 0.0.0.0:40763 every 1 connection(s)
I20260928 22:46:16.703821 865 acceptor_pool.cc:254] collecting diagnostics on the listening RPC socket 0.0.0.0:40763 every 1 connection(s)
W20260928 22:46:16.704618 861 negotiation.cc:337] Failed RPC negotiation. Trace:
0928 22:46:16.704328 (+ 0us) reactor.cc:625] Submitting negotiation task for server connection from 127.0.0.1:42164 (local address 127.0.0.1:40763)
0928 22:46:16.704452 (+ 124us) server_negotiation.cc:206] Beginning negotiation
0928 22:46:16.704455 (+ 3us) server_negotiation.cc:399] Waiting for connection header
0928 22:46:16.704577 (+ 122us) negotiation.cc:327] Negotiation complete: Network error: Server connection negotiation failed: server connection from 127.0.0.1:42164: BlockingRecv error: recv got EOF from 127.0.0.1:42164 (error 108)
Metrics: {"server-negotiator.queue_time_us":66}
[ OK ] Parameters/TestRpcSocketTxRxQueue.AcceptorRxQueueSizeMetric/0 (10 ms)
[----------] 1 test from Parameters/TestRpcSocketTxRxQueue (10 ms total)
[----------] Global test environment tear-down
[==========] 21 tests from 2 test suites ran. (33386 ms total)
[ PASSED ] 20 tests.
[ FAILED ] 1 test, listed below:
[ FAILED ] Parameters/TestRpc.TestCallWithChainCertAndChainCA/SSL_UnixSocket, where GetParam() = (true, true)
1 FAILED TEST