Diagnosed failure

Parameters/TestRpc.TestCallWithChainCertAndChainCA/SSL_TCP: /data0/somelongdirectorytoavoidrpathissues/src/kudu/src/kudu/rpc/rpc-test.cc:270: Failure
Failed
Bad status: Runtime error: could not verify certificate chain (error with cert: subject=CN = localhost, ST = sadfjas, C = AS, emailAddress = sdflkdsajf, O = lskdfjlsad, OU = sldfkja, issuer=C = AS, ST = ASDfkjdhf, L = lskdjf, O = saldfja, OU = skdjf, CN = localhost, emailAddress = sadjflkadsj): : certificate has expired
Google Test trace:
/data0/somelongdirectorytoavoidrpathissues/src/kudu/src/kudu/rpc/rpc-test.cc:267: Connecting to 0.0.0.0:41915
I20260924 09:57:06.319604   379 test_util.cc:175] -----------------------------------------------
I20260924 09:57:06.319698   379 test_util.cc:176] Had fatal failures, leaving test files at /tmp/dist-test-taskZpmKvs/test-tmp/rpc-test.5.Parameters_TestRpc.TestCallWithChainCertAndChainCA_SSL_TCP.1790243826201466-379-0

Full log

Note: This is test shard 6 of 8.
[==========] Running 21 tests from 2 test suites.
[----------] Global test environment set-up.
[----------] 20 tests from Parameters/TestRpc
[ RUN      ] Parameters/TestRpc.TestMessengerCreateDestroy/SSL_TCP
WARNING: Logging before InitGoogleLogging() is written to STDERR
I20260924 09:57:06.248404   379 rpc-test.cc:169] started messenger TestCreateDestroy
[       OK ] Parameters/TestRpc.TestMessengerCreateDestroy/SSL_TCP (29 ms)
[ RUN      ] Parameters/TestRpc.TestNegotiationDeadlock/SSL_TCP
I20260924 09:57:06.261906   399 acceptor_pool.cc:254] collecting diagnostics on the listening RPC socket 0.0.0.0:38021 every 8 connection(s)
I20260924 09:57:06.262154   400 acceptor_pool.cc:254] collecting diagnostics on the listening RPC socket 0.0.0.0:38021 every 8 connection(s)
[       OK ] Parameters/TestRpc.TestNegotiationDeadlock/SSL_TCP (29 ms)
[ RUN      ] Parameters/TestRpc.TestCallWithChainCertAndChainCA/SSL_TCP
I20260924 09:57:06.307837   415 acceptor_pool.cc:254] collecting diagnostics on the listening RPC socket 0.0.0.0:41915 every 8 connection(s)
I20260924 09:57:06.308140   416 acceptor_pool.cc:254] collecting diagnostics on the listening RPC socket 0.0.0.0:41915 every 8 connection(s)
/data0/somelongdirectorytoavoidrpathissues/src/kudu/src/kudu/rpc/rpc-test.cc:270: Failure
Failed
Bad status: Runtime error: could not verify certificate chain (error with cert: subject=CN = localhost, ST = sadfjas, C = AS, emailAddress = sdflkdsajf, O = lskdfjlsad, OU = sldfkja, issuer=C = AS, ST = ASDfkjdhf, L = lskdjf, O = saldfja, OU = skdjf, CN = localhost, emailAddress = sadjflkadsj): : certificate has expired
Google Test trace:
/data0/somelongdirectorytoavoidrpathissues/src/kudu/src/kudu/rpc/rpc-test.cc:267: Connecting to 0.0.0.0:41915
I20260924 09:57:06.319604   379 test_util.cc:175] -----------------------------------------------
I20260924 09:57:06.319698   379 test_util.cc:176] Had fatal failures, leaving test files at /tmp/dist-test-taskZpmKvs/test-tmp/rpc-test.5.Parameters_TestRpc.TestCallWithChainCertAndChainCA_SSL_TCP.1790243826201466-379-0
[  FAILED  ] Parameters/TestRpc.TestCallWithChainCertAndChainCA/SSL_TCP, where GetParam() = (true, false) (38 ms)
[ RUN      ] Parameters/TestRpc.TestCallWithPasswordProtectedKey/SSL_TCP
I20260924 09:57:06.347398   440 acceptor_pool.cc:254] collecting diagnostics on the listening RPC socket 0.0.0.0:34051 every 8 connection(s)
I20260924 09:57:06.347559   441 acceptor_pool.cc:254] collecting diagnostics on the listening RPC socket 0.0.0.0:34051 every 8 connection(s)
[       OK ] Parameters/TestRpc.TestCallWithPasswordProtectedKey/SSL_TCP (63 ms)
[ RUN      ] Parameters/TestRpc.TestCallToBadServer/SSL_TCP
I20260924 09:57:06.398873   379 rpc-test.cc:394] Status: Network error: Client connection negotiation failed: client connection to 0.0.0.0:0: connect: Connection refused (error 111)
I20260924 09:57:06.399596   379 rpc-test.cc:394] Status: Network error: Client connection negotiation failed: client connection to 0.0.0.0:0: connect: Connection refused (error 111)
I20260924 09:57:06.400157   379 rpc-test.cc:394] Status: Network error: Client connection negotiation failed: client connection to 0.0.0.0:0: connect: Connection refused (error 111)
I20260924 09:57:06.400755   379 rpc-test.cc:394] Status: Network error: Client connection negotiation failed: client connection to 0.0.0.0:0: connect: Connection refused (error 111)
I20260924 09:57:06.401335   379 rpc-test.cc:394] Status: Network error: Client connection negotiation failed: client connection to 0.0.0.0:0: connect: Connection refused (error 111)
[       OK ] Parameters/TestRpc.TestCallToBadServer/SSL_TCP (20 ms)
[ RUN      ] Parameters/TestRpc.TestWrongService/SSL_TCP
I20260924 09:57:06.420640   475 acceptor_pool.cc:254] collecting diagnostics on the listening RPC socket 0.0.0.0:40657 every 8 connection(s)
I20260924 09:57:06.420907   476 acceptor_pool.cc:254] collecting diagnostics on the listening RPC socket 0.0.0.0:40657 every 8 connection(s)
I20260924 09:57:06.437772   474 messenger.cc:345] service WrongServiceName not registered on TestServer
[       OK ] Parameters/TestRpc.TestWrongService/SSL_TCP (39 ms)
[ RUN      ] Parameters/TestRpc.TestConnectionKeepalive/SSL_TCP
I20260924 09:57:06.471278   498 acceptor_pool.cc:254] collecting diagnostics on the listening RPC socket 0.0.0.0:33441 every 8 connection(s)
I20260924 09:57:06.471552   499 acceptor_pool.cc:254] collecting diagnostics on the listening RPC socket 0.0.0.0:33441 every 8 connection(s)
I20260924 09:57:06.472445   379 rpc-test.cc:488] Connecting to 0.0.0.0:33441
[       OK ] Parameters/TestRpc.TestConnectionKeepalive/SSL_TCP (1059 ms)
[ RUN      ] Parameters/TestRpc.TestClientConnectionMetrics/SSL_TCP
I20260924 09:57:07.526012   523 acceptor_pool.cc:254] collecting diagnostics on the listening RPC socket 0.0.0.0:43907 every 8 connection(s)
I20260924 09:57:07.526291   524 acceptor_pool.cc:254] collecting diagnostics on the listening RPC socket 0.0.0.0:43907 every 8 connection(s)
I20260924 09:57:07.527287   379 rpc-test.cc:569] Connecting to 0.0.0.0:43907
[       OK ] Parameters/TestRpc.TestClientConnectionMetrics/SSL_TCP (19548 ms)
[ RUN      ] Parameters/TestRpc.TestCredentialsPolicy/SSL_TCP
I20260924 09:57:27.061372   546 acceptor_pool.cc:254] collecting diagnostics on the listening RPC socket 0.0.0.0:41979 every 8 connection(s)
I20260924 09:57:27.061618   547 acceptor_pool.cc:254] collecting diagnostics on the listening RPC socket 0.0.0.0:41979 every 8 connection(s)
I20260924 09:57:27.062544   379 rpc-test.cc:700] Connecting to 0.0.0.0:41979
[       OK ] Parameters/TestRpc.TestCredentialsPolicy/SSL_TCP (47 ms)
[ RUN      ] Parameters/TestRpc.TestCallLongerThanKeepalive/SSL_TCP
I20260924 09:57:27.127233   571 acceptor_pool.cc:254] collecting diagnostics on the listening RPC socket 0.0.0.0:43727 every 8 connection(s)
I20260924 09:57:27.127468   572 acceptor_pool.cc:254] collecting diagnostics on the listening RPC socket 0.0.0.0:43727 every 8 connection(s)
I20260924 09:57:27.175993   575 rpc-test-base.h:222] got call: sleep_micros: 3000000 deferred: true
I20260924 09:57:30.177690   575 rpcz_store.cc:275] Call kudu.rpc.GenericCalculatorService.Sleep from 127.0.0.1:33980 (request call id 0) took 3001 ms. Trace:
I20260924 09:57:30.177862   575 rpcz_store.cc:276] 0924 09:57:27.175885 (+     0us) service_pool.cc:170] Inserting onto call queue
0924 09:57:27.175948 (+    63us) service_pool.cc:227] Handling call
0924 09:57:30.177649 (+3001701us) inbound_call.cc:173] Queueing success response
Metrics: {}
[       OK ] Parameters/TestRpc.TestCallLongerThanKeepalive/SSL_TCP (3085 ms)
[ RUN      ] Parameters/TestRpc.TestRpcSidecar/SSL_TCP
I20260924 09:57:30.210140   596 acceptor_pool.cc:254] collecting diagnostics on the listening RPC socket 0.0.0.0:33311 every 8 connection(s)
I20260924 09:57:30.210402   597 acceptor_pool.cc:254] collecting diagnostics on the listening RPC socket 0.0.0.0:33311 every 8 connection(s)
[       OK ] Parameters/TestRpc.TestRpcSidecar/SSL_TCP (138 ms)
[ RUN      ] Parameters/TestRpc.TestRpcSidecarLimits/SSL_TCP
I20260924 09:57:32.437589   621 acceptor_pool.cc:254] collecting diagnostics on the listening RPC socket 0.0.0.0:33413 every 8 connection(s)
I20260924 09:57:32.437872   622 acceptor_pool.cc:254] collecting diagnostics on the listening RPC socket 0.0.0.0:33413 every 8 connection(s)
W20260924 09:57:32.457451   379 serialization.cc:72] Serialized kudu.rpc_test.PushStringsRequestPB (2147483654 bytes) is larger than the maximum configured RPC message size (52428800 bytes). Sending anyway, but peer may reject the data.
W20260924 09:57:32.464067   618 connection.cc:535] server connection from 127.0.0.1:53458 recv error: Network error: RPC frame had a length of 2147483714, but we only support messages up to 52428800 bytes long.
W20260924 09:57:32.464231   618 connection.cc:158] shutting down server connection from 127.0.0.1:53458 with pending inbound data: 4/2147483714 bytes received; last active 0 ns ago: status Network error: RPC frame had a length of 2147483714, but we only support messages up to 52428800 bytes long.
W20260924 09:57:32.464844   634 connection.cc:196] Error closing socket: Network error: TlsSocket::Close: Connection reset by peer
I20260924 09:57:32.480690   646 acceptor_pool.cc:254] collecting diagnostics on the listening RPC socket 0.0.0.0:36239 every 8 connection(s)
I20260924 09:57:32.480973   647 acceptor_pool.cc:254] collecting diagnostics on the listening RPC socket 0.0.0.0:36239 every 8 connection(s)
W20260924 09:57:37.695910   643 connection.cc:577] server connection from 127.0.0.1:47910: received bad data: 'Corruption: Invalid packet: message had a length of 2147483710, but we only support messages up to 2147483647 bytes
'
[       OK ] Parameters/TestRpc.TestRpcSidecarLimits/SSL_TCP (7838 ms)
[ RUN      ] Parameters/TestRpc.TestCallTimeoutDoesntAffectNegotiation/SSL_TCP
I20260924 09:57:38.183722   671 acceptor_pool.cc:254] collecting diagnostics on the listening RPC socket 0.0.0.0:34757 every 8 connection(s)
I20260924 09:57:38.183986   672 acceptor_pool.cc:254] collecting diagnostics on the listening RPC socket 0.0.0.0:34757 every 8 connection(s)
W20260924 09:57:38.214007   667 negotiation.cc:266] Injecting 500ms delay in negotiation
I20260924 09:57:38.264532   379 rpc-test-base.h:595] status: Timed out: connection negotiation to 0.0.0.0:34757 for RPC Sleep timed out after 0.050s (ON_OUTBOUND_QUEUE), seconds elapsed: 0.0511691
[       OK ] Parameters/TestRpc.TestCallTimeoutDoesntAffectNegotiation/SSL_TCP (563 ms)
[ RUN      ] Parameters/TestRpc.TestRpcHandlerLatencyMetric/SSL_TCP
I20260924 09:57:38.742231   696 acceptor_pool.cc:254] collecting diagnostics on the listening RPC socket 0.0.0.0:45013 every 8 connection(s)
I20260924 09:57:38.742408   697 acceptor_pool.cc:254] collecting diagnostics on the listening RPC socket 0.0.0.0:45013 every 8 connection(s)
I20260924 09:57:38.787595   379 rpc-test.cc:1236] Sleep() min lat: 20594
I20260924 09:57:38.787678   379 rpc-test.cc:1237] Sleep() mean lat: 20594
I20260924 09:57:38.787750   379 rpc-test.cc:1238] Sleep() max lat: 20594
I20260924 09:57:38.787789   379 rpc-test.cc:1239] Sleep() #calls: 1
[       OK ] Parameters/TestRpc.TestRpcHandlerLatencyMetric/SSL_TCP (68 ms)
[ RUN      ] Parameters/TestRpc.TimedOutOnResponseMetricServiceQueue/SSL_TCP
I20260924 09:57:38.806185   722 acceptor_pool.cc:254] collecting diagnostics on the listening RPC socket 0.0.0.0:44035 every 8 connection(s)
I20260924 09:57:38.806389   723 acceptor_pool.cc:254] collecting diagnostics on the listening RPC socket 0.0.0.0:44035 every 8 connection(s)
W20260924 09:57:38.868302   724 rpcz_store.cc:267] Call kudu.rpc_test.CalculatorService.Sleep from 127.0.0.1:36122 (request call id 2) took 20 ms (client timeout 20 ms). Trace:
W20260924 09:57:38.868481   724 rpcz_store.cc:269] 0924 09:57:38.847837 (+     0us) service_pool.cc:170] Inserting onto call queue
0924 09:57:38.868229 (+ 20392us) service_pool.cc:214] Skipping call since client already timed out
0924 09:57:38.868284 (+    55us) inbound_call.cc:173] Queueing failure response
Metrics: {}
[       OK ] Parameters/TestRpc.TimedOutOnResponseMetricServiceQueue/SSL_TCP (80 ms)
[ RUN      ] Parameters/TestRpc.RpcPendingConnectionsMetric/SSL_TCP
I20260924 09:57:38.877715   745 acceptor_pool.cc:254] collecting diagnostics on the listening RPC socket 0.0.0.0:42561 every 8 connection(s)
I20260924 09:57:38.877938   746 acceptor_pool.cc:254] collecting diagnostics on the listening RPC socket 0.0.0.0:42561 every 8 connection(s)
W20260924 09:57:38.888449   741 negotiation.cc:337] Failed RPC negotiation. Trace:
0924 09:57:38.887586 (+     0us) reactor.cc:625] Submitting negotiation task for server connection from 127.0.0.1:32952 (local address 127.0.0.1:42561)
0924 09:57:38.887761 (+   175us) server_negotiation.cc:206] Beginning negotiation
0924 09:57:38.887765 (+     4us) server_negotiation.cc:399] Waiting for connection header
0924 09:57:38.887969 (+   204us) negotiation.cc:327] Negotiation complete: Network error: Server connection negotiation failed: server connection from 127.0.0.1:32952: BlockingRecv error: recv got EOF from 127.0.0.1:32952 (error 108)
Metrics: {"server-negotiator.queue_time_us":54}
[       OK ] Parameters/TestRpc.RpcPendingConnectionsMetric/SSL_TCP (28 ms)
[ RUN      ] Parameters/TestRpc.TestRpcContextClientDeadline/SSL_TCP
I20260924 09:57:38.910692   761 acceptor_pool.cc:254] collecting diagnostics on the listening RPC socket 0.0.0.0:34659 every 8 connection(s)
I20260924 09:57:38.910907   762 acceptor_pool.cc:254] collecting diagnostics on the listening RPC socket 0.0.0.0:34659 every 8 connection(s)
[       OK ] Parameters/TestRpc.TestRpcContextClientDeadline/SSL_TCP (60 ms)
[ RUN      ] Parameters/TestRpc.TestApplicationFeatureFlagUnsupportedServer/SSL_TCP
I20260924 09:57:38.982813   786 acceptor_pool.cc:254] collecting diagnostics on the listening RPC socket 0.0.0.0:42053 every 8 connection(s)
I20260924 09:57:38.983078   787 acceptor_pool.cc:254] collecting diagnostics on the listening RPC socket 0.0.0.0:42053 every 8 connection(s)
[       OK ] Parameters/TestRpc.TestApplicationFeatureFlagUnsupportedServer/SSL_TCP (48 ms)
[ RUN      ] Parameters/TestRpc.TestCancellationAsync/SSL_TCP
I20260924 09:57:39.021870   811 acceptor_pool.cc:254] collecting diagnostics on the listening RPC socket 0.0.0.0:40167 every 8 connection(s)
I20260924 09:57:39.022133   812 acceptor_pool.cc:254] collecting diagnostics on the listening RPC socket 0.0.0.0:40167 every 8 connection(s)
I20260924 09:57:39.023002   379 rpc-test.cc:1716] Connecting to 0.0.0.0:40167
I20260924 09:57:39.045362   379 test_util.cc:268] Using random seed: -1589142570
I20260924 09:57:39.089594   815 rpc-test-base.h:240] got call: sleep_micros: 500 pattern: 4294967295 num_repetitions: 2097152 sidecar_idx: 0
I20260924 09:57:39.120803   814 rpc-test-base.h:240] got call: sleep_micros: 500 pattern: 4294967295 num_repetitions: 2097152 sidecar_idx: 0
I20260924 09:57:39.153316   814 rpc-test-base.h:240] got call: sleep_micros: 500 pattern: 4294967295 num_repetitions: 2097152 sidecar_idx: 0
I20260924 09:57:39.184522   815 rpc-test-base.h:240] got call: sleep_micros: 500 pattern: 4294967295 num_repetitions: 2097152 sidecar_idx: 0
I20260924 09:57:39.217144   815 rpc-test-base.h:240] got call: sleep_micros: 500 pattern: 4294967295 num_repetitions: 2097152 sidecar_idx: 0
I20260924 09:57:39.248793   815 rpc-test-base.h:240] got call: sleep_micros: 500 pattern: 4294967295 num_repetitions: 2097152 sidecar_idx: 0
W20260924 09:57:39.281450   809 connection.cc:196] Error closing socket: Network error: TlsSocket::Close: Broken pipe
W20260924 09:57:39.283272   809 connection.cc:441] server connection from 127.0.0.1:50564 torn down before Call kudu.rpc.GenericCalculatorService.SleepWithSidecar from 127.0.0.1:50564 (request call id 8) could send its response
[       OK ] Parameters/TestRpc.TestCancellationAsync/SSL_TCP (276 ms)
[ RUN      ] Parameters/TestRpc.TestPerformanceBySocketType/SSL_TCP
I20260924 09:57:39.309767   836 acceptor_pool.cc:254] collecting diagnostics on the listening RPC socket 0.0.0.0:40835 every 8 connection(s)
I20260924 09:57:39.310029   837 acceptor_pool.cc:254] collecting diagnostics on the listening RPC socket 0.0.0.0:40835 every 8 connection(s)
I20260924 09:57:39.310907   379 rpc-test.cc:1846] Connecting to 0.0.0.0:40835
I20260924 09:57:42.242476   379 rpc-test.cc:1859] Sending 1024MB via ssl-enabled tcp socket: real 2.920s	user 2.782s	sys 2.109s
I20260924 09:57:45.094146   379 rpc-test.cc:1859] Sending 1024MB via ssl-enabled tcp socket: real 2.852s	user 2.608s	sys 2.126s
I20260924 09:57:48.028160   379 rpc-test.cc:1859] Sending 1024MB via ssl-enabled tcp socket: real 2.934s	user 2.586s	sys 2.343s
I20260924 09:57:50.932647   379 rpc-test.cc:1859] Sending 1024MB via ssl-enabled tcp socket: real 2.904s	user 2.641s	sys 2.187s
I20260924 09:57:53.896602   379 rpc-test.cc:1859] Sending 1024MB via ssl-enabled tcp socket: real 2.964s	user 2.661s	sys 2.291s
[       OK ] Parameters/TestRpc.TestPerformanceBySocketType/SSL_TCP (14617 ms)
[----------] 20 tests from Parameters/TestRpc (47682 ms total)

[----------] 1 test from Parameters/TestRpcSocketTxRxQueue
[ RUN      ] Parameters/TestRpcSocketTxRxQueue.OverCapacity/0
W20260924 09:57:54.204746   889 negotiation.cc:337] Failed RPC negotiation. Trace:
0924 09:57:53.923888 (+     0us) reactor.cc:625] Submitting negotiation task for client connection to 0.0.0.0:37409 (local address 127.0.0.1:36046)
0924 09:57:53.924051 (+   163us) negotiation.cc:107] Waiting for socket to connect
0924 09:57:53.924064 (+    13us) client_negotiation.cc:174] Beginning negotiation
0924 09:57:53.924147 (+    83us) client_negotiation.cc:252] Sending NEGOTIATE NegotiatePB request
0924 09:57:54.204362 (+280215us) negotiation.cc:327] Negotiation complete: Network error: Client connection negotiation failed: client connection to 0.0.0.0:37409: BlockingRecv error: recv error from unknown peer: Transport endpoint is not connected (error 107)
Metrics: {"client-negotiator.queue_time_us":54}
W20260924 09:57:54.204741   853 negotiation.cc:337] Failed RPC negotiation. Trace:
0924 09:57:53.913631 (+     0us) reactor.cc:625] Submitting negotiation task for client connection to 0.0.0.0:37409 (local address 127.0.0.1:36016)
0924 09:57:53.913801 (+   170us) negotiation.cc:107] Waiting for socket to connect
0924 09:57:53.913819 (+    18us) client_negotiation.cc:174] Beginning negotiation
0924 09:57:53.913943 (+   124us) client_negotiation.cc:252] Sending NEGOTIATE NegotiatePB request
0924 09:57:54.204382 (+290439us) negotiation.cc:327] Negotiation complete: Network error: Client connection negotiation failed: client connection to 0.0.0.0:37409: BlockingRecv error: recv error from unknown peer: Transport endpoint is not connected (error 107)
Metrics: {"client-negotiator.queue_time_us":52}
W20260924 09:57:54.205000   871 negotiation.cc:337] Failed RPC negotiation. Trace:
0924 09:57:53.918746 (+     0us) reactor.cc:625] Submitting negotiation task for client connection to 0.0.0.0:37409 (local address 127.0.0.1:36034)
0924 09:57:53.918925 (+   179us) negotiation.cc:107] Waiting for socket to connect
0924 09:57:53.918979 (+    54us) client_negotiation.cc:174] Beginning negotiation
0924 09:57:53.919098 (+   119us) client_negotiation.cc:252] Sending NEGOTIATE NegotiatePB request
0924 09:57:54.204488 (+285390us) negotiation.cc:327] Negotiation complete: Network error: Client connection negotiation failed: client connection to 0.0.0.0:37409: BlockingRecv error: recv error from unknown peer: Transport endpoint is not connected (error 107)
Metrics: {"client-negotiator.queue_time_us":34}
W20260924 09:57:54.204823   862 negotiation.cc:337] Failed RPC negotiation. Trace:
0924 09:57:53.916105 (+     0us) reactor.cc:625] Submitting negotiation task for client connection to 0.0.0.0:37409 (local address 127.0.0.1:36030)
0924 09:57:53.916271 (+   166us) negotiation.cc:107] Waiting for socket to connect
0924 09:57:53.916295 (+    24us) client_negotiation.cc:174] Beginning negotiation
0924 09:57:53.916379 (+    84us) client_negotiation.cc:252] Sending NEGOTIATE NegotiatePB request
0924 09:57:54.204385 (+288006us) negotiation.cc:327] Negotiation complete: Network error: Client connection negotiation failed: client connection to 0.0.0.0:37409: BlockingRecv error: recv error from unknown peer: Transport endpoint is not connected (error 107)
Metrics: {"client-negotiator.queue_time_us":56}
W20260924 09:57:54.205736   880 negotiation.cc:337] Failed RPC negotiation. Trace:
0924 09:57:53.921201 (+     0us) reactor.cc:625] Submitting negotiation task for client connection to 0.0.0.0:37409 (local address 127.0.0.1:36044)
0924 09:57:53.921375 (+   174us) negotiation.cc:107] Waiting for socket to connect
0924 09:57:53.921389 (+    14us) client_negotiation.cc:174] Beginning negotiation
0924 09:57:53.921471 (+    82us) client_negotiation.cc:252] Sending NEGOTIATE NegotiatePB request
0924 09:57:54.204765 (+283294us) negotiation.cc:327] Negotiation complete: Network error: Client connection negotiation failed: client connection to 0.0.0.0:37409: BlockingRecv error: recv error from unknown peer: Transport endpoint is not connected (error 107)
Metrics: {"client-negotiator.queue_time_us":63}
W20260924 09:57:54.205911   898 negotiation.cc:337] Failed RPC negotiation. Trace:
0924 09:57:53.926617 (+     0us) reactor.cc:625] Submitting negotiation task for client connection to 0.0.0.0:37409 (local address 127.0.0.1:36062)
0924 09:57:53.926825 (+   208us) negotiation.cc:107] Waiting for socket to connect
0924 09:57:53.926843 (+    18us) client_negotiation.cc:174] Beginning negotiation
0924 09:57:53.926931 (+    88us) client_negotiation.cc:252] Sending NEGOTIATE NegotiatePB request
0924 09:57:54.205462 (+278531us) negotiation.cc:327] Negotiation complete: Network error: Client connection negotiation failed: client connection to 0.0.0.0:37409: BlockingRecv error: recv error from unknown peer: Transport endpoint is not connected (error 107)
Metrics: {"client-negotiator.queue_time_us":56}
[       OK ] Parameters/TestRpcSocketTxRxQueue.OverCapacity/0 (1070 ms)
[----------] 1 test from Parameters/TestRpcSocketTxRxQueue (1071 ms total)

[----------] Global test environment tear-down
[==========] 21 tests from 2 test suites ran. (48753 ms total)
[  PASSED  ] 20 tests.
[  FAILED  ] 1 test, listed below:
[  FAILED  ] Parameters/TestRpc.TestCallWithChainCertAndChainCA/SSL_TCP, where GetParam() = (true, false)

 1 FAILED TEST