Diagnosed failure
Parameters/TestRpc.TestCallWithChainCertAndChainCA/SSL_UnixSocket: /data0/somelongdirectorytoavoidrpathissues/src/kudu/src/kudu/rpc/rpc-test.cc:270: Failure
Failed
Bad status: Runtime error: could not verify certificate chain (error with cert: subject=CN = localhost, ST = sadfjas, C = AS, emailAddress = sdflkdsajf, O = lskdfjlsad, OU = sldfkja, issuer=C = AS, ST = ASDfkjdhf, L = lskdjf, O = saldfja, OU = skdjf, CN = localhost, emailAddress = sadjflkadsj): : certificate has expired
Google Test trace:
/data0/somelongdirectorytoavoidrpathissues/src/kudu/src/kudu/rpc/rpc-test.cc:267: Connecting to unix:/tmp/dist-test-task9tS4vH/test-tmp/rpc-test-3df988c2ba2a482f9bdb4e206b86a78a.sock
I20260925 06:06:47.445842 379 test_util.cc:175] -----------------------------------------------
I20260925 06:06:47.445938 379 test_util.cc:176] Had fatal failures, leaving test files at /tmp/dist-test-task9tS4vH/test-tmp/rpc-test.6.Parameters_TestRpc.TestCallWithChainCertAndChainCA_SSL_UnixSocket.1790316407293791-379-0
Full log
Note: This is test shard 7 of 8.
[==========] Running 21 tests from 2 test suites.
[----------] Global test environment set-up.
[----------] 20 tests from Parameters/TestRpc
[ RUN ] Parameters/TestRpc.TestMessengerCreateDestroy/SSL_UnixSocket
WARNING: Logging before InitGoogleLogging() is written to STDERR
I20260925 06:06:47.342032 379 rpc-test.cc:169] started messenger TestCreateDestroy
[ OK ] Parameters/TestRpc.TestMessengerCreateDestroy/SSL_UnixSocket (31 ms)
[ RUN ] Parameters/TestRpc.TestNegotiationDeadlock/SSL_UnixSocket
I20260925 06:06:47.371627 399 acceptor_pool.cc:254] collecting diagnostics on the listening RPC socket unix:/tmp/dist-test-task9tS4vH/test-tmp/rpc-test-65b3d2a4a0774828b18072a874152684.sock every 8 connection(s)
I20260925 06:06:47.372044 400 acceptor_pool.cc:254] collecting diagnostics on the listening RPC socket unix:/tmp/dist-test-task9tS4vH/test-tmp/rpc-test-65b3d2a4a0774828b18072a874152684.sock every 8 connection(s)
[ OK ] Parameters/TestRpc.TestNegotiationDeadlock/SSL_UnixSocket (45 ms)
[ RUN ] Parameters/TestRpc.TestCallWithChainCertAndChainCA/SSL_UnixSocket
I20260925 06:06:47.433323 415 acceptor_pool.cc:254] collecting diagnostics on the listening RPC socket unix:/tmp/dist-test-task9tS4vH/test-tmp/rpc-test-3df988c2ba2a482f9bdb4e206b86a78a.sock every 8 connection(s)
I20260925 06:06:47.433727 416 acceptor_pool.cc:254] collecting diagnostics on the listening RPC socket unix:/tmp/dist-test-task9tS4vH/test-tmp/rpc-test-3df988c2ba2a482f9bdb4e206b86a78a.sock every 8 connection(s)
/data0/somelongdirectorytoavoidrpathissues/src/kudu/src/kudu/rpc/rpc-test.cc:270: Failure
Failed
Bad status: Runtime error: could not verify certificate chain (error with cert: subject=CN = localhost, ST = sadfjas, C = AS, emailAddress = sdflkdsajf, O = lskdfjlsad, OU = sldfkja, issuer=C = AS, ST = ASDfkjdhf, L = lskdjf, O = saldfja, OU = skdjf, CN = localhost, emailAddress = sadjflkadsj): : certificate has expired
Google Test trace:
/data0/somelongdirectorytoavoidrpathissues/src/kudu/src/kudu/rpc/rpc-test.cc:267: Connecting to unix:/tmp/dist-test-task9tS4vH/test-tmp/rpc-test-3df988c2ba2a482f9bdb4e206b86a78a.sock
I20260925 06:06:47.445842 379 test_util.cc:175] -----------------------------------------------
I20260925 06:06:47.445938 379 test_util.cc:176] Had fatal failures, leaving test files at /tmp/dist-test-task9tS4vH/test-tmp/rpc-test.6.Parameters_TestRpc.TestCallWithChainCertAndChainCA_SSL_UnixSocket.1790316407293791-379-0
[ FAILED ] Parameters/TestRpc.TestCallWithChainCertAndChainCA/SSL_UnixSocket, where GetParam() = (true, true) (54 ms)
[ RUN ] Parameters/TestRpc.TestCallWithPasswordProtectedKey/SSL_UnixSocket
I20260925 06:06:47.495896 440 acceptor_pool.cc:254] collecting diagnostics on the listening RPC socket unix:/tmp/dist-test-task9tS4vH/test-tmp/rpc-test-039b603249aa4416b8b5318e950178b4.sock every 8 connection(s)
I20260925 06:06:47.496109 441 acceptor_pool.cc:254] collecting diagnostics on the listening RPC socket unix:/tmp/dist-test-task9tS4vH/test-tmp/rpc-test-039b603249aa4416b8b5318e950178b4.sock every 8 connection(s)
W20260925 06:06:47.526337 437 connection.cc:196] Error closing socket: Network error: TlsSocket::Close: Broken pipe
[ OK ] Parameters/TestRpc.TestCallWithPasswordProtectedKey/SSL_UnixSocket (84 ms)
[ RUN ] Parameters/TestRpc.TestCallToBadServer/SSL_UnixSocket
I20260925 06:06:47.551434 379 rpc-test.cc:394] Status: Network error: Client connection negotiation failed: client connection to 0.0.0.0:0: connect: Connection refused (error 111)
I20260925 06:06:47.552150 379 rpc-test.cc:394] Status: Network error: Client connection negotiation failed: client connection to 0.0.0.0:0: connect: Connection refused (error 111)
I20260925 06:06:47.552860 379 rpc-test.cc:394] Status: Network error: Client connection negotiation failed: client connection to 0.0.0.0:0: connect: Connection refused (error 111)
I20260925 06:06:47.553526 379 rpc-test.cc:394] Status: Network error: Client connection negotiation failed: client connection to 0.0.0.0:0: connect: Connection refused (error 111)
I20260925 06:06:47.554148 379 rpc-test.cc:394] Status: Network error: Client connection negotiation failed: client connection to 0.0.0.0:0: connect: Connection refused (error 111)
[ OK ] Parameters/TestRpc.TestCallToBadServer/SSL_UnixSocket (25 ms)
[ RUN ] Parameters/TestRpc.TestWrongService/SSL_UnixSocket
I20260925 06:06:47.577051 475 acceptor_pool.cc:254] collecting diagnostics on the listening RPC socket unix:/tmp/dist-test-task9tS4vH/test-tmp/rpc-test-a04916da679d419bbe9ab721bb61654c.sock every 8 connection(s)
I20260925 06:06:47.577319 476 acceptor_pool.cc:254] collecting diagnostics on the listening RPC socket unix:/tmp/dist-test-task9tS4vH/test-tmp/rpc-test-a04916da679d419bbe9ab721bb61654c.sock every 8 connection(s)
I20260925 06:06:47.594383 472 messenger.cc:345] service WrongServiceName not registered on TestServer
[ OK ] Parameters/TestRpc.TestWrongService/SSL_UnixSocket (43 ms)
[ RUN ] Parameters/TestRpc.TestConnectionKeepalive/SSL_UnixSocket
I20260925 06:06:47.613793 498 acceptor_pool.cc:254] collecting diagnostics on the listening RPC socket unix:/tmp/dist-test-task9tS4vH/test-tmp/rpc-test-e6aa09f56d9d4a838067e0f7d9cf8536.sock every 8 connection(s)
I20260925 06:06:47.613952 499 acceptor_pool.cc:254] collecting diagnostics on the listening RPC socket unix:/tmp/dist-test-task9tS4vH/test-tmp/rpc-test-e6aa09f56d9d4a838067e0f7d9cf8536.sock every 8 connection(s)
I20260925 06:06:47.614916 379 rpc-test.cc:488] Connecting to unix:/tmp/dist-test-task9tS4vH/test-tmp/rpc-test-e6aa09f56d9d4a838067e0f7d9cf8536.sock
W20260925 06:06:48.101675 511 connection.cc:196] Error closing socket: Network error: TlsSocket::Close: Broken pipe
[ OK ] Parameters/TestRpc.TestConnectionKeepalive/SSL_UnixSocket (1048 ms)
[ RUN ] Parameters/TestRpc.TestClientConnectionMetrics/SSL_UnixSocket
I20260925 06:06:48.667791 523 acceptor_pool.cc:254] collecting diagnostics on the listening RPC socket unix:/tmp/dist-test-task9tS4vH/test-tmp/rpc-test-268fc5471a2d408381f7c45359e0c7b8.sock every 8 connection(s)
I20260925 06:06:48.668038 524 acceptor_pool.cc:254] collecting diagnostics on the listening RPC socket unix:/tmp/dist-test-task9tS4vH/test-tmp/rpc-test-268fc5471a2d408381f7c45359e0c7b8.sock every 8 connection(s)
I20260925 06:06:48.668951 379 rpc-test.cc:569] Connecting to unix:/tmp/dist-test-task9tS4vH/test-tmp/rpc-test-268fc5471a2d408381f7c45359e0c7b8.sock
W20260925 06:07:10.162364 520 connection.cc:196] Error closing socket: Network error: TlsSocket::Close: Broken pipe
[ OK ] Parameters/TestRpc.TestClientConnectionMetrics/SSL_UnixSocket (21521 ms)
[ RUN ] Parameters/TestRpc.TestCredentialsPolicy/SSL_UnixSocket
I20260925 06:07:10.191805 546 acceptor_pool.cc:254] collecting diagnostics on the listening RPC socket unix:/tmp/dist-test-task9tS4vH/test-tmp/rpc-test-4b8a374c309044618f41b4aeae339cbe.sock every 8 connection(s)
I20260925 06:07:10.192096 547 acceptor_pool.cc:254] collecting diagnostics on the listening RPC socket unix:/tmp/dist-test-task9tS4vH/test-tmp/rpc-test-4b8a374c309044618f41b4aeae339cbe.sock every 8 connection(s)
I20260925 06:07:10.193017 379 rpc-test.cc:700] Connecting to unix:/tmp/dist-test-task9tS4vH/test-tmp/rpc-test-4b8a374c309044618f41b4aeae339cbe.sock
W20260925 06:07:10.224658 545 connection.cc:196] Error closing socket: Network error: TlsSocket::Close: Broken pipe
W20260925 06:07:10.232388 545 connection.cc:196] Error closing socket: Network error: TlsSocket::Close: Broken pipe
[ OK ] Parameters/TestRpc.TestCredentialsPolicy/SSL_UnixSocket (67 ms)
[ RUN ] Parameters/TestRpc.TestCallLongerThanKeepalive/SSL_UnixSocket
I20260925 06:07:10.250305 571 acceptor_pool.cc:254] collecting diagnostics on the listening RPC socket unix:/tmp/dist-test-task9tS4vH/test-tmp/rpc-test-97c2e56126584a55839d49fc618bc3ea.sock every 8 connection(s)
I20260925 06:07:10.250512 572 acceptor_pool.cc:254] collecting diagnostics on the listening RPC socket unix:/tmp/dist-test-task9tS4vH/test-tmp/rpc-test-97c2e56126584a55839d49fc618bc3ea.sock every 8 connection(s)
I20260925 06:07:10.271595 575 rpc-test-base.h:222] got call: sleep_micros: 3000000 deferred: true
I20260925 06:07:13.273295 575 rpcz_store.cc:275] Call kudu.rpc.GenericCalculatorService.Sleep from unix:<unnamed> (request call id 0) took 3001 ms. Trace:
I20260925 06:07:13.273469 575 rpcz_store.cc:276] 0925 06:07:10.271460 (+ 0us) service_pool.cc:170] Inserting onto call queue
0925 06:07:10.271549 (+ 89us) service_pool.cc:227] Handling call
0925 06:07:13.273244 (+3001695us) inbound_call.cc:173] Queueing success response
Metrics: {}
[ OK ] Parameters/TestRpc.TestCallLongerThanKeepalive/SSL_UnixSocket (3042 ms)
[ RUN ] Parameters/TestRpc.TestRpcSidecar/SSL_UnixSocket
I20260925 06:07:13.290966 596 acceptor_pool.cc:254] collecting diagnostics on the listening RPC socket unix:/tmp/dist-test-task9tS4vH/test-tmp/rpc-test-c8691fb21fb64afb95656be7da091e4c.sock every 8 connection(s)
I20260925 06:07:13.291262 597 acceptor_pool.cc:254] collecting diagnostics on the listening RPC socket unix:/tmp/dist-test-task9tS4vH/test-tmp/rpc-test-c8691fb21fb64afb95656be7da091e4c.sock every 8 connection(s)
W20260925 06:07:13.394472 593 connection.cc:196] Error closing socket: Network error: TlsSocket::Close: Broken pipe
[ OK ] Parameters/TestRpc.TestRpcSidecar/SSL_UnixSocket (117 ms)
[ RUN ] Parameters/TestRpc.TestRpcSidecarLimits/SSL_UnixSocket
I20260925 06:07:15.573083 621 acceptor_pool.cc:254] collecting diagnostics on the listening RPC socket unix:/tmp/dist-test-task9tS4vH/test-tmp/rpc-test-191af91f208b45909f09551d751fbbab.sock every 8 connection(s)
I20260925 06:07:15.573413 622 acceptor_pool.cc:254] collecting diagnostics on the listening RPC socket unix:/tmp/dist-test-task9tS4vH/test-tmp/rpc-test-191af91f208b45909f09551d751fbbab.sock every 8 connection(s)
W20260925 06:07:15.590745 379 serialization.cc:72] Serialized kudu.rpc_test.PushStringsRequestPB (2147483654 bytes) is larger than the maximum configured RPC message size (52428800 bytes). Sending anyway, but peer may reject the data.
W20260925 06:07:15.597147 618 connection.cc:535] server connection from unix:<unnamed> recv error: Network error: RPC frame had a length of 2147483714, but we only support messages up to 52428800 bytes long.
W20260925 06:07:15.597261 618 connection.cc:158] shutting down server connection from unix:<unnamed> with pending inbound data: 4/2147483714 bytes received; last active 0 ns ago: status Network error: RPC frame had a length of 2147483714, but we only support messages up to 52428800 bytes long.
W20260925 06:07:15.597549 634 connection.cc:698] client connection to unix:/tmp/dist-test-task9tS4vH/test-tmp/rpc-test-191af91f208b45909f09551d751fbbab.sock send error: Network error: failed to write to TLS socket: Broken pipe
W20260925 06:07:15.597852 634 connection.cc:196] Error closing socket: Network error: TlsSocket::Close: Success
I20260925 06:07:15.619058 646 acceptor_pool.cc:254] collecting diagnostics on the listening RPC socket unix:/tmp/dist-test-task9tS4vH/test-tmp/rpc-test-191af91f208b45909f09551d751fbbab.sock every 8 connection(s)
I20260925 06:07:15.619297 647 acceptor_pool.cc:254] collecting diagnostics on the listening RPC socket unix:/tmp/dist-test-task9tS4vH/test-tmp/rpc-test-191af91f208b45909f09551d751fbbab.sock every 8 connection(s)
W20260925 06:07:21.389709 643 connection.cc:577] server connection from unix:<unnamed>: received bad data: 'Corruption: Invalid packet: message had a length of 2147483710, but we only support messages up to 2147483647 bytes
'
W20260925 06:07:21.390339 659 connection.cc:196] Error closing socket: Network error: TlsSocket::Close: Broken pipe
[ OK ] Parameters/TestRpc.TestRpcSidecarLimits/SSL_UnixSocket (8458 ms)
[ RUN ] Parameters/TestRpc.TestCallTimeoutDoesntAffectNegotiation/SSL_UnixSocket
I20260925 06:07:21.873594 671 acceptor_pool.cc:254] collecting diagnostics on the listening RPC socket unix:/tmp/dist-test-task9tS4vH/test-tmp/rpc-test-41c03f822ec3499ba285d23cf6aa4ab5.sock every 8 connection(s)
I20260925 06:07:21.873831 672 acceptor_pool.cc:254] collecting diagnostics on the listening RPC socket unix:/tmp/dist-test-task9tS4vH/test-tmp/rpc-test-41c03f822ec3499ba285d23cf6aa4ab5.sock every 8 connection(s)
W20260925 06:07:21.898847 667 negotiation.cc:266] Injecting 500ms delay in negotiation
I20260925 06:07:21.949586 379 rpc-test-base.h:595] status: Timed out: connection negotiation to unix:/tmp/dist-test-task9tS4vH/test-tmp/rpc-test-41c03f822ec3499ba285d23cf6aa4ab5.sock for RPC Sleep timed out after 0.050s (ON_OUTBOUND_QUEUE), seconds elapsed: 0.05133
W20260925 06:07:22.406713 668 connection.cc:196] Error closing socket: Network error: TlsSocket::Close: Broken pipe
[ OK ] Parameters/TestRpc.TestCallTimeoutDoesntAffectNegotiation/SSL_UnixSocket (553 ms)
[ RUN ] Parameters/TestRpc.TestRpcHandlerLatencyMetric/SSL_UnixSocket
I20260925 06:07:22.430650 696 acceptor_pool.cc:254] collecting diagnostics on the listening RPC socket unix:/tmp/dist-test-task9tS4vH/test-tmp/rpc-test-2429f777c12f46a8a43e5fc2f09b0c8e.sock every 8 connection(s)
I20260925 06:07:22.430949 697 acceptor_pool.cc:254] collecting diagnostics on the listening RPC socket unix:/tmp/dist-test-task9tS4vH/test-tmp/rpc-test-2429f777c12f46a8a43e5fc2f09b0c8e.sock every 8 connection(s)
I20260925 06:07:22.478971 379 rpc-test.cc:1236] Sleep() min lat: 20586
I20260925 06:07:22.479092 379 rpc-test.cc:1237] Sleep() mean lat: 20586
I20260925 06:07:22.479132 379 rpc-test.cc:1238] Sleep() max lat: 20586
I20260925 06:07:22.479151 379 rpc-test.cc:1239] Sleep() #calls: 1
W20260925 06:07:22.480551 693 connection.cc:196] Error closing socket: Network error: TlsSocket::Close: Broken pipe
[ OK ] Parameters/TestRpc.TestRpcHandlerLatencyMetric/SSL_UnixSocket (74 ms)
[ RUN ] Parameters/TestRpc.TimedOutOnResponseMetricServiceQueue/SSL_UnixSocket
I20260925 06:07:22.501657 722 acceptor_pool.cc:254] collecting diagnostics on the listening RPC socket unix:/tmp/dist-test-task9tS4vH/test-tmp/rpc-test-90fd45c8425642ee9377991c5fcda2b6.sock every 8 connection(s)
I20260925 06:07:22.501897 723 acceptor_pool.cc:254] collecting diagnostics on the listening RPC socket unix:/tmp/dist-test-task9tS4vH/test-tmp/rpc-test-90fd45c8425642ee9377991c5fcda2b6.sock every 8 connection(s)
W20260925 06:07:22.587473 724 rpcz_store.cc:267] Call kudu.rpc_test.CalculatorService.Sleep from unix:<unnamed> (request call id 2) took 20 ms (client timeout 20 ms). Trace:
W20260925 06:07:22.587664 724 rpcz_store.cc:269] 0925 06:07:22.567089 (+ 0us) service_pool.cc:170] Inserting onto call queue
0925 06:07:22.587387 (+ 20298us) service_pool.cc:214] Skipping call since client already timed out
0925 06:07:22.587449 (+ 62us) inbound_call.cc:173] Queueing failure response
Metrics: {}
[ OK ] Parameters/TestRpc.TimedOutOnResponseMetricServiceQueue/SSL_UnixSocket (107 ms)
[ RUN ] Parameters/TestRpc.RpcPendingConnectionsMetric/SSL_UnixSocket
I20260925 06:07:22.596508 745 acceptor_pool.cc:254] collecting diagnostics on the listening RPC socket 0.0.0.0:41303 every 8 connection(s)
I20260925 06:07:22.596729 746 acceptor_pool.cc:254] collecting diagnostics on the listening RPC socket 0.0.0.0:41303 every 8 connection(s)
W20260925 06:07:22.606841 741 negotiation.cc:337] Failed RPC negotiation. Trace:
0925 06:07:22.605913 (+ 0us) reactor.cc:625] Submitting negotiation task for server connection from 127.0.0.1:42486 (local address 127.0.0.1:41303)
0925 06:07:22.606119 (+ 206us) server_negotiation.cc:206] Beginning negotiation
0925 06:07:22.606127 (+ 8us) server_negotiation.cc:399] Waiting for connection header
0925 06:07:22.606338 (+ 211us) negotiation.cc:327] Negotiation complete: Network error: Server connection negotiation failed: server connection from 127.0.0.1:42486: BlockingRecv error: recv got EOF from 127.0.0.1:42486 (error 108)
Metrics: {"server-negotiator.queue_time_us":50}
[ OK ] Parameters/TestRpc.RpcPendingConnectionsMetric/SSL_UnixSocket (26 ms)
[ RUN ] Parameters/TestRpc.TestRpcContextClientDeadline/SSL_UnixSocket
I20260925 06:07:22.636161 761 acceptor_pool.cc:254] collecting diagnostics on the listening RPC socket unix:/tmp/dist-test-task9tS4vH/test-tmp/rpc-test-4fe77262a0684050a14b29178e5cf5b1.sock every 8 connection(s)
I20260925 06:07:22.636381 762 acceptor_pool.cc:254] collecting diagnostics on the listening RPC socket unix:/tmp/dist-test-task9tS4vH/test-tmp/rpc-test-4fe77262a0684050a14b29178e5cf5b1.sock every 8 connection(s)
[ OK ] Parameters/TestRpc.TestRpcContextClientDeadline/SSL_UnixSocket (74 ms)
[ RUN ] Parameters/TestRpc.TestApplicationFeatureFlagUnsupportedServer/SSL_UnixSocket
I20260925 06:07:22.722222 786 acceptor_pool.cc:254] collecting diagnostics on the listening RPC socket unix:/tmp/dist-test-task9tS4vH/test-tmp/rpc-test-eb058801c23f4bf0b531413d1170eb53.sock every 8 connection(s)
I20260925 06:07:22.722492 787 acceptor_pool.cc:254] collecting diagnostics on the listening RPC socket unix:/tmp/dist-test-task9tS4vH/test-tmp/rpc-test-eb058801c23f4bf0b531413d1170eb53.sock every 8 connection(s)
[ OK ] Parameters/TestRpc.TestApplicationFeatureFlagUnsupportedServer/SSL_UnixSocket (53 ms)
[ RUN ] Parameters/TestRpc.TestCancellationAsync/SSL_UnixSocket
I20260925 06:07:22.759426 811 acceptor_pool.cc:254] collecting diagnostics on the listening RPC socket unix:/tmp/dist-test-task9tS4vH/test-tmp/rpc-test-ed6bdec6edca4f31b28a0193155f6668.sock every 8 connection(s)
I20260925 06:07:22.759676 812 acceptor_pool.cc:254] collecting diagnostics on the listening RPC socket unix:/tmp/dist-test-task9tS4vH/test-tmp/rpc-test-ed6bdec6edca4f31b28a0193155f6668.sock every 8 connection(s)
I20260925 06:07:22.760525 379 rpc-test.cc:1716] Connecting to unix:/tmp/dist-test-task9tS4vH/test-tmp/rpc-test-ed6bdec6edca4f31b28a0193155f6668.sock
I20260925 06:07:22.771063 379 test_util.cc:268] Using random seed: -2019860893
I20260925 06:07:22.805472 815 rpc-test-base.h:240] got call: sleep_micros: 500 pattern: 4294967295 num_repetitions: 2097152 sidecar_idx: 0
I20260925 06:07:22.842327 815 rpc-test-base.h:240] got call: sleep_micros: 500 pattern: 4294967295 num_repetitions: 2097152 sidecar_idx: 0
I20260925 06:07:22.876494 815 rpc-test-base.h:240] got call: sleep_micros: 500 pattern: 4294967295 num_repetitions: 2097152 sidecar_idx: 0
I20260925 06:07:22.909190 815 rpc-test-base.h:240] got call: sleep_micros: 500 pattern: 4294967295 num_repetitions: 2097152 sidecar_idx: 0
I20260925 06:07:22.941602 814 rpc-test-base.h:240] got call: sleep_micros: 500 pattern: 4294967295 num_repetitions: 2097152 sidecar_idx: 0
I20260925 06:07:22.974577 815 rpc-test-base.h:240] got call: sleep_micros: 500 pattern: 4294967295 num_repetitions: 2097152 sidecar_idx: 0
I20260925 06:07:23.006274 814 rpc-test-base.h:240] got call: sleep_micros: 500 pattern: 4294967295 num_repetitions: 2097152 sidecar_idx: 0
W20260925 06:07:23.008587 808 connection.cc:196] Error closing socket: Network error: TlsSocket::Close: Broken pipe
W20260925 06:07:23.040158 808 connection.cc:441] server connection from unix:<unnamed> torn down before Call kudu.rpc.GenericCalculatorService.SleepWithSidecar from unix:<unnamed> (request call id 9) could send its response
[ OK ] Parameters/TestRpc.TestCancellationAsync/SSL_UnixSocket (296 ms)
[ RUN ] Parameters/TestRpc.TestPerformanceBySocketType/SSL_UnixSocket
I20260925 06:07:23.063678 836 acceptor_pool.cc:254] collecting diagnostics on the listening RPC socket unix:/tmp/dist-test-task9tS4vH/test-tmp/rpc-test-89d4dd74ce434b2c993ff9efacb98e62.sock every 8 connection(s)
I20260925 06:07:23.063912 837 acceptor_pool.cc:254] collecting diagnostics on the listening RPC socket unix:/tmp/dist-test-task9tS4vH/test-tmp/rpc-test-89d4dd74ce434b2c993ff9efacb98e62.sock every 8 connection(s)
I20260925 06:07:23.064745 379 rpc-test.cc:1846] Connecting to unix:/tmp/dist-test-task9tS4vH/test-tmp/rpc-test-89d4dd74ce434b2c993ff9efacb98e62.sock
I20260925 06:07:26.281229 379 rpc-test.cc:1859] Sending 1024MB via ssl-enabled unix socket: real 3.194s user 3.027s sys 2.396s
I20260925 06:07:29.520823 379 rpc-test.cc:1859] Sending 1024MB via ssl-enabled unix socket: real 3.239s user 3.123s sys 2.395s
I20260925 06:07:32.745061 379 rpc-test.cc:1859] Sending 1024MB via ssl-enabled unix socket: real 3.224s user 3.259s sys 2.200s
I20260925 06:07:35.855583 379 rpc-test.cc:1859] Sending 1024MB via ssl-enabled unix socket: real 3.110s user 2.946s sys 2.318s
I20260925 06:07:39.001082 379 rpc-test.cc:1859] Sending 1024MB via ssl-enabled unix socket: real 3.145s user 3.037s sys 2.274s
W20260925 06:07:39.003507 833 connection.cc:196] Error closing socket: Network error: TlsSocket::Close: Broken pipe
[ OK ] Parameters/TestRpc.TestPerformanceBySocketType/SSL_UnixSocket (15965 ms)
[----------] 20 tests from Parameters/TestRpc (51695 ms total)
[----------] 1 test from Parameters/TestRpcSocketTxRxQueue
[ RUN ] Parameters/TestRpcSocketTxRxQueue.AcceptorRxQueueSizeMetric/0
I20260925 06:07:39.017604 861 acceptor_pool.cc:254] collecting diagnostics on the listening RPC socket 0.0.0.0:41831 every 1 connection(s)
I20260925 06:07:39.017884 862 acceptor_pool.cc:254] collecting diagnostics on the listening RPC socket 0.0.0.0:41831 every 1 connection(s)
W20260925 06:07:39.019737 857 negotiation.cc:337] Failed RPC negotiation. Trace:
0925 06:07:39.019290 (+ 0us) reactor.cc:625] Submitting negotiation task for server connection from 127.0.0.1:59702 (local address 127.0.0.1:41831)
0925 06:07:39.019492 (+ 202us) server_negotiation.cc:206] Beginning negotiation
0925 06:07:39.019498 (+ 6us) server_negotiation.cc:399] Waiting for connection header
0925 06:07:39.019620 (+ 122us) negotiation.cc:327] Negotiation complete: Network error: Server connection negotiation failed: server connection from 127.0.0.1:59702: BlockingRecv error: recv got EOF from 127.0.0.1:59702 (error 108)
Metrics: {"server-negotiator.queue_time_us":98}
[ OK ] Parameters/TestRpcSocketTxRxQueue.AcceptorRxQueueSizeMetric/0 (14 ms)
[----------] 1 test from Parameters/TestRpcSocketTxRxQueue (14 ms total)
[----------] Global test environment tear-down
[==========] 21 tests from 2 test suites ran. (51710 ms total)
[ PASSED ] 20 tests.
[ FAILED ] 1 test, listed below:
[ FAILED ] Parameters/TestRpc.TestCallWithChainCertAndChainCA/SSL_UnixSocket, where GetParam() = (true, true)
1 FAILED TEST