Diagnosed failure
Parameters/TestRpc.TestCallWithChainCertAndChainCA/SSL_UnixSocket: /data0/somelongdirectorytoavoidrpathissues/src/kudu/src/kudu/rpc/rpc-test.cc:270: Failure
Failed
Bad status: Runtime error: could not verify certificate chain (error with cert: subject=CN = localhost, ST = sadfjas, C = AS, emailAddress = sdflkdsajf, O = lskdfjlsad, OU = sldfkja, issuer=C = AS, ST = ASDfkjdhf, L = lskdjf, O = saldfja, OU = skdjf, CN = localhost, emailAddress = sadjflkadsj): : certificate has expired
Google Test trace:
/data0/somelongdirectorytoavoidrpathissues/src/kudu/src/kudu/rpc/rpc-test.cc:267: Connecting to unix:/tmp/dist-test-task3aBzcM/test-tmp/rpc-test-bf57c40fa79a4d2da12c17165210bcb8.sock
I20260928 06:10:40.341128 13645 test_util.cc:175] -----------------------------------------------
I20260928 06:10:40.341243 13645 test_util.cc:176] Had fatal failures, leaving test files at /tmp/dist-test-task3aBzcM/test-tmp/rpc-test.6.Parameters_TestRpc.TestCallWithChainCertAndChainCA_SSL_UnixSocket.1790575840256989-13645-0
Full log
Note: This is test shard 7 of 8.
[==========] Running 21 tests from 2 test suites.
[----------] Global test environment set-up.
[----------] 20 tests from Parameters/TestRpc
[ RUN ] Parameters/TestRpc.TestMessengerCreateDestroy/SSL_UnixSocket
WARNING: Logging before InitGoogleLogging() is written to STDERR
I20260928 06:10:40.282431 13645 rpc-test.cc:169] started messenger TestCreateDestroy
[ OK ] Parameters/TestRpc.TestMessengerCreateDestroy/SSL_UnixSocket (20 ms)
[ RUN ] Parameters/TestRpc.TestNegotiationDeadlock/SSL_UnixSocket
I20260928 06:10:40.295481 13665 acceptor_pool.cc:254] collecting diagnostics on the listening RPC socket unix:/tmp/dist-test-task3aBzcM/test-tmp/rpc-test-9896cdcea1d648c2bcbf4b7f8fcdcc2d.sock every 8 connection(s)
I20260928 06:10:40.295485 13666 acceptor_pool.cc:254] collecting diagnostics on the listening RPC socket unix:/tmp/dist-test-task3aBzcM/test-tmp/rpc-test-9896cdcea1d648c2bcbf4b7f8fcdcc2d.sock every 8 connection(s)
[ OK ] Parameters/TestRpc.TestNegotiationDeadlock/SSL_UnixSocket (23 ms)
[ RUN ] Parameters/TestRpc.TestCallWithChainCertAndChainCA/SSL_UnixSocket
I20260928 06:10:40.335850 13681 acceptor_pool.cc:254] collecting diagnostics on the listening RPC socket unix:/tmp/dist-test-task3aBzcM/test-tmp/rpc-test-bf57c40fa79a4d2da12c17165210bcb8.sock every 8 connection(s)
I20260928 06:10:40.335852 13682 acceptor_pool.cc:254] collecting diagnostics on the listening RPC socket unix:/tmp/dist-test-task3aBzcM/test-tmp/rpc-test-bf57c40fa79a4d2da12c17165210bcb8.sock every 8 connection(s)
/data0/somelongdirectorytoavoidrpathissues/src/kudu/src/kudu/rpc/rpc-test.cc:270: Failure
Failed
Bad status: Runtime error: could not verify certificate chain (error with cert: subject=CN = localhost, ST = sadfjas, C = AS, emailAddress = sdflkdsajf, O = lskdfjlsad, OU = sldfkja, issuer=C = AS, ST = ASDfkjdhf, L = lskdjf, O = saldfja, OU = skdjf, CN = localhost, emailAddress = sadjflkadsj): : certificate has expired
Google Test trace:
/data0/somelongdirectorytoavoidrpathissues/src/kudu/src/kudu/rpc/rpc-test.cc:267: Connecting to unix:/tmp/dist-test-task3aBzcM/test-tmp/rpc-test-bf57c40fa79a4d2da12c17165210bcb8.sock
I20260928 06:10:40.341128 13645 test_util.cc:175] -----------------------------------------------
I20260928 06:10:40.341243 13645 test_util.cc:176] Had fatal failures, leaving test files at /tmp/dist-test-task3aBzcM/test-tmp/rpc-test.6.Parameters_TestRpc.TestCallWithChainCertAndChainCA_SSL_UnixSocket.1790575840256989-13645-0
[ FAILED ] Parameters/TestRpc.TestCallWithChainCertAndChainCA/SSL_UnixSocket, where GetParam() = (true, true) (33 ms)
[ RUN ] Parameters/TestRpc.TestCallWithPasswordProtectedKey/SSL_UnixSocket
I20260928 06:10:40.349255 13707 acceptor_pool.cc:254] collecting diagnostics on the listening RPC socket unix:/tmp/dist-test-task3aBzcM/test-tmp/rpc-test-eff157c4b680458baa301dd7e8fbc77e.sock every 8 connection(s)
I20260928 06:10:40.349282 13706 acceptor_pool.cc:254] collecting diagnostics on the listening RPC socket unix:/tmp/dist-test-task3aBzcM/test-tmp/rpc-test-eff157c4b680458baa301dd7e8fbc77e.sock every 8 connection(s)
W20260928 06:10:40.363916 13703 connection.cc:196] Error closing socket: Network error: TlsSocket::Close: Broken pipe
[ OK ] Parameters/TestRpc.TestCallWithPasswordProtectedKey/SSL_UnixSocket (23 ms)
[ RUN ] Parameters/TestRpc.TestCallToBadServer/SSL_UnixSocket
I20260928 06:10:40.373832 13645 rpc-test.cc:394] Status: Network error: Client connection negotiation failed: client connection to 0.0.0.0:0: connect: Connection refused (error 111)
I20260928 06:10:40.374380 13645 rpc-test.cc:394] Status: Network error: Client connection negotiation failed: client connection to 0.0.0.0:0: connect: Connection refused (error 111)
I20260928 06:10:40.374907 13645 rpc-test.cc:394] Status: Network error: Client connection negotiation failed: client connection to 0.0.0.0:0: connect: Connection refused (error 111)
I20260928 06:10:40.375353 13645 rpc-test.cc:394] Status: Network error: Client connection negotiation failed: client connection to 0.0.0.0:0: connect: Connection refused (error 111)
I20260928 06:10:40.375779 13645 rpc-test.cc:394] Status: Network error: Client connection negotiation failed: client connection to 0.0.0.0:0: connect: Connection refused (error 111)
[ OK ] Parameters/TestRpc.TestCallToBadServer/SSL_UnixSocket (11 ms)
[ RUN ] Parameters/TestRpc.TestWrongService/SSL_UnixSocket
I20260928 06:10:40.383991 13741 acceptor_pool.cc:254] collecting diagnostics on the listening RPC socket unix:/tmp/dist-test-task3aBzcM/test-tmp/rpc-test-83df588aa2474442b6ddecd59b4145fc.sock every 8 connection(s)
I20260928 06:10:40.384037 13742 acceptor_pool.cc:254] collecting diagnostics on the listening RPC socket unix:/tmp/dist-test-task3aBzcM/test-tmp/rpc-test-83df588aa2474442b6ddecd59b4145fc.sock every 8 connection(s)
I20260928 06:10:40.407117 13738 messenger.cc:345] service WrongServiceName not registered on TestServer
W20260928 06:10:40.408046 13738 connection.cc:196] Error closing socket: Network error: TlsSocket::Close: Broken pipe
[ OK ] Parameters/TestRpc.TestWrongService/SSL_UnixSocket (33 ms)
[ RUN ] Parameters/TestRpc.TestConnectionKeepalive/SSL_UnixSocket
I20260928 06:10:40.422176 13764 acceptor_pool.cc:254] collecting diagnostics on the listening RPC socket unix:/tmp/dist-test-task3aBzcM/test-tmp/rpc-test-3db55373540346b09cfe133e7f1f50b2.sock every 8 connection(s)
I20260928 06:10:40.422214 13765 acceptor_pool.cc:254] collecting diagnostics on the listening RPC socket unix:/tmp/dist-test-task3aBzcM/test-tmp/rpc-test-3db55373540346b09cfe133e7f1f50b2.sock every 8 connection(s)
I20260928 06:10:40.422529 13645 rpc-test.cc:488] Connecting to unix:/tmp/dist-test-task3aBzcM/test-tmp/rpc-test-3db55373540346b09cfe133e7f1f50b2.sock
W20260928 06:10:40.911938 13777 connection.cc:196] Error closing socket: Network error: TlsSocket::Close: Broken pipe
[ OK ] Parameters/TestRpc.TestConnectionKeepalive/SSL_UnixSocket (1033 ms)
[ RUN ] Parameters/TestRpc.TestClientConnectionMetrics/SSL_UnixSocket
I20260928 06:10:41.468504 13789 acceptor_pool.cc:254] collecting diagnostics on the listening RPC socket unix:/tmp/dist-test-task3aBzcM/test-tmp/rpc-test-e2cd9a390c8e45d48c8ca5bcbaf3808d.sock every 8 connection(s)
I20260928 06:10:41.468506 13790 acceptor_pool.cc:254] collecting diagnostics on the listening RPC socket unix:/tmp/dist-test-task3aBzcM/test-tmp/rpc-test-e2cd9a390c8e45d48c8ca5bcbaf3808d.sock every 8 connection(s)
I20260928 06:10:41.468829 13645 rpc-test.cc:569] Connecting to unix:/tmp/dist-test-task3aBzcM/test-tmp/rpc-test-e2cd9a390c8e45d48c8ca5bcbaf3808d.sock
W20260928 06:10:52.862370 13786 connection.cc:196] Error closing socket: Network error: TlsSocket::Close: Broken pipe
[ OK ] Parameters/TestRpc.TestClientConnectionMetrics/SSL_UnixSocket (11420 ms)
[ RUN ] Parameters/TestRpc.TestCredentialsPolicy/SSL_UnixSocket
I20260928 06:10:52.870087 13812 acceptor_pool.cc:254] collecting diagnostics on the listening RPC socket unix:/tmp/dist-test-task3aBzcM/test-tmp/rpc-test-847d4ef52c264d108adf9c0d293e2102.sock every 8 connection(s)
I20260928 06:10:52.870127 13813 acceptor_pool.cc:254] collecting diagnostics on the listening RPC socket unix:/tmp/dist-test-task3aBzcM/test-tmp/rpc-test-847d4ef52c264d108adf9c0d293e2102.sock every 8 connection(s)
I20260928 06:10:52.870419 13645 rpc-test.cc:700] Connecting to unix:/tmp/dist-test-task3aBzcM/test-tmp/rpc-test-847d4ef52c264d108adf9c0d293e2102.sock
W20260928 06:10:52.895067 13811 connection.cc:196] Error closing socket: Network error: TlsSocket::Close: Broken pipe
W20260928 06:10:52.900461 13811 connection.cc:196] Error closing socket: Network error: TlsSocket::Close: Broken pipe
[ OK ] Parameters/TestRpc.TestCredentialsPolicy/SSL_UnixSocket (37 ms)
[ RUN ] Parameters/TestRpc.TestCallLongerThanKeepalive/SSL_UnixSocket
I20260928 06:10:52.922933 13837 acceptor_pool.cc:254] collecting diagnostics on the listening RPC socket unix:/tmp/dist-test-task3aBzcM/test-tmp/rpc-test-fb1cb286de054522b6c0a5dc77e80115.sock every 8 connection(s)
I20260928 06:10:52.922981 13838 acceptor_pool.cc:254] collecting diagnostics on the listening RPC socket unix:/tmp/dist-test-task3aBzcM/test-tmp/rpc-test-fb1cb286de054522b6c0a5dc77e80115.sock every 8 connection(s)
I20260928 06:10:52.943431 13841 rpc-test-base.h:222] got call: sleep_micros: 3000000 deferred: true
I20260928 06:10:55.944422 13841 rpcz_store.cc:275] Call kudu.rpc.GenericCalculatorService.Sleep from unix:<unnamed> (request call id 0) took 3001 ms. Trace:
I20260928 06:10:55.944559 13841 rpcz_store.cc:276] 0928 06:10:52.943293 (+ 0us) service_pool.cc:170] Inserting onto call queue
0928 06:10:52.943391 (+ 98us) service_pool.cc:227] Handling call
0928 06:10:55.944400 (+3001009us) inbound_call.cc:173] Queueing success response
Metrics: {}
W20260928 06:10:55.946308 13834 connection.cc:196] Error closing socket: Network error: TlsSocket::Close: Broken pipe
[ OK ] Parameters/TestRpc.TestCallLongerThanKeepalive/SSL_UnixSocket (3045 ms)
[ RUN ] Parameters/TestRpc.TestRpcSidecar/SSL_UnixSocket
I20260928 06:10:55.987195 13862 acceptor_pool.cc:254] collecting diagnostics on the listening RPC socket unix:/tmp/dist-test-task3aBzcM/test-tmp/rpc-test-620c98183f014a8eb97036d59bab3d01.sock every 8 connection(s)
I20260928 06:10:55.987555 13863 acceptor_pool.cc:254] collecting diagnostics on the listening RPC socket unix:/tmp/dist-test-task3aBzcM/test-tmp/rpc-test-620c98183f014a8eb97036d59bab3d01.sock every 8 connection(s)
W20260928 06:10:56.063571 13859 connection.cc:196] Error closing socket: Network error: TlsSocket::Close: Broken pipe
[ OK ] Parameters/TestRpc.TestRpcSidecar/SSL_UnixSocket (117 ms)
[ RUN ] Parameters/TestRpc.TestRpcSidecarLimits/SSL_UnixSocket
I20260928 06:10:57.879794 13888 acceptor_pool.cc:254] collecting diagnostics on the listening RPC socket unix:/tmp/dist-test-task3aBzcM/test-tmp/rpc-test-53986123b8464f62a2cc6333afdd9d42.sock every 8 connection(s)
I20260928 06:10:57.879866 13887 acceptor_pool.cc:254] collecting diagnostics on the listening RPC socket unix:/tmp/dist-test-task3aBzcM/test-tmp/rpc-test-53986123b8464f62a2cc6333afdd9d42.sock every 8 connection(s)
W20260928 06:10:57.904455 13645 serialization.cc:72] Serialized kudu.rpc_test.PushStringsRequestPB (2147483654 bytes) is larger than the maximum configured RPC message size (52428800 bytes). Sending anyway, but peer may reject the data.
W20260928 06:10:57.909046 13884 connection.cc:535] server connection from unix:<unnamed> recv error: Network error: RPC frame had a length of 2147483714, but we only support messages up to 52428800 bytes long.
W20260928 06:10:57.909175 13884 connection.cc:158] shutting down server connection from unix:<unnamed> with pending inbound data: 4/2147483714 bytes received; last active 0 ns ago: status Network error: RPC frame had a length of 2147483714, but we only support messages up to 52428800 bytes long.
W20260928 06:10:57.909550 13900 connection.cc:196] Error closing socket: Network error: TlsSocket::Close: Broken pipe
I20260928 06:10:57.932040 13912 acceptor_pool.cc:254] collecting diagnostics on the listening RPC socket unix:/tmp/dist-test-task3aBzcM/test-tmp/rpc-test-53986123b8464f62a2cc6333afdd9d42.sock every 8 connection(s)
I20260928 06:10:57.932323 13913 acceptor_pool.cc:254] collecting diagnostics on the listening RPC socket unix:/tmp/dist-test-task3aBzcM/test-tmp/rpc-test-53986123b8464f62a2cc6333afdd9d42.sock every 8 connection(s)
W20260928 06:11:04.096833 13909 connection.cc:577] server connection from unix:<unnamed>: received bad data: 'Corruption: Invalid packet: message had a length of 2147483710, but we only support messages up to 2147483647 bytes
'
W20260928 06:11:04.097323 13925 connection.cc:196] Error closing socket: Network error: TlsSocket::Close: Broken pipe
[ OK ] Parameters/TestRpc.TestRpcSidecarLimits/SSL_UnixSocket (8034 ms)
[ RUN ] Parameters/TestRpc.TestCallTimeoutDoesntAffectNegotiation/SSL_UnixSocket
I20260928 06:11:04.118700 13937 acceptor_pool.cc:254] collecting diagnostics on the listening RPC socket unix:/tmp/dist-test-task3aBzcM/test-tmp/rpc-test-6f8c840a302c49f98b89d3cc00f0a45c.sock every 8 connection(s)
I20260928 06:11:04.118952 13938 acceptor_pool.cc:254] collecting diagnostics on the listening RPC socket unix:/tmp/dist-test-task3aBzcM/test-tmp/rpc-test-6f8c840a302c49f98b89d3cc00f0a45c.sock every 8 connection(s)
W20260928 06:11:04.136497 13933 negotiation.cc:266] Injecting 500ms delay in negotiation
I20260928 06:11:04.186872 13645 rpc-test-base.h:595] status: Timed out: connection negotiation to unix:/tmp/dist-test-task3aBzcM/test-tmp/rpc-test-6f8c840a302c49f98b89d3cc00f0a45c.sock for RPC Sleep timed out after 0.050s (ON_OUTBOUND_QUEUE), seconds elapsed: 0.0509501
W20260928 06:11:04.642454 13934 connection.cc:196] Error closing socket: Network error: TlsSocket::Close: Broken pipe
[ OK ] Parameters/TestRpc.TestCallTimeoutDoesntAffectNegotiation/SSL_UnixSocket (543 ms)
[ RUN ] Parameters/TestRpc.TestRpcHandlerLatencyMetric/SSL_UnixSocket
I20260928 06:11:04.671263 13963 acceptor_pool.cc:254] collecting diagnostics on the listening RPC socket unix:/tmp/dist-test-task3aBzcM/test-tmp/rpc-test-008d4bc3e11b46e2a63174c77b8c0c4e.sock every 8 connection(s)
I20260928 06:11:04.671279 13962 acceptor_pool.cc:254] collecting diagnostics on the listening RPC socket unix:/tmp/dist-test-task3aBzcM/test-tmp/rpc-test-008d4bc3e11b46e2a63174c77b8c0c4e.sock every 8 connection(s)
I20260928 06:11:04.713943 13645 rpc-test.cc:1236] Sleep() min lat: 20539
I20260928 06:11:04.714018 13645 rpc-test.cc:1237] Sleep() mean lat: 20539
I20260928 06:11:04.714047 13645 rpc-test.cc:1238] Sleep() max lat: 20539
I20260928 06:11:04.714061 13645 rpc-test.cc:1239] Sleep() #calls: 1
W20260928 06:11:04.714998 13959 connection.cc:196] Error closing socket: Network error: TlsSocket::Close: Broken pipe
[ OK ] Parameters/TestRpc.TestRpcHandlerLatencyMetric/SSL_UnixSocket (73 ms)
[ RUN ] Parameters/TestRpc.TimedOutOnResponseMetricServiceQueue/SSL_UnixSocket
I20260928 06:11:04.738387 13988 acceptor_pool.cc:254] collecting diagnostics on the listening RPC socket unix:/tmp/dist-test-task3aBzcM/test-tmp/rpc-test-b85ddf9628ae41dea8751fabbf0f0c5b.sock every 8 connection(s)
I20260928 06:11:04.738438 13989 acceptor_pool.cc:254] collecting diagnostics on the listening RPC socket unix:/tmp/dist-test-task3aBzcM/test-tmp/rpc-test-b85ddf9628ae41dea8751fabbf0f0c5b.sock every 8 connection(s)
W20260928 06:11:04.793901 13990 rpcz_store.cc:267] Call kudu.rpc_test.CalculatorService.Sleep from unix:<unnamed> (request call id 2) took 20 ms (client timeout 20 ms). Trace:
W20260928 06:11:04.794087 13990 rpcz_store.cc:269] 0928 06:11:04.773454 (+ 0us) service_pool.cc:170] Inserting onto call queue
0928 06:11:04.793851 (+ 20397us) service_pool.cc:214] Skipping call since client already timed out
0928 06:11:04.793881 (+ 30us) inbound_call.cc:173] Queueing failure response
Metrics: {}
W20260928 06:11:04.795447 13985 connection.cc:196] Error closing socket: Network error: TlsSocket::Close: Broken pipe
[ OK ] Parameters/TestRpc.TimedOutOnResponseMetricServiceQueue/SSL_UnixSocket (79 ms)
[ RUN ] Parameters/TestRpc.RpcPendingConnectionsMetric/SSL_UnixSocket
I20260928 06:11:04.799787 14011 acceptor_pool.cc:254] collecting diagnostics on the listening RPC socket 0.0.0.0:34283 every 8 connection(s)
I20260928 06:11:04.799811 14012 acceptor_pool.cc:254] collecting diagnostics on the listening RPC socket 0.0.0.0:34283 every 8 connection(s)
W20260928 06:11:04.801082 14007 negotiation.cc:337] Failed RPC negotiation. Trace:
0928 06:11:04.800640 (+ 0us) reactor.cc:625] Submitting negotiation task for server connection from 127.0.0.1:41630 (local address 127.0.0.1:34283)
0928 06:11:04.800750 (+ 110us) server_negotiation.cc:206] Beginning negotiation
0928 06:11:04.800753 (+ 3us) server_negotiation.cc:399] Waiting for connection header
0928 06:11:04.800870 (+ 117us) negotiation.cc:327] Negotiation complete: Network error: Server connection negotiation failed: server connection from 127.0.0.1:41630: BlockingRecv error: recv got EOF from 127.0.0.1:41630 (error 108)
Metrics: {"server-negotiator.queue_time_us":41}
[ OK ] Parameters/TestRpc.RpcPendingConnectionsMetric/SSL_UnixSocket (14 ms)
[ RUN ] Parameters/TestRpc.TestRpcContextClientDeadline/SSL_UnixSocket
I20260928 06:11:04.835747 14027 acceptor_pool.cc:254] collecting diagnostics on the listening RPC socket unix:/tmp/dist-test-task3aBzcM/test-tmp/rpc-test-6847cb265bae494cbf971e1b65b0c2f1.sock every 8 connection(s)
I20260928 06:11:04.835831 14028 acceptor_pool.cc:254] collecting diagnostics on the listening RPC socket unix:/tmp/dist-test-task3aBzcM/test-tmp/rpc-test-6847cb265bae494cbf971e1b65b0c2f1.sock every 8 connection(s)
[ OK ] Parameters/TestRpc.TestRpcContextClientDeadline/SSL_UnixSocket (69 ms)
[ RUN ] Parameters/TestRpc.TestApplicationFeatureFlagUnsupportedServer/SSL_UnixSocket
I20260928 06:11:04.888150 14052 acceptor_pool.cc:254] collecting diagnostics on the listening RPC socket unix:/tmp/dist-test-task3aBzcM/test-tmp/rpc-test-2ede330e502c416e999ae91d45e01982.sock every 8 connection(s)
I20260928 06:11:04.888193 14053 acceptor_pool.cc:254] collecting diagnostics on the listening RPC socket unix:/tmp/dist-test-task3aBzcM/test-tmp/rpc-test-2ede330e502c416e999ae91d45e01982.sock every 8 connection(s)
W20260928 06:11:04.918952 14049 connection.cc:196] Error closing socket: Network error: TlsSocket::Close: Broken pipe
[ OK ] Parameters/TestRpc.TestApplicationFeatureFlagUnsupportedServer/SSL_UnixSocket (38 ms)
[ RUN ] Parameters/TestRpc.TestCancellationAsync/SSL_UnixSocket
I20260928 06:11:04.927155 14077 acceptor_pool.cc:254] collecting diagnostics on the listening RPC socket unix:/tmp/dist-test-task3aBzcM/test-tmp/rpc-test-2486b65e616a4e698b9f12f73c1766b3.sock every 8 connection(s)
I20260928 06:11:04.927173 14078 acceptor_pool.cc:254] collecting diagnostics on the listening RPC socket unix:/tmp/dist-test-task3aBzcM/test-tmp/rpc-test-2486b65e616a4e698b9f12f73c1766b3.sock every 8 connection(s)
I20260928 06:11:04.927485 13645 rpc-test.cc:1716] Connecting to unix:/tmp/dist-test-task3aBzcM/test-tmp/rpc-test-2486b65e616a4e698b9f12f73c1766b3.sock
I20260928 06:11:04.944756 13645 test_util.cc:268] Using random seed: -295724944
I20260928 06:11:04.962836 14081 rpc-test-base.h:240] got call: sleep_micros: 500 pattern: 4294967295 num_repetitions: 2097152 sidecar_idx: 0
I20260928 06:11:04.982398 14080 rpc-test-base.h:240] got call: sleep_micros: 500 pattern: 4294967295 num_repetitions: 2097152 sidecar_idx: 0
I20260928 06:11:04.998914 14081 rpc-test-base.h:240] got call: sleep_micros: 500 pattern: 4294967295 num_repetitions: 2097152 sidecar_idx: 0
I20260928 06:11:05.017138 14080 rpc-test-base.h:240] got call: sleep_micros: 500 pattern: 4294967295 num_repetitions: 2097152 sidecar_idx: 0
I20260928 06:11:05.033845 14081 rpc-test-base.h:240] got call: sleep_micros: 500 pattern: 4294967295 num_repetitions: 2097152 sidecar_idx: 0
I20260928 06:11:05.050493 14080 rpc-test-base.h:240] got call: sleep_micros: 500 pattern: 4294967295 num_repetitions: 2097152 sidecar_idx: 0
I20260928 06:11:05.066736 14081 rpc-test-base.h:240] got call: sleep_micros: 500 pattern: 4294967295 num_repetitions: 2097152 sidecar_idx: 0
W20260928 06:11:05.084527 14074 connection.cc:196] Error closing socket: Network error: TlsSocket::Close: Broken pipe
I20260928 06:11:05.085232 14080 rpc-test-base.h:240] got call: sleep_micros: 500 pattern: 4294967295 num_repetitions: 2097152 sidecar_idx: 0
W20260928 06:11:05.092072 14074 connection.cc:441] server connection from unix:<unnamed> torn down before Call kudu.rpc.GenericCalculatorService.SleepWithSidecar from unix:<unnamed> (request call id 8) could send its response
W20260928 06:11:05.103068 14074 connection.cc:441] server connection from unix:<unnamed> torn down before Call kudu.rpc.GenericCalculatorService.SleepWithSidecar from unix:<unnamed> (request call id 9) could send its response
[ OK ] Parameters/TestRpc.TestCancellationAsync/SSL_UnixSocket (183 ms)
[ RUN ] Parameters/TestRpc.TestPerformanceBySocketType/SSL_UnixSocket
I20260928 06:11:05.153813 14103 acceptor_pool.cc:254] collecting diagnostics on the listening RPC socket unix:/tmp/dist-test-task3aBzcM/test-tmp/rpc-test-c961cb3735744534bc10952228b668f9.sock every 8 connection(s)
I20260928 06:11:05.153788 14102 acceptor_pool.cc:254] collecting diagnostics on the listening RPC socket unix:/tmp/dist-test-task3aBzcM/test-tmp/rpc-test-c961cb3735744534bc10952228b668f9.sock every 8 connection(s)
I20260928 06:11:05.154084 13645 rpc-test.cc:1846] Connecting to unix:/tmp/dist-test-task3aBzcM/test-tmp/rpc-test-c961cb3735744534bc10952228b668f9.sock
I20260928 06:11:07.016795 13645 rpc-test.cc:1859] Sending 1024MB via ssl-enabled unix socket: real 1.842s user 2.211s sys 1.048s
I20260928 06:11:08.909969 13645 rpc-test.cc:1859] Sending 1024MB via ssl-enabled unix socket: real 1.893s user 2.276s sys 1.076s
I20260928 06:11:10.826575 13645 rpc-test.cc:1859] Sending 1024MB via ssl-enabled unix socket: real 1.916s user 2.303s sys 1.102s
I20260928 06:11:12.658557 13645 rpc-test.cc:1859] Sending 1024MB via ssl-enabled unix socket: real 1.832s user 2.214s sys 1.061s
I20260928 06:11:14.552165 13645 rpc-test.cc:1859] Sending 1024MB via ssl-enabled unix socket: real 1.893s user 2.311s sys 1.040s
W20260928 06:11:14.553066 14099 connection.cc:196] Error closing socket: Network error: TlsSocket::Close: Broken pipe
[ OK ] Parameters/TestRpc.TestPerformanceBySocketType/SSL_UnixSocket (9450 ms)
[----------] 20 tests from Parameters/TestRpc (34291 ms total)
[----------] 1 test from Parameters/TestRpcSocketTxRxQueue
[ RUN ] Parameters/TestRpcSocketTxRxQueue.AcceptorRxQueueSizeMetric/0
I20260928 06:11:14.562114 14127 acceptor_pool.cc:254] collecting diagnostics on the listening RPC socket 0.0.0.0:38729 every 1 connection(s)
I20260928 06:11:14.562093 14128 acceptor_pool.cc:254] collecting diagnostics on the listening RPC socket 0.0.0.0:38729 every 1 connection(s)
W20260928 06:11:14.563325 14123 negotiation.cc:337] Failed RPC negotiation. Trace:
0928 06:11:14.562913 (+ 0us) reactor.cc:625] Submitting negotiation task for server connection from 127.0.0.1:46520 (local address 127.0.0.1:38729)
0928 06:11:14.563083 (+ 170us) server_negotiation.cc:206] Beginning negotiation
0928 06:11:14.563087 (+ 4us) server_negotiation.cc:399] Waiting for connection header
0928 06:11:14.563227 (+ 140us) negotiation.cc:327] Negotiation complete: Network error: Server connection negotiation failed: server connection from 127.0.0.1:46520: BlockingRecv error: recv got EOF from 127.0.0.1:46520 (error 108)
Metrics: {"server-negotiator.queue_time_us":69}
[ OK ] Parameters/TestRpcSocketTxRxQueue.AcceptorRxQueueSizeMetric/0 (10 ms)
[----------] 1 test from Parameters/TestRpcSocketTxRxQueue (10 ms total)
[----------] Global test environment tear-down
[==========] 21 tests from 2 test suites ran. (34301 ms total)
[ PASSED ] 20 tests.
[ FAILED ] 1 test, listed below:
[ FAILED ] Parameters/TestRpc.TestCallWithChainCertAndChainCA/SSL_UnixSocket, where GetParam() = (true, true)
1 FAILED TEST