Diagnosed failure
Parameters/TestRpc.TestCallWithChainCertAndChainCA/SSL_UnixSocket: /data0/somelongdirectorytoavoidrpathissues/src/kudu/src/kudu/rpc/rpc-test.cc:270: Failure
Failed
Bad status: Runtime error: could not verify certificate chain (error with cert: subject=CN = localhost, ST = sadfjas, C = AS, emailAddress = sdflkdsajf, O = lskdfjlsad, OU = sldfkja, issuer=C = AS, ST = ASDfkjdhf, L = lskdjf, O = saldfja, OU = skdjf, CN = localhost, emailAddress = sadjflkadsj): : certificate has expired
Google Test trace:
/data0/somelongdirectorytoavoidrpathissues/src/kudu/src/kudu/rpc/rpc-test.cc:267: Connecting to unix:/tmp/dist-test-tasknXMsl3/test-tmp/rpc-test-e69f8237c81843febb089b73807b627e.sock
I20260924 07:12:48.965651 5210 test_util.cc:175] -----------------------------------------------
I20260924 07:12:48.965701 5210 test_util.cc:176] Had fatal failures, leaving test files at /tmp/dist-test-tasknXMsl3/test-tmp/rpc-test.6.Parameters_TestRpc.TestCallWithChainCertAndChainCA_SSL_UnixSocket.1790233968893303-5210-0
Full log
Note: This is test shard 7 of 8.
[==========] Running 21 tests from 2 test suites.
[----------] Global test environment set-up.
[----------] 20 tests from Parameters/TestRpc
[ RUN ] Parameters/TestRpc.TestMessengerCreateDestroy/SSL_UnixSocket
WARNING: Logging before InitGoogleLogging() is written to STDERR
I20260924 07:12:48.928998 5210 rpc-test.cc:169] started messenger TestCreateDestroy
[ OK ] Parameters/TestRpc.TestMessengerCreateDestroy/SSL_UnixSocket (34 ms)
[ RUN ] Parameters/TestRpc.TestNegotiationDeadlock/SSL_UnixSocket
I20260924 07:12:48.943784 5231 acceptor_pool.cc:254] collecting diagnostics on the listening RPC socket unix:/tmp/dist-test-tasknXMsl3/test-tmp/rpc-test-b2d4e018e89748b989b4de0040a1e7eb.sock every 8 connection(s)
I20260924 07:12:48.943784 5230 acceptor_pool.cc:254] collecting diagnostics on the listening RPC socket unix:/tmp/dist-test-tasknXMsl3/test-tmp/rpc-test-b2d4e018e89748b989b4de0040a1e7eb.sock every 8 connection(s)
[ OK ] Parameters/TestRpc.TestNegotiationDeadlock/SSL_UnixSocket (19 ms)
[ RUN ] Parameters/TestRpc.TestCallWithChainCertAndChainCA/SSL_UnixSocket
I20260924 07:12:48.961671 5246 acceptor_pool.cc:254] collecting diagnostics on the listening RPC socket unix:/tmp/dist-test-tasknXMsl3/test-tmp/rpc-test-e69f8237c81843febb089b73807b627e.sock every 8 connection(s)
I20260924 07:12:48.961714 5247 acceptor_pool.cc:254] collecting diagnostics on the listening RPC socket unix:/tmp/dist-test-tasknXMsl3/test-tmp/rpc-test-e69f8237c81843febb089b73807b627e.sock every 8 connection(s)
/data0/somelongdirectorytoavoidrpathissues/src/kudu/src/kudu/rpc/rpc-test.cc:270: Failure
Failed
Bad status: Runtime error: could not verify certificate chain (error with cert: subject=CN = localhost, ST = sadfjas, C = AS, emailAddress = sdflkdsajf, O = lskdfjlsad, OU = sldfkja, issuer=C = AS, ST = ASDfkjdhf, L = lskdjf, O = saldfja, OU = skdjf, CN = localhost, emailAddress = sadjflkadsj): : certificate has expired
Google Test trace:
/data0/somelongdirectorytoavoidrpathissues/src/kudu/src/kudu/rpc/rpc-test.cc:267: Connecting to unix:/tmp/dist-test-tasknXMsl3/test-tmp/rpc-test-e69f8237c81843febb089b73807b627e.sock
I20260924 07:12:48.965651 5210 test_util.cc:175] -----------------------------------------------
I20260924 07:12:48.965701 5210 test_util.cc:176] Had fatal failures, leaving test files at /tmp/dist-test-tasknXMsl3/test-tmp/rpc-test.6.Parameters_TestRpc.TestCallWithChainCertAndChainCA_SSL_UnixSocket.1790233968893303-5210-0
[ FAILED ] Parameters/TestRpc.TestCallWithChainCertAndChainCA/SSL_UnixSocket, where GetParam() = (true, true) (15 ms)
[ RUN ] Parameters/TestRpc.TestCallWithPasswordProtectedKey/SSL_UnixSocket
I20260924 07:12:48.979839 5271 acceptor_pool.cc:254] collecting diagnostics on the listening RPC socket unix:/tmp/dist-test-tasknXMsl3/test-tmp/rpc-test-264fc3fc84924065bbdcd473a1724b2a.sock every 8 connection(s)
I20260924 07:12:48.979856 5272 acceptor_pool.cc:254] collecting diagnostics on the listening RPC socket unix:/tmp/dist-test-tasknXMsl3/test-tmp/rpc-test-264fc3fc84924065bbdcd473a1724b2a.sock every 8 connection(s)
W20260924 07:12:48.991225 5268 connection.cc:196] Error closing socket: Network error: TlsSocket::Close: Broken pipe
[ OK ] Parameters/TestRpc.TestCallWithPasswordProtectedKey/SSL_UnixSocket (26 ms)
[ RUN ] Parameters/TestRpc.TestCallToBadServer/SSL_UnixSocket
I20260924 07:12:49.011411 5210 rpc-test.cc:394] Status: Network error: Client connection negotiation failed: client connection to 0.0.0.0:0: connect: Connection refused (error 111)
I20260924 07:12:49.011708 5210 rpc-test.cc:394] Status: Network error: Client connection negotiation failed: client connection to 0.0.0.0:0: connect: Connection refused (error 111)
I20260924 07:12:49.011942 5210 rpc-test.cc:394] Status: Network error: Client connection negotiation failed: client connection to 0.0.0.0:0: connect: Connection refused (error 111)
I20260924 07:12:49.012133 5210 rpc-test.cc:394] Status: Network error: Client connection negotiation failed: client connection to 0.0.0.0:0: connect: Connection refused (error 111)
I20260924 07:12:49.012310 5210 rpc-test.cc:394] Status: Network error: Client connection negotiation failed: client connection to 0.0.0.0:0: connect: Connection refused (error 111)
[ OK ] Parameters/TestRpc.TestCallToBadServer/SSL_UnixSocket (20 ms)
[ RUN ] Parameters/TestRpc.TestWrongService/SSL_UnixSocket
I20260924 07:12:49.045327 5306 acceptor_pool.cc:254] collecting diagnostics on the listening RPC socket unix:/tmp/dist-test-tasknXMsl3/test-tmp/rpc-test-f35ccef92d2548ef936bbc5df4fcc2a7.sock every 8 connection(s)
I20260924 07:12:49.045351 5307 acceptor_pool.cc:254] collecting diagnostics on the listening RPC socket unix:/tmp/dist-test-tasknXMsl3/test-tmp/rpc-test-f35ccef92d2548ef936bbc5df4fcc2a7.sock every 8 connection(s)
I20260924 07:12:49.070762 5303 messenger.cc:345] service WrongServiceName not registered on TestServer
[ OK ] Parameters/TestRpc.TestWrongService/SSL_UnixSocket (59 ms)
[ RUN ] Parameters/TestRpc.TestConnectionKeepalive/SSL_UnixSocket
I20260924 07:12:49.107877 5330 acceptor_pool.cc:254] collecting diagnostics on the listening RPC socket unix:/tmp/dist-test-tasknXMsl3/test-tmp/rpc-test-be38ad8f575247a284fe4a270d6c4930.sock every 8 connection(s)
I20260924 07:12:49.108042 5210 rpc-test.cc:488] Connecting to unix:/tmp/dist-test-tasknXMsl3/test-tmp/rpc-test-be38ad8f575247a284fe4a270d6c4930.sock
I20260924 07:12:49.107877 5329 acceptor_pool.cc:254] collecting diagnostics on the listening RPC socket unix:/tmp/dist-test-tasknXMsl3/test-tmp/rpc-test-be38ad8f575247a284fe4a270d6c4930.sock every 8 connection(s)
W20260924 07:12:49.574626 5342 connection.cc:196] Error closing socket: Network error: TlsSocket::Close: Broken pipe
[ OK ] Parameters/TestRpc.TestConnectionKeepalive/SSL_UnixSocket (1055 ms)
[ RUN ] Parameters/TestRpc.TestClientConnectionMetrics/SSL_UnixSocket
I20260924 07:12:50.141793 5354 acceptor_pool.cc:254] collecting diagnostics on the listening RPC socket unix:/tmp/dist-test-tasknXMsl3/test-tmp/rpc-test-2d40f73965ec41e4a0e2779c0e1d4e7e.sock every 8 connection(s)
I20260924 07:12:50.141901 5355 acceptor_pool.cc:254] collecting diagnostics on the listening RPC socket unix:/tmp/dist-test-tasknXMsl3/test-tmp/rpc-test-2d40f73965ec41e4a0e2779c0e1d4e7e.sock every 8 connection(s)
I20260924 07:12:50.142025 5210 rpc-test.cc:569] Connecting to unix:/tmp/dist-test-tasknXMsl3/test-tmp/rpc-test-2d40f73965ec41e4a0e2779c0e1d4e7e.sock
W20260924 07:12:58.399456 5351 connection.cc:196] Error closing socket: Network error: TlsSocket::Close: Broken pipe
[ OK ] Parameters/TestRpc.TestClientConnectionMetrics/SSL_UnixSocket (8272 ms)
[ RUN ] Parameters/TestRpc.TestCredentialsPolicy/SSL_UnixSocket
I20260924 07:12:58.408958 5377 acceptor_pool.cc:254] collecting diagnostics on the listening RPC socket unix:/tmp/dist-test-tasknXMsl3/test-tmp/rpc-test-bfa34f0e30d1422295b3ce21c0220c9b.sock every 8 connection(s)
I20260924 07:12:58.409039 5378 acceptor_pool.cc:254] collecting diagnostics on the listening RPC socket unix:/tmp/dist-test-tasknXMsl3/test-tmp/rpc-test-bfa34f0e30d1422295b3ce21c0220c9b.sock every 8 connection(s)
I20260924 07:12:58.409188 5210 rpc-test.cc:700] Connecting to unix:/tmp/dist-test-tasknXMsl3/test-tmp/rpc-test-bfa34f0e30d1422295b3ce21c0220c9b.sock
W20260924 07:12:58.432816 5376 connection.cc:196] Error closing socket: Network error: TlsSocket::Close: Broken pipe
[ OK ] Parameters/TestRpc.TestCredentialsPolicy/SSL_UnixSocket (36 ms)
[ RUN ] Parameters/TestRpc.TestCallLongerThanKeepalive/SSL_UnixSocket
I20260924 07:12:58.442412 5402 acceptor_pool.cc:254] collecting diagnostics on the listening RPC socket unix:/tmp/dist-test-tasknXMsl3/test-tmp/rpc-test-762d66b53b66492f8eb865556b8debe5.sock every 8 connection(s)
I20260924 07:12:58.442497 5403 acceptor_pool.cc:254] collecting diagnostics on the listening RPC socket unix:/tmp/dist-test-tasknXMsl3/test-tmp/rpc-test-762d66b53b66492f8eb865556b8debe5.sock every 8 connection(s)
I20260924 07:12:58.453826 5406 rpc-test-base.h:222] got call: sleep_micros: 3000000 deferred: true
I20260924 07:13:01.454476 5406 rpcz_store.cc:275] Call kudu.rpc.GenericCalculatorService.Sleep from unix:<unnamed> (request call id 0) took 3000 ms. Trace:
I20260924 07:13:01.454603 5406 rpcz_store.cc:276] 0924 07:12:58.453792 (+ 0us) service_pool.cc:170] Inserting onto call queue
0924 07:12:58.453812 (+ 20us) service_pool.cc:227] Handling call
0924 07:13:01.454461 (+3000649us) inbound_call.cc:173] Queueing success response
Metrics: {}
[ OK ] Parameters/TestRpc.TestCallLongerThanKeepalive/SSL_UnixSocket (3019 ms)
[ RUN ] Parameters/TestRpc.TestRpcSidecar/SSL_UnixSocket
I20260924 07:13:01.466070 5427 acceptor_pool.cc:254] collecting diagnostics on the listening RPC socket unix:/tmp/dist-test-tasknXMsl3/test-tmp/rpc-test-70ad670fc6484533aca60cba10ecd6f6.sock every 8 connection(s)
I20260924 07:13:01.466156 5428 acceptor_pool.cc:254] collecting diagnostics on the listening RPC socket unix:/tmp/dist-test-tasknXMsl3/test-tmp/rpc-test-70ad670fc6484533aca60cba10ecd6f6.sock every 8 connection(s)
W20260924 07:13:01.503250 5424 connection.cc:196] Error closing socket: Network error: TlsSocket::Close: Broken pipe
[ OK ] Parameters/TestRpc.TestRpcSidecar/SSL_UnixSocket (47 ms)
[ RUN ] Parameters/TestRpc.TestRpcSidecarLimits/SSL_UnixSocket
I20260924 07:13:03.207278 5453 acceptor_pool.cc:254] collecting diagnostics on the listening RPC socket unix:/tmp/dist-test-tasknXMsl3/test-tmp/rpc-test-9b9f4190bfa04136b4e7ec652e774aae.sock every 8 connection(s)
I20260924 07:13:03.207239 5452 acceptor_pool.cc:254] collecting diagnostics on the listening RPC socket unix:/tmp/dist-test-tasknXMsl3/test-tmp/rpc-test-9b9f4190bfa04136b4e7ec652e774aae.sock every 8 connection(s)
W20260924 07:13:03.212977 5210 serialization.cc:72] Serialized kudu.rpc_test.PushStringsRequestPB (2147483654 bytes) is larger than the maximum configured RPC message size (52428800 bytes). Sending anyway, but peer may reject the data.
W20260924 07:13:03.215736 5449 connection.cc:535] server connection from unix:<unnamed> recv error: Network error: RPC frame had a length of 2147483714, but we only support messages up to 52428800 bytes long.
W20260924 07:13:03.215788 5449 connection.cc:158] shutting down server connection from unix:<unnamed> with pending inbound data: 4/2147483714 bytes received; last active 0 ns ago: status Network error: RPC frame had a length of 2147483714, but we only support messages up to 52428800 bytes long.
W20260924 07:13:03.215945 5465 connection.cc:196] Error closing socket: Network error: TlsSocket::Close: Broken pipe
I20260924 07:13:03.225997 5477 acceptor_pool.cc:254] collecting diagnostics on the listening RPC socket unix:/tmp/dist-test-tasknXMsl3/test-tmp/rpc-test-9b9f4190bfa04136b4e7ec652e774aae.sock every 8 connection(s)
I20260924 07:13:03.226073 5478 acceptor_pool.cc:254] collecting diagnostics on the listening RPC socket unix:/tmp/dist-test-tasknXMsl3/test-tmp/rpc-test-9b9f4190bfa04136b4e7ec652e774aae.sock every 8 connection(s)
W20260924 07:13:07.590402 5474 connection.cc:577] server connection from unix:<unnamed>: received bad data: 'Corruption: Invalid packet: message had a length of 2147483710, but we only support messages up to 2147483647 bytes
'
W20260924 07:13:07.590739 5490 connection.cc:196] Error closing socket: Network error: TlsSocket::Close: Broken pipe
[ OK ] Parameters/TestRpc.TestRpcSidecarLimits/SSL_UnixSocket (6087 ms)
[ RUN ] Parameters/TestRpc.TestCallTimeoutDoesntAffectNegotiation/SSL_UnixSocket
I20260924 07:13:07.623868 5502 acceptor_pool.cc:254] collecting diagnostics on the listening RPC socket unix:/tmp/dist-test-tasknXMsl3/test-tmp/rpc-test-71c2563eae5b4553a86b96267a492e63.sock every 8 connection(s)
I20260924 07:13:07.623896 5503 acceptor_pool.cc:254] collecting diagnostics on the listening RPC socket unix:/tmp/dist-test-tasknXMsl3/test-tmp/rpc-test-71c2563eae5b4553a86b96267a492e63.sock every 8 connection(s)
W20260924 07:13:07.634743 5498 negotiation.cc:266] Injecting 500ms delay in negotiation
I20260924 07:13:07.685101 5210 rpc-test-base.h:595] status: Timed out: connection negotiation to unix:/tmp/dist-test-tasknXMsl3/test-tmp/rpc-test-71c2563eae5b4553a86b96267a492e63.sock for RPC Sleep timed out after 0.050s (ON_OUTBOUND_QUEUE), seconds elapsed: 0.0506749
W20260924 07:13:08.138717 5499 connection.cc:196] Error closing socket: Network error: TlsSocket::Close: Broken pipe
[ OK ] Parameters/TestRpc.TestCallTimeoutDoesntAffectNegotiation/SSL_UnixSocket (546 ms)
[ RUN ] Parameters/TestRpc.TestRpcHandlerLatencyMetric/SSL_UnixSocket
I20260924 07:13:08.159509 5527 acceptor_pool.cc:254] collecting diagnostics on the listening RPC socket unix:/tmp/dist-test-tasknXMsl3/test-tmp/rpc-test-0ec1e755c5ca4cc687f6786b1a3b9848.sock every 8 connection(s)
I20260924 07:13:08.159528 5528 acceptor_pool.cc:254] collecting diagnostics on the listening RPC socket unix:/tmp/dist-test-tasknXMsl3/test-tmp/rpc-test-0ec1e755c5ca4cc687f6786b1a3b9848.sock every 8 connection(s)
I20260924 07:13:08.194552 5210 rpc-test.cc:1236] Sleep() min lat: 20235
I20260924 07:13:08.194608 5210 rpc-test.cc:1237] Sleep() mean lat: 20235
I20260924 07:13:08.194631 5210 rpc-test.cc:1238] Sleep() max lat: 20235
I20260924 07:13:08.194644 5210 rpc-test.cc:1239] Sleep() #calls: 1
W20260924 07:13:08.195266 5524 connection.cc:196] Error closing socket: Network error: TlsSocket::Close: Broken pipe
[ OK ] Parameters/TestRpc.TestRpcHandlerLatencyMetric/SSL_UnixSocket (56 ms)
[ RUN ] Parameters/TestRpc.TimedOutOnResponseMetricServiceQueue/SSL_UnixSocket
I20260924 07:13:08.202335 5553 acceptor_pool.cc:254] collecting diagnostics on the listening RPC socket unix:/tmp/dist-test-tasknXMsl3/test-tmp/rpc-test-ce87874adc654945b0911c832eaad870.sock every 8 connection(s)
I20260924 07:13:08.202375 5554 acceptor_pool.cc:254] collecting diagnostics on the listening RPC socket unix:/tmp/dist-test-tasknXMsl3/test-tmp/rpc-test-ce87874adc654945b0911c832eaad870.sock every 8 connection(s)
W20260924 07:13:08.262010 5555 rpcz_store.cc:267] Call kudu.rpc_test.CalculatorService.Sleep from unix:<unnamed> (request call id 2) took 20 ms (client timeout 20 ms). Trace:
W20260924 07:13:08.262122 5555 rpcz_store.cc:269] 0924 07:13:08.241800 (+ 0us) service_pool.cc:170] Inserting onto call queue
0924 07:13:08.261990 (+ 20190us) service_pool.cc:214] Skipping call since client already timed out
0924 07:13:08.261998 (+ 8us) inbound_call.cc:173] Queueing failure response
Metrics: {}
[ OK ] Parameters/TestRpc.TimedOutOnResponseMetricServiceQueue/SSL_UnixSocket (67 ms)
[ RUN ] Parameters/TestRpc.RpcPendingConnectionsMetric/SSL_UnixSocket
I20260924 07:13:08.265277 5576 acceptor_pool.cc:254] collecting diagnostics on the listening RPC socket 0.0.0.0:43109 every 8 connection(s)
I20260924 07:13:08.265359 5577 acceptor_pool.cc:254] collecting diagnostics on the listening RPC socket 0.0.0.0:43109 every 8 connection(s)
W20260924 07:13:08.265882 5572 negotiation.cc:337] Failed RPC negotiation. Trace:
0924 07:13:08.265734 (+ 0us) reactor.cc:625] Submitting negotiation task for server connection from 127.0.0.1:51020 (local address 127.0.0.1:43109)
0924 07:13:08.265783 (+ 49us) server_negotiation.cc:206] Beginning negotiation
0924 07:13:08.265785 (+ 2us) server_negotiation.cc:399] Waiting for connection header
0924 07:13:08.265841 (+ 56us) negotiation.cc:327] Negotiation complete: Network error: Server connection negotiation failed: server connection from 127.0.0.1:51020: BlockingRecv error: recv got EOF from 127.0.0.1:51020 (error 108)
Metrics: {"server-negotiator.queue_time_us":15}
[ OK ] Parameters/TestRpc.RpcPendingConnectionsMetric/SSL_UnixSocket (13 ms)
[ RUN ] Parameters/TestRpc.TestRpcContextClientDeadline/SSL_UnixSocket
I20260924 07:13:08.288587 5592 acceptor_pool.cc:254] collecting diagnostics on the listening RPC socket unix:/tmp/dist-test-tasknXMsl3/test-tmp/rpc-test-ebec616eb4ce4bd98be3d7077a963a63.sock every 8 connection(s)
I20260924 07:13:08.288626 5593 acceptor_pool.cc:254] collecting diagnostics on the listening RPC socket unix:/tmp/dist-test-tasknXMsl3/test-tmp/rpc-test-ebec616eb4ce4bd98be3d7077a963a63.sock every 8 connection(s)
[ OK ] Parameters/TestRpc.TestRpcContextClientDeadline/SSL_UnixSocket (41 ms)
[ RUN ] Parameters/TestRpc.TestApplicationFeatureFlagUnsupportedServer/SSL_UnixSocket
I20260924 07:13:08.326243 5617 acceptor_pool.cc:254] collecting diagnostics on the listening RPC socket unix:/tmp/dist-test-tasknXMsl3/test-tmp/rpc-test-f3cf9b013ebd4380bd59e349c99d0148.sock every 8 connection(s)
I20260924 07:13:08.326293 5618 acceptor_pool.cc:254] collecting diagnostics on the listening RPC socket unix:/tmp/dist-test-tasknXMsl3/test-tmp/rpc-test-f3cf9b013ebd4380bd59e349c99d0148.sock every 8 connection(s)
[ OK ] Parameters/TestRpc.TestApplicationFeatureFlagUnsupportedServer/SSL_UnixSocket (20 ms)
[ RUN ] Parameters/TestRpc.TestCancellationAsync/SSL_UnixSocket
I20260924 07:13:08.370188 5642 acceptor_pool.cc:254] collecting diagnostics on the listening RPC socket unix:/tmp/dist-test-tasknXMsl3/test-tmp/rpc-test-e5d7f027c9464f03b11ca3ad67eea4e8.sock every 8 connection(s)
I20260924 07:13:08.370213 5643 acceptor_pool.cc:254] collecting diagnostics on the listening RPC socket unix:/tmp/dist-test-tasknXMsl3/test-tmp/rpc-test-e5d7f027c9464f03b11ca3ad67eea4e8.sock every 8 connection(s)
I20260924 07:13:08.370395 5210 rpc-test.cc:1716] Connecting to unix:/tmp/dist-test-tasknXMsl3/test-tmp/rpc-test-e5d7f027c9464f03b11ca3ad67eea4e8.sock
I20260924 07:13:08.376981 5210 test_util.cc:268] Using random seed: 1425090964
I20260924 07:13:08.393245 5646 rpc-test-base.h:240] got call: sleep_micros: 500 pattern: 4294967295 num_repetitions: 2097152 sidecar_idx: 0
I20260924 07:13:08.403795 5646 rpc-test-base.h:240] got call: sleep_micros: 500 pattern: 4294967295 num_repetitions: 2097152 sidecar_idx: 0
I20260924 07:13:08.413870 5646 rpc-test-base.h:240] got call: sleep_micros: 500 pattern: 4294967295 num_repetitions: 2097152 sidecar_idx: 0
I20260924 07:13:08.423899 5646 rpc-test-base.h:240] got call: sleep_micros: 500 pattern: 4294967295 num_repetitions: 2097152 sidecar_idx: 0
I20260924 07:13:08.435218 5646 rpc-test-base.h:240] got call: sleep_micros: 500 pattern: 4294967295 num_repetitions: 2097152 sidecar_idx: 0
I20260924 07:13:08.445463 5646 rpc-test-base.h:240] got call: sleep_micros: 500 pattern: 4294967295 num_repetitions: 2097152 sidecar_idx: 0
I20260924 07:13:08.455380 5646 rpc-test-base.h:240] got call: sleep_micros: 500 pattern: 4294967295 num_repetitions: 2097152 sidecar_idx: 0
W20260924 07:13:08.456529 5639 connection.cc:196] Error closing socket: Network error: TlsSocket::Close: Broken pipe
W20260924 07:13:08.458272 5639 connection.cc:441] server connection from unix:<unnamed> torn down before Call kudu.rpc.GenericCalculatorService.SleepWithSidecar from unix:<unnamed> (request call id 9) could send its response
[ OK ] Parameters/TestRpc.TestCancellationAsync/SSL_UnixSocket (120 ms)
[ RUN ] Parameters/TestRpc.TestPerformanceBySocketType/SSL_UnixSocket
I20260924 07:13:08.496255 5667 acceptor_pool.cc:254] collecting diagnostics on the listening RPC socket unix:/tmp/dist-test-tasknXMsl3/test-tmp/rpc-test-e119057446d1443aabbfe00a6075f47a.sock every 8 connection(s)
I20260924 07:13:08.496304 5668 acceptor_pool.cc:254] collecting diagnostics on the listening RPC socket unix:/tmp/dist-test-tasknXMsl3/test-tmp/rpc-test-e119057446d1443aabbfe00a6075f47a.sock every 8 connection(s)
I20260924 07:13:08.496451 5210 rpc-test.cc:1846] Connecting to unix:/tmp/dist-test-tasknXMsl3/test-tmp/rpc-test-e119057446d1443aabbfe00a6075f47a.sock
I20260924 07:13:09.739905 5210 rpc-test.cc:1859] Sending 1024MB via ssl-enabled unix socket: real 1.236s user 1.429s sys 0.814s
I20260924 07:13:11.007882 5210 rpc-test.cc:1859] Sending 1024MB via ssl-enabled unix socket: real 1.268s user 1.465s sys 0.832s
I20260924 07:13:12.180051 5210 rpc-test.cc:1859] Sending 1024MB via ssl-enabled unix socket: real 1.172s user 1.203s sys 0.925s
I20260924 07:13:13.381081 5210 rpc-test.cc:1859] Sending 1024MB via ssl-enabled unix socket: real 1.201s user 1.260s sys 0.911s
I20260924 07:13:14.628185 5210 rpc-test.cc:1859] Sending 1024MB via ssl-enabled unix socket: real 1.247s user 1.288s sys 0.971s
W20260924 07:13:14.628827 5664 connection.cc:196] Error closing socket: Network error: TlsSocket::Close: Broken pipe
[ OK ] Parameters/TestRpc.TestPerformanceBySocketType/SSL_UnixSocket (6170 ms)
[----------] 20 tests from Parameters/TestRpc (25734 ms total)
[----------] 1 test from Parameters/TestRpcSocketTxRxQueue
[ RUN ] Parameters/TestRpcSocketTxRxQueue.AcceptorRxQueueSizeMetric/0
I20260924 07:13:14.635905 5692 acceptor_pool.cc:254] collecting diagnostics on the listening RPC socket 0.0.0.0:33141 every 1 connection(s)
I20260924 07:13:14.635999 5693 acceptor_pool.cc:254] collecting diagnostics on the listening RPC socket 0.0.0.0:33141 every 1 connection(s)
W20260924 07:13:14.636466 5688 negotiation.cc:337] Failed RPC negotiation. Trace:
0924 07:13:14.636334 (+ 0us) reactor.cc:625] Submitting negotiation task for server connection from 127.0.0.1:33060 (local address 127.0.0.1:33141)
0924 07:13:14.636382 (+ 48us) server_negotiation.cc:206] Beginning negotiation
0924 07:13:14.636384 (+ 2us) server_negotiation.cc:399] Waiting for connection header
0924 07:13:14.636436 (+ 52us) negotiation.cc:327] Negotiation complete: Network error: Server connection negotiation failed: server connection from 127.0.0.1:33060: BlockingRecv error: recv got EOF from 127.0.0.1:33060 (error 108)
Metrics: {"server-negotiator.queue_time_us":16}
[ OK ] Parameters/TestRpcSocketTxRxQueue.AcceptorRxQueueSizeMetric/0 (8 ms)
[----------] 1 test from Parameters/TestRpcSocketTxRxQueue (8 ms total)
[----------] Global test environment tear-down
[==========] 21 tests from 2 test suites ran. (25742 ms total)
[ PASSED ] 20 tests.
[ FAILED ] 1 test, listed below:
[ FAILED ] Parameters/TestRpc.TestCallWithChainCertAndChainCA/SSL_UnixSocket, where GetParam() = (true, true)
1 FAILED TEST