Parameters/TestRpc.TestCallWithChainCertAndRootCA/SSL_TCP: /data0/somelongdirectorytoavoidrpathissues/src/kudu/src/kudu/rpc/rpc-test.cc:303: Failure
Failed
Bad status: Runtime error: could not verify certificate chain (error with cert: subject=CN = localhost, ST = sadfjas, C = AS, emailAddress = sdflkdsajf, O = lskdfjlsad, OU = sldfkja, issuer=C = AS, ST = ASDfkjdhf, L = lskdjf, O = saldfja, OU = skdjf, CN = localhost, emailAddress = sadjflkadsj): : certificate has expired
Google Test trace:
/data0/somelongdirectorytoavoidrpathissues/src/kudu/src/kudu/rpc/rpc-test.cc:300: Connecting to 0.0.0.0:46005
I20260926 16:14:16.775966 2613 test_util.cc:175] -----------------------------------------------
I20260926 16:14:16.776165 2613 test_util.cc:176] Had fatal failures, leaving test files at /tmp/dist-test-taskOkcBVE/test-tmp/rpc-test.1.Parameters_TestRpc.TestCallWithChainCertAndRootCA_SSL_TCP.1790439255203198-2613-0
Note: This is test shard 2 of 8.
[==========] Running 21 tests from 2 test suites.
[----------] Global test environment set-up.
[----------] 1 test from TestRpc
[ RUN ] TestRpc.TestMethodsByName
[ OK ] TestRpc.TestMethodsByName (6 ms)
[----------] 1 test from TestRpc (6 ms total)
[----------] 20 tests from Parameters/TestRpc
[ RUN ] Parameters/TestRpc.TestAcceptorPoolStartStop/SSL_TCP
WARNING: Logging before InitGoogleLogging() is written to STDERR
I20260926 16:14:15.328281 2628 acceptor_pool.cc:254] collecting diagnostics on the listening RPC socket 0.0.0.0:42349 every 8 connection(s)
I20260926 16:14:15.330264 2629 acceptor_pool.cc:254] collecting diagnostics on the listening RPC socket 0.0.0.0:42349 every 8 connection(s)
W20260926 16:14:16.330919 2613 thread.cc:536] Waited for 1000ms trying to join with acceptor (tid 2629)
I20260926 16:14:16.518287 2640 acceptor_pool.cc:254] collecting diagnostics on the listening RPC socket 0.0.0.0:46083 every 8 connection(s)
I20260926 16:14:16.519950 2641 acceptor_pool.cc:254] collecting diagnostics on the listening RPC socket 0.0.0.0:46083 every 8 connection(s)
I20260926 16:14:16.545562 2651 acceptor_pool.cc:254] collecting diagnostics on the listening RPC socket 0.0.0.0:38493 every 8 connection(s)
I20260926 16:14:16.547068 2652 acceptor_pool.cc:254] collecting diagnostics on the listening RPC socket 0.0.0.0:38493 every 8 connection(s)
I20260926 16:14:16.572798 2662 acceptor_pool.cc:254] collecting diagnostics on the listening RPC socket 0.0.0.0:46355 every 8 connection(s)
I20260926 16:14:16.573490 2663 acceptor_pool.cc:254] collecting diagnostics on the listening RPC socket 0.0.0.0:46355 every 8 connection(s)
I20260926 16:14:16.588173 2673 acceptor_pool.cc:254] collecting diagnostics on the listening RPC socket 0.0.0.0:34899 every 8 connection(s)
I20260926 16:14:16.588927 2674 acceptor_pool.cc:254] collecting diagnostics on the listening RPC socket 0.0.0.0:34899 every 8 connection(s)
[ OK ] Parameters/TestRpc.TestAcceptorPoolStartStop/SSL_TCP (1331 ms)
[ RUN ] Parameters/TestRpc.TestCall/SSL_TCP
I20260926 16:14:16.622021 2686 acceptor_pool.cc:254] collecting diagnostics on the listening RPC socket 0.0.0.0:34681 every 8 connection(s)
I20260926 16:14:16.624215 2687 acceptor_pool.cc:254] collecting diagnostics on the listening RPC socket 0.0.0.0:34681 every 8 connection(s)
I20260926 16:14:16.629117 2613 rpc-test.cc:234] Connecting to 0.0.0.0:34681
[ OK ] Parameters/TestRpc.TestCall/SSL_TCP (136 ms)
[ RUN ] Parameters/TestRpc.TestCallWithChainCertAndRootCA/SSL_TCP
I20260926 16:14:16.753158 2711 acceptor_pool.cc:254] collecting diagnostics on the listening RPC socket 0.0.0.0:46005 every 8 connection(s)
I20260926 16:14:16.753995 2712 acceptor_pool.cc:254] collecting diagnostics on the listening RPC socket 0.0.0.0:46005 every 8 connection(s)
/data0/somelongdirectorytoavoidrpathissues/src/kudu/src/kudu/rpc/rpc-test.cc:303: Failure
Failed
Bad status: Runtime error: could not verify certificate chain (error with cert: subject=CN = localhost, ST = sadfjas, C = AS, emailAddress = sdflkdsajf, O = lskdfjlsad, OU = sldfkja, issuer=C = AS, ST = ASDfkjdhf, L = lskdjf, O = saldfja, OU = skdjf, CN = localhost, emailAddress = sadjflkadsj): : certificate has expired
Google Test trace:
/data0/somelongdirectorytoavoidrpathissues/src/kudu/src/kudu/rpc/rpc-test.cc:300: Connecting to 0.0.0.0:46005
I20260926 16:14:16.775966 2613 test_util.cc:175] -----------------------------------------------
I20260926 16:14:16.776165 2613 test_util.cc:176] Had fatal failures, leaving test files at /tmp/dist-test-taskOkcBVE/test-tmp/rpc-test.1.Parameters_TestRpc.TestCallWithChainCertAndRootCA_SSL_TCP.1790439255203198-2613-0
[ FAILED ] Parameters/TestRpc.TestCallWithChainCertAndRootCA/SSL_TCP, where GetParam() = (true, false) (46 ms)
[ RUN ] Parameters/TestRpc.TestCallWithBadPasswordProtectedKey/SSL_TCP
[ OK ] Parameters/TestRpc.TestCallWithBadPasswordProtectedKey/SSL_TCP (33 ms)
[ RUN ] Parameters/TestRpc.TestInvalidMethodCall/SSL_TCP
I20260926 16:14:16.833792 2748 acceptor_pool.cc:254] collecting diagnostics on the listening RPC socket 0.0.0.0:41001 every 8 connection(s)
I20260926 16:14:16.834782 2749 acceptor_pool.cc:254] collecting diagnostics on the listening RPC socket 0.0.0.0:41001 every 8 connection(s)
I20260926 16:14:16.838490 2613 rpc-test.cc:406] Connecting to 0.0.0.0:41001
[ OK ] Parameters/TestRpc.TestInvalidMethodCall/SSL_TCP (82 ms)
[ RUN ] Parameters/TestRpc.TestHighFDs/SSL_TCP
I20260926 16:14:17.109747 2773 acceptor_pool.cc:254] collecting diagnostics on the listening RPC socket 0.0.0.0:37609 every 8 connection(s)
I20260926 16:14:17.110488 2774 acceptor_pool.cc:254] collecting diagnostics on the listening RPC socket 0.0.0.0:37609 every 8 connection(s)
[ OK ] Parameters/TestRpc.TestHighFDs/SSL_TCP (266 ms)
[ RUN ] Parameters/TestRpc.TestConnectionAlwaysKeepalive/SSL_TCP
I20260926 16:14:17.183411 2796 acceptor_pool.cc:254] collecting diagnostics on the listening RPC socket 0.0.0.0:45619 every 8 connection(s)
I20260926 16:14:17.184139 2797 acceptor_pool.cc:254] collecting diagnostics on the listening RPC socket 0.0.0.0:45619 every 8 connection(s)
I20260926 16:14:17.187243 2613 rpc-test.cc:532] Connecting to 0.0.0.0:45619
[ OK ] Parameters/TestRpc.TestConnectionAlwaysKeepalive/SSL_TCP (3071 ms)
[ RUN ] Parameters/TestRpc.TestReopenOutboundConnections/SSL_TCP
I20260926 16:14:20.252058 2819 acceptor_pool.cc:254] collecting diagnostics on the listening RPC socket 0.0.0.0:37795 every 8 connection(s)
I20260926 16:14:20.252847 2820 acceptor_pool.cc:254] collecting diagnostics on the listening RPC socket 0.0.0.0:37795 every 8 connection(s)
I20260926 16:14:20.255941 2613 rpc-test.cc:658] Connecting to 0.0.0.0:37795
[ OK ] Parameters/TestRpc.TestReopenOutboundConnections/SSL_TCP (368 ms)
[ RUN ] Parameters/TestRpc.TestConnectionNetworkPlane/SSL_TCP
I20260926 16:14:20.622774 2842 acceptor_pool.cc:254] collecting diagnostics on the listening RPC socket 0.0.0.0:34783 every 8 connection(s)
I20260926 16:14:20.623515 2843 acceptor_pool.cc:254] collecting diagnostics on the listening RPC socket 0.0.0.0:34783 every 8 connection(s)
I20260926 16:14:20.626610 2613 rpc-test.cc:772] Connecting to 0.0.0.0:34783
[ OK ] Parameters/TestRpc.TestConnectionNetworkPlane/SSL_TCP (77 ms)
[ RUN ] Parameters/TestRpc.TestTCPKeepalive/SSL_TCP
I20260926 16:14:20.699514 2867 acceptor_pool.cc:254] collecting diagnostics on the listening RPC socket 0.0.0.0:33235 every 8 connection(s)
I20260926 16:14:20.700258 2868 acceptor_pool.cc:254] collecting diagnostics on the listening RPC socket 0.0.0.0:33235 every 8 connection(s)
I20260926 16:14:20.732102 2871 rpc-test-base.h:222] got call: sleep_micros: 8000000 deferred: true
I20260926 16:14:28.736253 2871 rpcz_store.cc:275] Call kudu.rpc.GenericCalculatorService.Sleep from 127.0.0.1:43486 (request call id 0) took 8004 ms. Trace:
I20260926 16:14:28.736685 2871 rpcz_store.cc:276] 0926 16:14:20.731845 (+ 0us) service_pool.cc:170] Inserting onto call queue
0926 16:14:20.731949 (+ 104us) service_pool.cc:227] Handling call
0926 16:14:28.735971 (+8004022us) inbound_call.cc:173] Queueing success response
Metrics: {}
[ OK ] Parameters/TestRpc.TestTCPKeepalive/SSL_TCP (8074 ms)
[ RUN ] Parameters/TestRpc.TestMaxSmallSidecars/SSL_TCP
I20260926 16:14:28.780459 2893 acceptor_pool.cc:254] collecting diagnostics on the listening RPC socket 0.0.0.0:40121 every 8 connection(s)
I20260926 16:14:28.781250 2894 acceptor_pool.cc:254] collecting diagnostics on the listening RPC socket 0.0.0.0:40121 every 8 connection(s)
[ OK ] Parameters/TestRpc.TestMaxSmallSidecars/SSL_TCP (197 ms)
[ RUN ] Parameters/TestRpc.TestCallTimeout/SSL_TCP
I20260926 16:14:28.977535 2918 acceptor_pool.cc:254] collecting diagnostics on the listening RPC socket 0.0.0.0:40261 every 8 connection(s)
I20260926 16:14:28.978250 2919 acceptor_pool.cc:254] collecting diagnostics on the listening RPC socket 0.0.0.0:40261 every 8 connection(s)
I20260926 16:14:28.995882 2613 rpc-test-base.h:595] status: Timed out: connection negotiation to 0.0.0.0:40261 for RPC Sleep timed out after 0.000s (ON_OUTBOUND_QUEUE), seconds elapsed: 0.00300945
I20260926 16:14:29.003075 2922 rpc-test-base.h:222] got call: sleep_micros: 700000
I20260926 16:14:29.197912 2613 rpc-test-base.h:595] status: Timed out: Sleep RPC to 0.0.0.0:40261 timed out after 0.200s (SENT), seconds elapsed: 0.201496
I20260926 16:14:29.199541 2921 rpc-test-base.h:222] got call: sleep_micros: 2000000
W20260926 16:14:29.703737 2922 rpcz_store.cc:267] Call kudu.rpc.GenericCalculatorService.Sleep from 127.0.0.1:53914 (request call id 1) took 700 ms (client timeout 200 ms). Trace:
W20260926 16:14:29.704056 2922 rpcz_store.cc:269] 0926 16:14:29.002910 (+ 0us) service_pool.cc:170] Inserting onto call queue
0926 16:14:29.003011 (+ 101us) service_pool.cc:227] Handling call
0926 16:14:29.703660 (+700649us) inbound_call.cc:173] Queueing success response
Metrics: {}
I20260926 16:14:30.700299 2613 rpc-test-base.h:595] status: Timed out: Sleep RPC to 0.0.0.0:40261 timed out after 1.500s (SENT), seconds elapsed: 1.50201
W20260926 16:14:31.200063 2921 rpcz_store.cc:267] Call kudu.rpc.GenericCalculatorService.Sleep from 127.0.0.1:53914 (request call id 2) took 2000 ms (client timeout 1500 ms). Trace:
W20260926 16:14:31.200513 2921 rpcz_store.cc:269] 0926 16:14:29.199231 (+ 0us) service_pool.cc:170] Inserting onto call queue
0926 16:14:29.199377 (+ 146us) service_pool.cc:227] Handling call
0926 16:14:31.200005 (+2000628us) inbound_call.cc:173] Queueing success response
Metrics: {}
W20260926 16:14:31.201108 2917 connection.cc:441] server connection from 127.0.0.1:53914 torn down before Call kudu.rpc.GenericCalculatorService.Sleep from 127.0.0.1:53914 (request call id 2) could send its response
[ OK ] Parameters/TestRpc.TestCallTimeout/SSL_TCP (2258 ms)
[ RUN ] Parameters/TestRpc.TestServerShutsDown/SSL_TCP
I20260926 16:14:31.209209 2613 rpc-test.cc:1125] Connecting to 0.0.0.0:42925
W20260926 16:14:31.219424 2935 negotiation.cc:337] Failed RPC negotiation. Trace:
0926 16:14:31.217817 (+ 0us) reactor.cc:625] Submitting negotiation task for client connection to 0.0.0.0:42925 (local address 127.0.0.1:58162)
0926 16:14:31.218284 (+ 467us) negotiation.cc:107] Waiting for socket to connect
0926 16:14:31.218316 (+ 32us) client_negotiation.cc:174] Beginning negotiation
0926 16:14:31.218602 (+ 286us) client_negotiation.cc:252] Sending NEGOTIATE NegotiatePB request
0926 16:14:31.218819 (+ 217us) negotiation.cc:327] Negotiation complete: Network error: Client connection negotiation failed: client connection to 0.0.0.0:42925: BlockingWrite error: write error: Broken pipe (error 32)
Metrics: {"client-negotiator.queue_time_us":126}
[ OK ] Parameters/TestRpc.TestServerShutsDown/SSL_TCP (14 ms)
[ RUN ] Parameters/TestRpc.TimedOutOnResponseMetric/SSL_TCP
I20260926 16:14:31.243656 2952 acceptor_pool.cc:254] collecting diagnostics on the listening RPC socket 0.0.0.0:41903 every 8 connection(s)
I20260926 16:14:31.244351 2953 acceptor_pool.cc:254] collecting diagnostics on the listening RPC socket 0.0.0.0:41903 every 8 connection(s)
W20260926 16:14:31.483035 2956 rpcz_store.cc:267] Call kudu.rpc_test.CalculatorService.Sleep from 127.0.0.1:55554 (request call id 3) took 50 ms (client timeout 25 ms). Trace:
W20260926 16:14:31.483333 2956 rpcz_store.cc:269] 0926 16:14:31.432398 (+ 0us) service_pool.cc:170] Inserting onto call queue
0926 16:14:31.432527 (+ 129us) service_pool.cc:227] Handling call
0926 16:14:31.482911 (+ 50384us) inbound_call.cc:173] Queueing success response
Related trace 'test_child':
Metrics: {"test_sleep_us":50000,"child_traces":[["test_child",{"related_trace_metric":1}]]}
W20260926 16:14:31.542582 2956 rpcz_store.cc:267] Call kudu.rpc_test.CalculatorService.Sleep from 127.0.0.1:55554 (request call id 4) took 50 ms (client timeout 50 ms). Trace:
W20260926 16:14:31.542855 2956 rpcz_store.cc:269] 0926 16:14:31.491954 (+ 0us) service_pool.cc:170] Inserting onto call queue
0926 16:14:31.492111 (+ 157us) service_pool.cc:227] Handling call
0926 16:14:31.542512 (+ 50401us) inbound_call.cc:173] Queueing success response
Related trace 'test_child':
Metrics: {"test_sleep_us":50000,"child_traces":[["test_child",{"related_trace_metric":1}]]}
[ OK ] Parameters/TestRpc.TimedOutOnResponseMetric/SSL_TCP (328 ms)
[ RUN ] Parameters/TestRpc.AcceptorDispatchingTimesMetric/SSL_TCP
I20260926 16:14:31.563081 2977 acceptor_pool.cc:254] collecting diagnostics on the listening RPC socket 0.0.0.0:41173 every 8 connection(s)
I20260926 16:14:31.563804 2978 acceptor_pool.cc:254] collecting diagnostics on the listening RPC socket 0.0.0.0:41173 every 8 connection(s)
W20260926 16:14:31.568712 2973 negotiation.cc:337] Failed RPC negotiation. Trace:
0926 16:14:31.567583 (+ 0us) reactor.cc:625] Submitting negotiation task for server connection from 127.0.0.1:35450 (local address 127.0.0.1:41173)
0926 16:14:31.568030 (+ 447us) server_negotiation.cc:206] Beginning negotiation
0926 16:14:31.568047 (+ 17us) server_negotiation.cc:399] Waiting for connection header
0926 16:14:31.568267 (+ 220us) negotiation.cc:327] Negotiation complete: Network error: Server connection negotiation failed: server connection from 127.0.0.1:35450: BlockingRecv error: recv got EOF from 127.0.0.1:35450 (error 108)
Metrics: {"server-negotiator.queue_time_us":128}
[ OK ] Parameters/TestRpc.AcceptorDispatchingTimesMetric/SSL_TCP (23 ms)
[ RUN ] Parameters/TestRpc.TestRpcCallbackDestroysMessenger/SSL_TCP
[ OK ] Parameters/TestRpc.TestRpcCallbackDestroysMessenger/SSL_TCP (19 ms)
[ RUN ] Parameters/TestRpc.TestApplicationFeatureFlag/SSL_TCP
I20260926 16:14:31.626451 3002 acceptor_pool.cc:254] collecting diagnostics on the listening RPC socket 0.0.0.0:41895 every 8 connection(s)
I20260926 16:14:31.627315 3003 acceptor_pool.cc:254] collecting diagnostics on the listening RPC socket 0.0.0.0:41895 every 8 connection(s)
W20260926 16:14:31.658281 3000 messenger.cc:357] Unable to handle RPC call: Not implemented: call requires unsupported application feature flags: 99
[ OK ] Parameters/TestRpc.TestApplicationFeatureFlag/SSL_TCP (72 ms)
[ RUN ] Parameters/TestRpc.TestCancellation/SSL_TCP
I20260926 16:14:31.697369 3027 acceptor_pool.cc:254] collecting diagnostics on the listening RPC socket 0.0.0.0:38691 every 8 connection(s)
I20260926 16:14:31.698047 3028 acceptor_pool.cc:254] collecting diagnostics on the listening RPC socket 0.0.0.0:38691 every 8 connection(s)
I20260926 16:14:31.702641 2613 rpc-test.cc:1648] Connecting to 0.0.0.0:38691
I20260926 16:14:31.811564 2613 rpc-test-base.h:595] status: Aborted: Sleep RPC to 0.0.0.0:38691 is cancelled in state READY, seconds elapsed: 0.000348483
I20260926 16:14:31.952739 2613 rpc-test-base.h:595] status: Aborted: Sleep RPC to 0.0.0.0:38691 is cancelled in state SENT, seconds elapsed: 0.000907605
I20260926 16:14:32.005198 3030 rpc-test-base.h:222] got call: sleep_micros: 510000
I20260926 16:14:32.127187 2613 rpc-test-base.h:595] status: Aborted: Sleep RPC to 0.0.0.0:38691 is cancelled in state SENT, seconds elapsed: 0.000925428
I20260926 16:14:32.172673 3029 rpc-test-base.h:222] got call: sleep_micros: 510000
I20260926 16:14:32.298454 2613 rpc-test-base.h:595] status: Aborted: Sleep RPC to 0.0.0.0:38691 is cancelled in state SENT, seconds elapsed: 0.000899816
W20260926 16:14:32.338008 3031 rpcz_store.cc:267] Call kudu.rpc.GenericCalculatorService.Sleep from 127.0.0.1:56078 (request call id 11) took 15 ms (client timeout 10 ms). Trace:
W20260926 16:14:32.338362 3031 rpcz_store.cc:269] 0926 16:14:32.322638 (+ 0us) service_pool.cc:170] Inserting onto call queue
0926 16:14:32.337715 (+ 15077us) service_pool.cc:214] Skipping call since client already timed out
0926 16:14:32.337824 (+ 109us) inbound_call.cc:173] Queueing failure response
Metrics: {}
I20260926 16:14:32.338881 3031 rpc-test-base.h:222] got call: sleep_micros: 1500000
W20260926 16:14:32.516016 3030 rpcz_store.cc:267] Call kudu.rpc.GenericCalculatorService.Sleep from 127.0.0.1:56078 (request call id 3) took 511 ms (client timeout 10 ms). Trace:
W20260926 16:14:32.516317 3030 rpcz_store.cc:269] 0926 16:14:32.004942 (+ 0us) service_pool.cc:170] Inserting onto call queue
0926 16:14:32.005112 (+ 170us) service_pool.cc:227] Handling call
0926 16:14:32.515962 (+510850us) inbound_call.cc:173] Queueing success response
Metrics: {}
W20260926 16:14:32.683398 3029 rpcz_store.cc:267] Call kudu.rpc.GenericCalculatorService.Sleep from 127.0.0.1:56078 (request call id 7) took 511 ms (client timeout 10 ms). Trace:
W20260926 16:14:32.683710 3029 rpcz_store.cc:269] 0926 16:14:32.172429 (+ 0us) service_pool.cc:170] Inserting onto call queue
0926 16:14:32.172589 (+ 160us) service_pool.cc:227] Handling call
0926 16:14:32.683339 (+510750us) inbound_call.cc:173] Queueing success response
Metrics: {}
I20260926 16:14:33.300536 2613 rpc-test-base.h:595] status: Timed out: Sleep RPC to 0.0.0.0:38691 timed out after 1.000s (SENT), seconds elapsed: 1.00163
I20260926 16:14:33.301847 3029 rpc-test-base.h:222] got call: sleep_micros: 1500000
W20260926 16:14:33.839491 3031 rpcz_store.cc:267] Call kudu.rpc.GenericCalculatorService.Sleep from 127.0.0.1:56078 (request call id 12) took 1516 ms (client timeout 1000 ms). Trace:
W20260926 16:14:33.839872 3031 rpcz_store.cc:269] 0926 16:14:32.322975 (+ 0us) service_pool.cc:170] Inserting onto call queue
0926 16:14:32.338843 (+ 15868us) service_pool.cc:227] Handling call
0926 16:14:33.839438 (+1500595us) inbound_call.cc:173] Queueing success response
Metrics: {}
I20260926 16:14:34.301966 2613 rpc-test-base.h:595] status: Timed out: Sleep RPC to 0.0.0.0:38691 timed out after 1.000s (SENT), seconds elapsed: 1.00105
W20260926 16:14:34.303481 3025 messenger.cc:357] Unable to handle RPC call: Not implemented: call requires unsupported application feature flags: 99, 1
W20260926 16:14:34.305064 3025 messenger.cc:357] Unable to handle RPC call: Not implemented: call requires unsupported application feature flags: 99, 1
W20260926 16:14:34.802363 3029 rpcz_store.cc:267] Call kudu.rpc.GenericCalculatorService.Sleep from 127.0.0.1:56078 (request call id 13) took 1500 ms (client timeout 1000 ms). Trace:
W20260926 16:14:34.802739 3029 rpcz_store.cc:269] 0926 16:14:33.301667 (+ 0us) service_pool.cc:170] Inserting onto call queue
0926 16:14:33.301796 (+ 129us) service_pool.cc:227] Handling call
0926 16:14:34.802287 (+1500491us) inbound_call.cc:173] Queueing success response
Metrics: {}
W20260926 16:14:34.803337 3025 connection.cc:441] server connection from 127.0.0.1:56078 torn down before Call kudu.rpc.GenericCalculatorService.Sleep from 127.0.0.1:56078 (request call id 13) could send its response
[ OK ] Parameters/TestRpc.TestCancellation/SSL_TCP (3142 ms)
[ RUN ] Parameters/TestRpc.TestCancellationMultiThreads/SSL_TCP
I20260926 16:14:34.834292 3052 acceptor_pool.cc:254] collecting diagnostics on the listening RPC socket 0.0.0.0:46297 every 8 connection(s)
I20260926 16:14:34.835052 3053 acceptor_pool.cc:254] collecting diagnostics on the listening RPC socket 0.0.0.0:46297 every 8 connection(s)
I20260926 16:14:34.838124 2613 rpc-test.cc:1808] Connecting to 0.0.0.0:46297
I20260926 16:14:34.983223 3066 test_util.cc:268] Using random seed: 553266967
I20260926 16:14:34.985992 3068 test_util.cc:268] Using random seed: 553269743
I20260926 16:14:34.987128 3067 test_util.cc:268] Using random seed: 553268485
I20260926 16:14:34.987428 3069 test_util.cc:268] Using random seed: 553271150
I20260926 16:14:34.988979 3070 test_util.cc:268] Using random seed: 553272558
I20260926 16:14:34.990486 3071 test_util.cc:268] Using random seed: 553274054
I20260926 16:14:34.992199 3072 test_util.cc:268] Using random seed: 553275784
I20260926 16:14:34.993799 3073 test_util.cc:268] Using random seed: 553277399
I20260926 16:14:34.995560 3074 test_util.cc:268] Using random seed: 553279162
I20260926 16:14:34.997020 3075 test_util.cc:268] Using random seed: 553280630
I20260926 16:14:34.999008 3076 test_util.cc:268] Using random seed: 553282599
I20260926 16:14:35.000782 3077 test_util.cc:268] Using random seed: 553284321
I20260926 16:14:35.006804 3078 test_util.cc:268] Using random seed: 553290391
I20260926 16:14:35.008631 3079 test_util.cc:268] Using random seed: 553292178
I20260926 16:14:35.010495 3080 test_util.cc:268] Using random seed: 553293986
I20260926 16:14:35.012239 3081 test_util.cc:268] Using random seed: 553295831
I20260926 16:14:35.014122 3082 test_util.cc:268] Using random seed: 553297681
I20260926 16:14:35.016093 3083 test_util.cc:268] Using random seed: 553299563
I20260926 16:14:35.018275 3084 test_util.cc:268] Using random seed: 553301850
I20260926 16:14:35.023211 3085 test_util.cc:268] Using random seed: 553306809
I20260926 16:14:35.025081 3086 test_util.cc:268] Using random seed: 553308665
I20260926 16:14:35.027251 3087 test_util.cc:268] Using random seed: 553310804
I20260926 16:14:35.029086 3088 test_util.cc:268] Using random seed: 553312654
I20260926 16:14:35.031520 3089 test_util.cc:268] Using random seed: 553315091
I20260926 16:14:35.033254 3090 test_util.cc:268] Using random seed: 553316824
I20260926 16:14:35.035247 3091 test_util.cc:268] Using random seed: 553318784
I20260926 16:14:35.037060 3092 test_util.cc:268] Using random seed: 553320606
I20260926 16:14:35.038851 3093 test_util.cc:268] Using random seed: 553322412
I20260926 16:14:35.040616 3094 test_util.cc:268] Using random seed: 553324211
I20260926 16:14:35.042670 3095 test_util.cc:268] Using random seed: 553326284
[ OK ] Parameters/TestRpc.TestCancellationMultiThreads/SSL_TCP (17890 ms)
[ RUN ] Parameters/TestRpc.TestCallId/SSL_TCP
I20260926 16:14:52.737538 3109 acceptor_pool.cc:254] collecting diagnostics on the listening RPC socket 0.0.0.0:44499 every 8 connection(s)
I20260926 16:14:52.738368 3110 acceptor_pool.cc:254] collecting diagnostics on the listening RPC socket 0.0.0.0:44499 every 8 connection(s)
[ OK ] Parameters/TestRpc.TestCallId/SSL_TCP (115 ms)
[----------] 20 tests from Parameters/TestRpc (37554 ms total)
[----------] Global test environment tear-down
[==========] 21 tests from 2 test suites ran. (37562 ms total)
[ PASSED ] 20 tests.
[ FAILED ] 1 test, listed below:
[ FAILED ] Parameters/TestRpc.TestCallWithChainCertAndRootCA/SSL_TCP, where GetParam() = (true, false)
1 FAILED TEST