Diagnosed failure

Parameters/TestRpc.TestCallWithChainCertAndChainCA/SSL_UnixSocket: /data0/somelongdirectorytoavoidrpathissues/src/kudu/src/kudu/rpc/rpc-test.cc:270: Failure
Failed
Bad status: Runtime error: could not verify certificate chain (error with cert: subject=CN = localhost, ST = sadfjas, C = AS, emailAddress = sdflkdsajf, O = lskdfjlsad, OU = sldfkja, issuer=C = AS, ST = ASDfkjdhf, L = lskdjf, O = saldfja, OU = skdjf, CN = localhost, emailAddress = sadjflkadsj): : certificate has expired
Google Test trace:
/data0/somelongdirectorytoavoidrpathissues/src/kudu/src/kudu/rpc/rpc-test.cc:267: Connecting to unix:/tmp/dist-test-tasknQRLSB/test-tmp/rpc-test-25f6f395efbf4fcd94dc4e5395f64c73.sock
I20260926 22:40:59.567103 13110 test_util.cc:175] -----------------------------------------------
I20260926 22:40:59.567153 13110 test_util.cc:176] Had fatal failures, leaving test files at /tmp/dist-test-tasknQRLSB/test-tmp/rpc-test.6.Parameters_TestRpc.TestCallWithChainCertAndChainCA_SSL_UnixSocket.1790462459501832-13110-0

Full log

Note: This is test shard 7 of 8.
[==========] Running 21 tests from 2 test suites.
[----------] Global test environment set-up.
[----------] 20 tests from Parameters/TestRpc
[ RUN      ] Parameters/TestRpc.TestMessengerCreateDestroy/SSL_UnixSocket
WARNING: Logging before InitGoogleLogging() is written to STDERR
I20260926 22:40:59.540542 13110 rpc-test.cc:169] started messenger TestCreateDestroy
[       OK ] Parameters/TestRpc.TestMessengerCreateDestroy/SSL_UnixSocket (37 ms)
[ RUN      ] Parameters/TestRpc.TestNegotiationDeadlock/SSL_UnixSocket
I20260926 22:40:59.548870 13130 acceptor_pool.cc:254] collecting diagnostics on the listening RPC socket unix:/tmp/dist-test-tasknQRLSB/test-tmp/rpc-test-9d8214308b9e477ab3fb50a2e265fdfe.sock every 8 connection(s)
I20260926 22:40:59.548903 13131 acceptor_pool.cc:254] collecting diagnostics on the listening RPC socket unix:/tmp/dist-test-tasknQRLSB/test-tmp/rpc-test-9d8214308b9e477ab3fb50a2e265fdfe.sock every 8 connection(s)
[       OK ] Parameters/TestRpc.TestNegotiationDeadlock/SSL_UnixSocket (13 ms)
[ RUN      ] Parameters/TestRpc.TestCallWithChainCertAndChainCA/SSL_UnixSocket
I20260926 22:40:59.562947 13146 acceptor_pool.cc:254] collecting diagnostics on the listening RPC socket unix:/tmp/dist-test-tasknQRLSB/test-tmp/rpc-test-25f6f395efbf4fcd94dc4e5395f64c73.sock every 8 connection(s)
I20260926 22:40:59.562986 13147 acceptor_pool.cc:254] collecting diagnostics on the listening RPC socket unix:/tmp/dist-test-tasknQRLSB/test-tmp/rpc-test-25f6f395efbf4fcd94dc4e5395f64c73.sock every 8 connection(s)
/data0/somelongdirectorytoavoidrpathissues/src/kudu/src/kudu/rpc/rpc-test.cc:270: Failure
Failed
Bad status: Runtime error: could not verify certificate chain (error with cert: subject=CN = localhost, ST = sadfjas, C = AS, emailAddress = sdflkdsajf, O = lskdfjlsad, OU = sldfkja, issuer=C = AS, ST = ASDfkjdhf, L = lskdjf, O = saldfja, OU = skdjf, CN = localhost, emailAddress = sadjflkadsj): : certificate has expired
Google Test trace:
/data0/somelongdirectorytoavoidrpathissues/src/kudu/src/kudu/rpc/rpc-test.cc:267: Connecting to unix:/tmp/dist-test-tasknQRLSB/test-tmp/rpc-test-25f6f395efbf4fcd94dc4e5395f64c73.sock
I20260926 22:40:59.567103 13110 test_util.cc:175] -----------------------------------------------
I20260926 22:40:59.567153 13110 test_util.cc:176] Had fatal failures, leaving test files at /tmp/dist-test-tasknQRLSB/test-tmp/rpc-test.6.Parameters_TestRpc.TestCallWithChainCertAndChainCA_SSL_UnixSocket.1790462459501832-13110-0
[  FAILED  ] Parameters/TestRpc.TestCallWithChainCertAndChainCA/SSL_UnixSocket, where GetParam() = (true, true) (11 ms)
[ RUN      ] Parameters/TestRpc.TestCallWithPasswordProtectedKey/SSL_UnixSocket
I20260926 22:40:59.580375 13171 acceptor_pool.cc:254] collecting diagnostics on the listening RPC socket unix:/tmp/dist-test-tasknQRLSB/test-tmp/rpc-test-b7f77cd394c84457bbba6d68d02e6d0f.sock every 8 connection(s)
I20260926 22:40:59.580403 13172 acceptor_pool.cc:254] collecting diagnostics on the listening RPC socket unix:/tmp/dist-test-tasknQRLSB/test-tmp/rpc-test-b7f77cd394c84457bbba6d68d02e6d0f.sock every 8 connection(s)
W20260926 22:40:59.592278 13168 connection.cc:196] Error closing socket: Network error: TlsSocket::Close: Broken pipe
[       OK ] Parameters/TestRpc.TestCallWithPasswordProtectedKey/SSL_UnixSocket (26 ms)
[ RUN      ] Parameters/TestRpc.TestCallToBadServer/SSL_UnixSocket
I20260926 22:40:59.601249 13110 rpc-test.cc:394] Status: Network error: Client connection negotiation failed: client connection to 0.0.0.0:0: connect: Connection refused (error 111)
I20260926 22:40:59.601567 13110 rpc-test.cc:394] Status: Network error: Client connection negotiation failed: client connection to 0.0.0.0:0: connect: Connection refused (error 111)
I20260926 22:40:59.601824 13110 rpc-test.cc:394] Status: Network error: Client connection negotiation failed: client connection to 0.0.0.0:0: connect: Connection refused (error 111)
I20260926 22:40:59.601995 13110 rpc-test.cc:394] Status: Network error: Client connection negotiation failed: client connection to 0.0.0.0:0: connect: Connection refused (error 111)
I20260926 22:40:59.602166 13110 rpc-test.cc:394] Status: Network error: Client connection negotiation failed: client connection to 0.0.0.0:0: connect: Connection refused (error 111)
[       OK ] Parameters/TestRpc.TestCallToBadServer/SSL_UnixSocket (9 ms)
[ RUN      ] Parameters/TestRpc.TestWrongService/SSL_UnixSocket
I20260926 22:40:59.608582 13206 acceptor_pool.cc:254] collecting diagnostics on the listening RPC socket unix:/tmp/dist-test-tasknQRLSB/test-tmp/rpc-test-59159043fe7a42568c97fe508cc536ac.sock every 8 connection(s)
I20260926 22:40:59.608639 13207 acceptor_pool.cc:254] collecting diagnostics on the listening RPC socket unix:/tmp/dist-test-tasknQRLSB/test-tmp/rpc-test-59159043fe7a42568c97fe508cc536ac.sock every 8 connection(s)
I20260926 22:40:59.628504 13203 messenger.cc:345] service WrongServiceName not registered on TestServer
W20260926 22:40:59.629130 13203 connection.cc:196] Error closing socket: Network error: TlsSocket::Close: Broken pipe
[       OK ] Parameters/TestRpc.TestWrongService/SSL_UnixSocket (27 ms)
[ RUN      ] Parameters/TestRpc.TestConnectionKeepalive/SSL_UnixSocket
I20260926 22:40:59.645692 13229 acceptor_pool.cc:254] collecting diagnostics on the listening RPC socket unix:/tmp/dist-test-tasknQRLSB/test-tmp/rpc-test-318ab324befa4edfacfb1650917312da.sock every 8 connection(s)
I20260926 22:40:59.645754 13230 acceptor_pool.cc:254] collecting diagnostics on the listening RPC socket unix:/tmp/dist-test-tasknQRLSB/test-tmp/rpc-test-318ab324befa4edfacfb1650917312da.sock every 8 connection(s)
I20260926 22:40:59.645920 13110 rpc-test.cc:488] Connecting to unix:/tmp/dist-test-tasknQRLSB/test-tmp/rpc-test-318ab324befa4edfacfb1650917312da.sock
W20260926 22:41:00.131920 13242 connection.cc:196] Error closing socket: Network error: TlsSocket::Close: Broken pipe
[       OK ] Parameters/TestRpc.TestConnectionKeepalive/SSL_UnixSocket (1046 ms)
[ RUN      ] Parameters/TestRpc.TestClientConnectionMetrics/SSL_UnixSocket
I20260926 22:41:00.689505 13254 acceptor_pool.cc:254] collecting diagnostics on the listening RPC socket unix:/tmp/dist-test-tasknQRLSB/test-tmp/rpc-test-065f31b7ec154622ae0acf0daf4d27ce.sock every 8 connection(s)
I20260926 22:41:00.689522 13255 acceptor_pool.cc:254] collecting diagnostics on the listening RPC socket unix:/tmp/dist-test-tasknQRLSB/test-tmp/rpc-test-065f31b7ec154622ae0acf0daf4d27ce.sock every 8 connection(s)
I20260926 22:41:00.689697 13110 rpc-test.cc:569] Connecting to unix:/tmp/dist-test-tasknQRLSB/test-tmp/rpc-test-065f31b7ec154622ae0acf0daf4d27ce.sock
W20260926 22:41:08.897367 13251 connection.cc:196] Error closing socket: Network error: TlsSocket::Close: Broken pipe
[       OK ] Parameters/TestRpc.TestClientConnectionMetrics/SSL_UnixSocket (8222 ms)
[ RUN      ] Parameters/TestRpc.TestCredentialsPolicy/SSL_UnixSocket
I20260926 22:41:08.913731 13277 acceptor_pool.cc:254] collecting diagnostics on the listening RPC socket unix:/tmp/dist-test-tasknQRLSB/test-tmp/rpc-test-b0c2358c96264185b95b6ae78154ae51.sock every 8 connection(s)
I20260926 22:41:08.913874 13278 acceptor_pool.cc:254] collecting diagnostics on the listening RPC socket unix:/tmp/dist-test-tasknQRLSB/test-tmp/rpc-test-b0c2358c96264185b95b6ae78154ae51.sock every 8 connection(s)
I20260926 22:41:08.914039 13110 rpc-test.cc:700] Connecting to unix:/tmp/dist-test-tasknQRLSB/test-tmp/rpc-test-b0c2358c96264185b95b6ae78154ae51.sock
W20260926 22:41:08.928313 13276 connection.cc:196] Error closing socket: Network error: TlsSocket::Close: Broken pipe
W20260926 22:41:08.931793 13276 connection.cc:196] Error closing socket: Network error: TlsSocket::Close: Broken pipe
[       OK ] Parameters/TestRpc.TestCredentialsPolicy/SSL_UnixSocket (34 ms)
[ RUN      ] Parameters/TestRpc.TestCallLongerThanKeepalive/SSL_UnixSocket
I20260926 22:41:08.943782 13302 acceptor_pool.cc:254] collecting diagnostics on the listening RPC socket unix:/tmp/dist-test-tasknQRLSB/test-tmp/rpc-test-5d4c9a45fb5b43e9bda5bd6d7f0ad888.sock every 8 connection(s)
I20260926 22:41:08.943817 13303 acceptor_pool.cc:254] collecting diagnostics on the listening RPC socket unix:/tmp/dist-test-tasknQRLSB/test-tmp/rpc-test-5d4c9a45fb5b43e9bda5bd6d7f0ad888.sock every 8 connection(s)
I20260926 22:41:08.965969 13306 rpc-test-base.h:222] got call: sleep_micros: 3000000 deferred: true
I20260926 22:41:11.966666 13306 rpcz_store.cc:275] Call kudu.rpc.GenericCalculatorService.Sleep from unix:<unnamed> (request call id 0) took 3000 ms. Trace:
I20260926 22:41:11.966774 13306 rpcz_store.cc:276] 0926 22:41:08.965910 (+     0us) service_pool.cc:170] Inserting onto call queue
0926 22:41:08.965948 (+    38us) service_pool.cc:227] Handling call
0926 22:41:11.966648 (+3000700us) inbound_call.cc:173] Queueing success response
Metrics: {}
[       OK ] Parameters/TestRpc.TestCallLongerThanKeepalive/SSL_UnixSocket (3035 ms)
[ RUN      ] Parameters/TestRpc.TestRpcSidecar/SSL_UnixSocket
I20260926 22:41:11.985512 13327 acceptor_pool.cc:254] collecting diagnostics on the listening RPC socket unix:/tmp/dist-test-tasknQRLSB/test-tmp/rpc-test-643f407edebe4be2b6cdcb6d016b80cb.sock every 8 connection(s)
I20260926 22:41:11.985554 13328 acceptor_pool.cc:254] collecting diagnostics on the listening RPC socket unix:/tmp/dist-test-tasknQRLSB/test-tmp/rpc-test-643f407edebe4be2b6cdcb6d016b80cb.sock every 8 connection(s)
W20260926 22:41:12.025568 13324 connection.cc:196] Error closing socket: Network error: TlsSocket::Close: Broken pipe
[       OK ] Parameters/TestRpc.TestRpcSidecar/SSL_UnixSocket (59 ms)
[ RUN      ] Parameters/TestRpc.TestRpcSidecarLimits/SSL_UnixSocket
I20260926 22:41:13.646837 13352 acceptor_pool.cc:254] collecting diagnostics on the listening RPC socket unix:/tmp/dist-test-tasknQRLSB/test-tmp/rpc-test-a208ffcae74b46f99f1840531b6ba26c.sock every 8 connection(s)
I20260926 22:41:13.646867 13353 acceptor_pool.cc:254] collecting diagnostics on the listening RPC socket unix:/tmp/dist-test-tasknQRLSB/test-tmp/rpc-test-a208ffcae74b46f99f1840531b6ba26c.sock every 8 connection(s)
W20260926 22:41:13.664927 13110 serialization.cc:72] Serialized kudu.rpc_test.PushStringsRequestPB (2147483654 bytes) is larger than the maximum configured RPC message size (52428800 bytes). Sending anyway, but peer may reject the data.
W20260926 22:41:13.668102 13349 connection.cc:535] server connection from unix:<unnamed> recv error: Network error: RPC frame had a length of 2147483714, but we only support messages up to 52428800 bytes long.
W20260926 22:41:13.668174 13349 connection.cc:158] shutting down server connection from unix:<unnamed> with pending inbound data: 4/2147483714 bytes received; last active 0 ns ago: status Network error: RPC frame had a length of 2147483714, but we only support messages up to 52428800 bytes long.
W20260926 22:41:13.668385 13365 connection.cc:196] Error closing socket: Network error: TlsSocket::Close: Broken pipe
I20260926 22:41:13.679270 13377 acceptor_pool.cc:254] collecting diagnostics on the listening RPC socket unix:/tmp/dist-test-tasknQRLSB/test-tmp/rpc-test-a208ffcae74b46f99f1840531b6ba26c.sock every 8 connection(s)
I20260926 22:41:13.679278 13378 acceptor_pool.cc:254] collecting diagnostics on the listening RPC socket unix:/tmp/dist-test-tasknQRLSB/test-tmp/rpc-test-a208ffcae74b46f99f1840531b6ba26c.sock every 8 connection(s)
W20260926 22:41:18.497925 13374 connection.cc:577] server connection from unix:<unnamed>: received bad data: 'Corruption: Invalid packet: message had a length of 2147483710, but we only support messages up to 2147483647 bytes
'
W20260926 22:41:18.498346 13390 connection.cc:196] Error closing socket: Network error: TlsSocket::Close: Broken pipe
[       OK ] Parameters/TestRpc.TestRpcSidecarLimits/SSL_UnixSocket (6471 ms)
[ RUN      ] Parameters/TestRpc.TestCallTimeoutDoesntAffectNegotiation/SSL_UnixSocket
I20260926 22:41:18.516592 13402 acceptor_pool.cc:254] collecting diagnostics on the listening RPC socket unix:/tmp/dist-test-tasknQRLSB/test-tmp/rpc-test-266c71d12c6e4beab9dbc0d549570b26.sock every 8 connection(s)
I20260926 22:41:18.516716 13403 acceptor_pool.cc:254] collecting diagnostics on the listening RPC socket unix:/tmp/dist-test-tasknQRLSB/test-tmp/rpc-test-266c71d12c6e4beab9dbc0d549570b26.sock every 8 connection(s)
W20260926 22:41:18.545684 13398 negotiation.cc:266] Injecting 500ms delay in negotiation
I20260926 22:41:18.595901 13110 rpc-test-base.h:595] status: Timed out: connection negotiation to unix:/tmp/dist-test-tasknQRLSB/test-tmp/rpc-test-266c71d12c6e4beab9dbc0d549570b26.sock for RPC Sleep timed out after 0.050s (ON_OUTBOUND_QUEUE), seconds elapsed: 0.0505257
[       OK ] Parameters/TestRpc.TestCallTimeoutDoesntAffectNegotiation/SSL_UnixSocket (550 ms)
[ RUN      ] Parameters/TestRpc.TestRpcHandlerLatencyMetric/SSL_UnixSocket
I20260926 22:41:19.063279 13427 acceptor_pool.cc:254] collecting diagnostics on the listening RPC socket unix:/tmp/dist-test-tasknQRLSB/test-tmp/rpc-test-c1b8fac282d74011a5552779b4edb5fa.sock every 8 connection(s)
I20260926 22:41:19.063337 13428 acceptor_pool.cc:254] collecting diagnostics on the listening RPC socket unix:/tmp/dist-test-tasknQRLSB/test-tmp/rpc-test-c1b8fac282d74011a5552779b4edb5fa.sock every 8 connection(s)
I20260926 22:41:19.103725 13110 rpc-test.cc:1236] Sleep() min lat: 20305
I20260926 22:41:19.103798 13110 rpc-test.cc:1237] Sleep() mean lat: 20305
I20260926 22:41:19.103823 13110 rpc-test.cc:1238] Sleep() max lat: 20305
I20260926 22:41:19.103837 13110 rpc-test.cc:1239] Sleep() #calls: 1
[       OK ] Parameters/TestRpc.TestRpcHandlerLatencyMetric/SSL_UnixSocket (54 ms)
[ RUN      ] Parameters/TestRpc.TimedOutOnResponseMetricServiceQueue/SSL_UnixSocket
I20260926 22:41:19.116328 13453 acceptor_pool.cc:254] collecting diagnostics on the listening RPC socket unix:/tmp/dist-test-tasknQRLSB/test-tmp/rpc-test-db79f1315b724af09a5e6ff1274dd534.sock every 8 connection(s)
I20260926 22:41:19.116372 13454 acceptor_pool.cc:254] collecting diagnostics on the listening RPC socket unix:/tmp/dist-test-tasknQRLSB/test-tmp/rpc-test-db79f1315b724af09a5e6ff1274dd534.sock every 8 connection(s)
W20260926 22:41:19.170356 13455 rpcz_store.cc:267] Call kudu.rpc_test.CalculatorService.Sleep from unix:<unnamed> (request call id 2) took 20 ms (client timeout 20 ms). Trace:
W20260926 22:41:19.170491 13455 rpcz_store.cc:269] 0926 22:41:19.150091 (+     0us) service_pool.cc:170] Inserting onto call queue
0926 22:41:19.170308 (+ 20217us) service_pool.cc:214] Skipping call since client already timed out
0926 22:41:19.170319 (+    11us) inbound_call.cc:173] Queueing failure response
Metrics: {}
W20260926 22:41:19.171007 13450 connection.cc:196] Error closing socket: Network error: TlsSocket::Close: Broken pipe
[       OK ] Parameters/TestRpc.TimedOutOnResponseMetricServiceQueue/SSL_UnixSocket (66 ms)
[ RUN      ] Parameters/TestRpc.RpcPendingConnectionsMetric/SSL_UnixSocket
I20260926 22:41:19.173833 13476 acceptor_pool.cc:254] collecting diagnostics on the listening RPC socket 0.0.0.0:33779 every 8 connection(s)
I20260926 22:41:19.173923 13477 acceptor_pool.cc:254] collecting diagnostics on the listening RPC socket 0.0.0.0:33779 every 8 connection(s)
W20260926 22:41:19.174485 13472 negotiation.cc:337] Failed RPC negotiation. Trace:
0926 22:41:19.174308 (+     0us) reactor.cc:625] Submitting negotiation task for server connection from 127.0.0.1:52414 (local address 127.0.0.1:33779)
0926 22:41:19.174351 (+    43us) server_negotiation.cc:206] Beginning negotiation
0926 22:41:19.174356 (+     5us) server_negotiation.cc:399] Waiting for connection header
0926 22:41:19.174422 (+    66us) negotiation.cc:327] Negotiation complete: Network error: Server connection negotiation failed: server connection from 127.0.0.1:52414: BlockingRecv error: recv got EOF from 127.0.0.1:52414 (error 108)
Metrics: {"server-negotiator.queue_time_us":15}
[       OK ] Parameters/TestRpc.RpcPendingConnectionsMetric/SSL_UnixSocket (13 ms)
[ RUN      ] Parameters/TestRpc.TestRpcContextClientDeadline/SSL_UnixSocket
I20260926 22:41:19.204691 13492 acceptor_pool.cc:254] collecting diagnostics on the listening RPC socket unix:/tmp/dist-test-tasknQRLSB/test-tmp/rpc-test-5ca625342fb44c18be7470522620a436.sock every 8 connection(s)
I20260926 22:41:19.204733 13493 acceptor_pool.cc:254] collecting diagnostics on the listening RPC socket unix:/tmp/dist-test-tasknQRLSB/test-tmp/rpc-test-5ca625342fb44c18be7470522620a436.sock every 8 connection(s)
[       OK ] Parameters/TestRpc.TestRpcContextClientDeadline/SSL_UnixSocket (60 ms)
[ RUN      ] Parameters/TestRpc.TestApplicationFeatureFlagUnsupportedServer/SSL_UnixSocket
I20260926 22:41:19.259564 13517 acceptor_pool.cc:254] collecting diagnostics on the listening RPC socket unix:/tmp/dist-test-tasknQRLSB/test-tmp/rpc-test-7eacd63d6e7a4e17b3b80360f85eb72f.sock every 8 connection(s)
I20260926 22:41:19.259603 13518 acceptor_pool.cc:254] collecting diagnostics on the listening RPC socket unix:/tmp/dist-test-tasknQRLSB/test-tmp/rpc-test-7eacd63d6e7a4e17b3b80360f85eb72f.sock every 8 connection(s)
[       OK ] Parameters/TestRpc.TestApplicationFeatureFlagUnsupportedServer/SSL_UnixSocket (27 ms)
[ RUN      ] Parameters/TestRpc.TestCancellationAsync/SSL_UnixSocket
I20260926 22:41:19.282649 13542 acceptor_pool.cc:254] collecting diagnostics on the listening RPC socket unix:/tmp/dist-test-tasknQRLSB/test-tmp/rpc-test-daebd940906443a593b4a206e9ea64f3.sock every 8 connection(s)
I20260926 22:41:19.282699 13543 acceptor_pool.cc:254] collecting diagnostics on the listening RPC socket unix:/tmp/dist-test-tasknQRLSB/test-tmp/rpc-test-daebd940906443a593b4a206e9ea64f3.sock every 8 connection(s)
I20260926 22:41:19.282871 13110 rpc-test.cc:1716] Connecting to unix:/tmp/dist-test-tasknQRLSB/test-tmp/rpc-test-daebd940906443a593b4a206e9ea64f3.sock
I20260926 22:41:19.307159 13110 test_util.cc:268] Using random seed: -2012212845
I20260926 22:41:19.321336 13546 rpc-test-base.h:240] got call: sleep_micros: 500 pattern: 4294967295 num_repetitions: 2097152 sidecar_idx: 0
I20260926 22:41:19.332441 13546 rpc-test-base.h:240] got call: sleep_micros: 500 pattern: 4294967295 num_repetitions: 2097152 sidecar_idx: 0
I20260926 22:41:19.343689 13546 rpc-test-base.h:240] got call: sleep_micros: 500 pattern: 4294967295 num_repetitions: 2097152 sidecar_idx: 0
I20260926 22:41:19.354254 13546 rpc-test-base.h:240] got call: sleep_micros: 500 pattern: 4294967295 num_repetitions: 2097152 sidecar_idx: 0
I20260926 22:41:19.364707 13546 rpc-test-base.h:240] got call: sleep_micros: 500 pattern: 4294967295 num_repetitions: 2097152 sidecar_idx: 0
I20260926 22:41:19.374924 13546 rpc-test-base.h:240] got call: sleep_micros: 500 pattern: 4294967295 num_repetitions: 2097152 sidecar_idx: 0
I20260926 22:41:19.385622 13546 rpc-test-base.h:240] got call: sleep_micros: 500 pattern: 4294967295 num_repetitions: 2097152 sidecar_idx: 0
I20260926 22:41:19.395665 13546 rpc-test-base.h:240] got call: sleep_micros: 500 pattern: 4294967295 num_repetitions: 2097152 sidecar_idx: 0
W20260926 22:41:19.396914 13539 connection.cc:196] Error closing socket: Network error: TlsSocket::Close: Broken pipe
W20260926 22:41:19.398730 13539 connection.cc:441] server connection from unix:<unnamed> torn down before Call kudu.rpc.GenericCalculatorService.SleepWithSidecar from unix:<unnamed> (request call id 9) could send its response
[       OK ] Parameters/TestRpc.TestCancellationAsync/SSL_UnixSocket (125 ms)
[ RUN      ] Parameters/TestRpc.TestPerformanceBySocketType/SSL_UnixSocket
I20260926 22:41:19.412563 13567 acceptor_pool.cc:254] collecting diagnostics on the listening RPC socket unix:/tmp/dist-test-tasknQRLSB/test-tmp/rpc-test-d7046f2637464f898be95ec51c83d9f1.sock every 8 connection(s)
I20260926 22:41:19.412611 13568 acceptor_pool.cc:254] collecting diagnostics on the listening RPC socket unix:/tmp/dist-test-tasknQRLSB/test-tmp/rpc-test-d7046f2637464f898be95ec51c83d9f1.sock every 8 connection(s)
I20260926 22:41:19.412787 13110 rpc-test.cc:1846] Connecting to unix:/tmp/dist-test-tasknQRLSB/test-tmp/rpc-test-d7046f2637464f898be95ec51c83d9f1.sock
I20260926 22:41:20.666360 13110 rpc-test.cc:1859] Sending 1024MB via ssl-enabled unix socket: real 1.226s	user 1.268s	sys 0.935s
I20260926 22:41:21.941507 13110 rpc-test.cc:1859] Sending 1024MB via ssl-enabled unix socket: real 1.275s	user 1.398s	sys 0.896s
I20260926 22:41:23.176724 13110 rpc-test.cc:1859] Sending 1024MB via ssl-enabled unix socket: real 1.235s	user 1.347s	sys 0.877s
I20260926 22:41:24.440521 13110 rpc-test.cc:1859] Sending 1024MB via ssl-enabled unix socket: real 1.264s	user 1.494s	sys 0.783s
I20260926 22:41:25.722536 13110 rpc-test.cc:1859] Sending 1024MB via ssl-enabled unix socket: real 1.282s	user 1.466s	sys 0.840s
W20260926 22:41:25.723333 13564 connection.cc:196] Error closing socket: Network error: TlsSocket::Close: Broken pipe
[       OK ] Parameters/TestRpc.TestPerformanceBySocketType/SSL_UnixSocket (6324 ms)
[----------] 20 tests from Parameters/TestRpc (26220 ms total)

[----------] 1 test from Parameters/TestRpcSocketTxRxQueue
[ RUN      ] Parameters/TestRpcSocketTxRxQueue.AcceptorRxQueueSizeMetric/0
I20260926 22:41:25.729540 13592 acceptor_pool.cc:254] collecting diagnostics on the listening RPC socket 0.0.0.0:37079 every 1 connection(s)
I20260926 22:41:25.729592 13593 acceptor_pool.cc:254] collecting diagnostics on the listening RPC socket 0.0.0.0:37079 every 1 connection(s)
W20260926 22:41:25.730197 13588 negotiation.cc:337] Failed RPC negotiation. Trace:
0926 22:41:25.730033 (+     0us) reactor.cc:625] Submitting negotiation task for server connection from 127.0.0.1:51010 (local address 127.0.0.1:37079)
0926 22:41:25.730093 (+    60us) server_negotiation.cc:206] Beginning negotiation
0926 22:41:25.730095 (+     2us) server_negotiation.cc:399] Waiting for connection header
0926 22:41:25.730170 (+    75us) negotiation.cc:327] Negotiation complete: Network error: Server connection negotiation failed: server connection from 127.0.0.1:51010: BlockingRecv error: recv got EOF from 127.0.0.1:51010 (error 108)
Metrics: {"server-negotiator.queue_time_us":30}
[       OK ] Parameters/TestRpcSocketTxRxQueue.AcceptorRxQueueSizeMetric/0 (7 ms)
[----------] 1 test from Parameters/TestRpcSocketTxRxQueue (7 ms total)

[----------] Global test environment tear-down
[==========] 21 tests from 2 test suites ran. (26228 ms total)
[  PASSED  ] 20 tests.
[  FAILED  ] 1 test, listed below:
[  FAILED  ] Parameters/TestRpc.TestCallWithChainCertAndChainCA/SSL_UnixSocket, where GetParam() = (true, true)

 1 FAILED TEST