Diagnosed failure

Parameters/TestRpc.TestCallWithChainCertAndChainCA/SSL_UnixSocket: /data0/somelongdirectorytoavoidrpathissues/src/kudu/src/kudu/rpc/rpc-test.cc:270: Failure
Failed
Bad status: Runtime error: could not verify certificate chain (error with cert: subject=CN = localhost, ST = sadfjas, C = AS, emailAddress = sdflkdsajf, O = lskdfjlsad, OU = sldfkja, issuer=C = AS, ST = ASDfkjdhf, L = lskdjf, O = saldfja, OU = skdjf, CN = localhost, emailAddress = sadjflkadsj): : certificate has expired
Google Test trace:
/data0/somelongdirectorytoavoidrpathissues/src/kudu/src/kudu/rpc/rpc-test.cc:267: Connecting to unix:/tmp/dist-test-taskF3NKtF/test-tmp/rpc-test-fcea6a6b866f483dbc20c6af6563875d.sock
I20260928 02:36:03.527830  1547 test_util.cc:175] -----------------------------------------------
I20260928 02:36:03.527880  1547 test_util.cc:176] Had fatal failures, leaving test files at /tmp/dist-test-taskF3NKtF/test-tmp/rpc-test.6.Parameters_TestRpc.TestCallWithChainCertAndChainCA_SSL_UnixSocket.1790562963466058-1547-0

Full log

Note: This is test shard 7 of 8.
[==========] Running 21 tests from 2 test suites.
[----------] Global test environment set-up.
[----------] 20 tests from Parameters/TestRpc
[ RUN      ] Parameters/TestRpc.TestMessengerCreateDestroy/SSL_UnixSocket
WARNING: Logging before InitGoogleLogging() is written to STDERR
I20260928 02:36:03.479059  1547 rpc-test.cc:169] started messenger TestCreateDestroy
[       OK ] Parameters/TestRpc.TestMessengerCreateDestroy/SSL_UnixSocket (11 ms)
[ RUN      ] Parameters/TestRpc.TestNegotiationDeadlock/SSL_UnixSocket
I20260928 02:36:03.498618  1568 acceptor_pool.cc:254] collecting diagnostics on the listening RPC socket unix:/tmp/dist-test-taskF3NKtF/test-tmp/rpc-test-47f69311991d498c859e9528e08bbde7.sock every 8 connection(s)
I20260928 02:36:03.498632  1567 acceptor_pool.cc:254] collecting diagnostics on the listening RPC socket unix:/tmp/dist-test-taskF3NKtF/test-tmp/rpc-test-47f69311991d498c859e9528e08bbde7.sock every 8 connection(s)
[       OK ] Parameters/TestRpc.TestNegotiationDeadlock/SSL_UnixSocket (25 ms)
[ RUN      ] Parameters/TestRpc.TestCallWithChainCertAndChainCA/SSL_UnixSocket
I20260928 02:36:03.524232  1584 acceptor_pool.cc:254] collecting diagnostics on the listening RPC socket unix:/tmp/dist-test-taskF3NKtF/test-tmp/rpc-test-fcea6a6b866f483dbc20c6af6563875d.sock every 8 connection(s)
I20260928 02:36:03.524232  1583 acceptor_pool.cc:254] collecting diagnostics on the listening RPC socket unix:/tmp/dist-test-taskF3NKtF/test-tmp/rpc-test-fcea6a6b866f483dbc20c6af6563875d.sock every 8 connection(s)
/data0/somelongdirectorytoavoidrpathissues/src/kudu/src/kudu/rpc/rpc-test.cc:270: Failure
Failed
Bad status: Runtime error: could not verify certificate chain (error with cert: subject=CN = localhost, ST = sadfjas, C = AS, emailAddress = sdflkdsajf, O = lskdfjlsad, OU = sldfkja, issuer=C = AS, ST = ASDfkjdhf, L = lskdjf, O = saldfja, OU = skdjf, CN = localhost, emailAddress = sadjflkadsj): : certificate has expired
Google Test trace:
/data0/somelongdirectorytoavoidrpathissues/src/kudu/src/kudu/rpc/rpc-test.cc:267: Connecting to unix:/tmp/dist-test-taskF3NKtF/test-tmp/rpc-test-fcea6a6b866f483dbc20c6af6563875d.sock
I20260928 02:36:03.527830  1547 test_util.cc:175] -----------------------------------------------
I20260928 02:36:03.527880  1547 test_util.cc:176] Had fatal failures, leaving test files at /tmp/dist-test-taskF3NKtF/test-tmp/rpc-test.6.Parameters_TestRpc.TestCallWithChainCertAndChainCA_SSL_UnixSocket.1790562963466058-1547-0
[  FAILED  ] Parameters/TestRpc.TestCallWithChainCertAndChainCA/SSL_UnixSocket, where GetParam() = (true, true) (22 ms)
[ RUN      ] Parameters/TestRpc.TestCallWithPasswordProtectedKey/SSL_UnixSocket
I20260928 02:36:03.537546  1608 acceptor_pool.cc:254] collecting diagnostics on the listening RPC socket unix:/tmp/dist-test-taskF3NKtF/test-tmp/rpc-test-454b2b6a494040958998352a16b2092d.sock every 8 connection(s)
I20260928 02:36:03.537554  1609 acceptor_pool.cc:254] collecting diagnostics on the listening RPC socket unix:/tmp/dist-test-taskF3NKtF/test-tmp/rpc-test-454b2b6a494040958998352a16b2092d.sock every 8 connection(s)
W20260928 02:36:03.547811  1605 connection.cc:196] Error closing socket: Network error: TlsSocket::Close: Broken pipe
[       OK ] Parameters/TestRpc.TestCallWithPasswordProtectedKey/SSL_UnixSocket (20 ms)
[ RUN      ] Parameters/TestRpc.TestCallToBadServer/SSL_UnixSocket
I20260928 02:36:03.566494  1547 rpc-test.cc:394] Status: Network error: Client connection negotiation failed: client connection to 0.0.0.0:0: connect: Connection refused (error 111)
I20260928 02:36:03.566740  1547 rpc-test.cc:394] Status: Network error: Client connection negotiation failed: client connection to 0.0.0.0:0: connect: Connection refused (error 111)
I20260928 02:36:03.566887  1547 rpc-test.cc:394] Status: Network error: Client connection negotiation failed: client connection to 0.0.0.0:0: connect: Connection refused (error 111)
I20260928 02:36:03.567028  1547 rpc-test.cc:394] Status: Network error: Client connection negotiation failed: client connection to 0.0.0.0:0: connect: Connection refused (error 111)
I20260928 02:36:03.567167  1547 rpc-test.cc:394] Status: Network error: Client connection negotiation failed: client connection to 0.0.0.0:0: connect: Connection refused (error 111)
[       OK ] Parameters/TestRpc.TestCallToBadServer/SSL_UnixSocket (18 ms)
[ RUN      ] Parameters/TestRpc.TestWrongService/SSL_UnixSocket
I20260928 02:36:03.578416  1643 acceptor_pool.cc:254] collecting diagnostics on the listening RPC socket unix:/tmp/dist-test-taskF3NKtF/test-tmp/rpc-test-95d9b1f851bd4824b15a8df03c3f6071.sock every 8 connection(s)
I20260928 02:36:03.578538  1644 acceptor_pool.cc:254] collecting diagnostics on the listening RPC socket unix:/tmp/dist-test-taskF3NKtF/test-tmp/rpc-test-95d9b1f851bd4824b15a8df03c3f6071.sock every 8 connection(s)
I20260928 02:36:03.589383  1640 messenger.cc:345] service WrongServiceName not registered on TestServer
[       OK ] Parameters/TestRpc.TestWrongService/SSL_UnixSocket (23 ms)
[ RUN      ] Parameters/TestRpc.TestConnectionKeepalive/SSL_UnixSocket
I20260928 02:36:03.597602  1666 acceptor_pool.cc:254] collecting diagnostics on the listening RPC socket unix:/tmp/dist-test-taskF3NKtF/test-tmp/rpc-test-82c42b5252f74674b3f4a38f183399c3.sock every 8 connection(s)
I20260928 02:36:03.597656  1667 acceptor_pool.cc:254] collecting diagnostics on the listening RPC socket unix:/tmp/dist-test-taskF3NKtF/test-tmp/rpc-test-82c42b5252f74674b3f4a38f183399c3.sock every 8 connection(s)
I20260928 02:36:03.597770  1547 rpc-test.cc:488] Connecting to unix:/tmp/dist-test-taskF3NKtF/test-tmp/rpc-test-82c42b5252f74674b3f4a38f183399c3.sock
W20260928 02:36:04.092552  1679 connection.cc:196] Error closing socket: Network error: TlsSocket::Close: Broken pipe
[       OK ] Parameters/TestRpc.TestConnectionKeepalive/SSL_UnixSocket (1023 ms)
[ RUN      ] Parameters/TestRpc.TestClientConnectionMetrics/SSL_UnixSocket
I20260928 02:36:04.640609  1691 acceptor_pool.cc:254] collecting diagnostics on the listening RPC socket unix:/tmp/dist-test-taskF3NKtF/test-tmp/rpc-test-030ede3e5ce249b4b96ba3c31757b7f0.sock every 8 connection(s)
I20260928 02:36:04.640628  1692 acceptor_pool.cc:254] collecting diagnostics on the listening RPC socket unix:/tmp/dist-test-taskF3NKtF/test-tmp/rpc-test-030ede3e5ce249b4b96ba3c31757b7f0.sock every 8 connection(s)
I20260928 02:36:04.640761  1547 rpc-test.cc:569] Connecting to unix:/tmp/dist-test-taskF3NKtF/test-tmp/rpc-test-030ede3e5ce249b4b96ba3c31757b7f0.sock
W20260928 02:36:12.612545  1688 connection.cc:196] Error closing socket: Network error: TlsSocket::Close: Broken pipe
[       OK ] Parameters/TestRpc.TestClientConnectionMetrics/SSL_UnixSocket (7998 ms)
[ RUN      ] Parameters/TestRpc.TestCredentialsPolicy/SSL_UnixSocket
I20260928 02:36:12.625020  1714 acceptor_pool.cc:254] collecting diagnostics on the listening RPC socket unix:/tmp/dist-test-taskF3NKtF/test-tmp/rpc-test-c30fd8e3f3a242138a77ec335ab043ad.sock every 8 connection(s)
I20260928 02:36:12.625056  1715 acceptor_pool.cc:254] collecting diagnostics on the listening RPC socket unix:/tmp/dist-test-taskF3NKtF/test-tmp/rpc-test-c30fd8e3f3a242138a77ec335ab043ad.sock every 8 connection(s)
I20260928 02:36:12.625198  1547 rpc-test.cc:700] Connecting to unix:/tmp/dist-test-taskF3NKtF/test-tmp/rpc-test-c30fd8e3f3a242138a77ec335ab043ad.sock
W20260928 02:36:12.652781  1713 connection.cc:196] Error closing socket: Network error: TlsSocket::Close: Broken pipe
[       OK ] Parameters/TestRpc.TestCredentialsPolicy/SSL_UnixSocket (43 ms)
[ RUN      ] Parameters/TestRpc.TestCallLongerThanKeepalive/SSL_UnixSocket
I20260928 02:36:12.680428  1739 acceptor_pool.cc:254] collecting diagnostics on the listening RPC socket unix:/tmp/dist-test-taskF3NKtF/test-tmp/rpc-test-9f0fdb99203d4eeebcb396d5f51024be.sock every 8 connection(s)
I20260928 02:36:12.680485  1740 acceptor_pool.cc:254] collecting diagnostics on the listening RPC socket unix:/tmp/dist-test-taskF3NKtF/test-tmp/rpc-test-9f0fdb99203d4eeebcb396d5f51024be.sock every 8 connection(s)
I20260928 02:36:12.695861  1743 rpc-test-base.h:222] got call: sleep_micros: 3000000 deferred: true
I20260928 02:36:15.696532  1743 rpcz_store.cc:275] Call kudu.rpc.GenericCalculatorService.Sleep from unix:<unnamed> (request call id 0) took 3000 ms. Trace:
I20260928 02:36:15.696630  1743 rpcz_store.cc:276] 0928 02:36:12.695817 (+     0us) service_pool.cc:170] Inserting onto call queue
0928 02:36:12.695844 (+    27us) service_pool.cc:227] Handling call
0928 02:36:15.696516 (+3000672us) inbound_call.cc:173] Queueing success response
Metrics: {}
[       OK ] Parameters/TestRpc.TestCallLongerThanKeepalive/SSL_UnixSocket (3041 ms)
[ RUN      ] Parameters/TestRpc.TestRpcSidecar/SSL_UnixSocket
I20260928 02:36:15.714020  1764 acceptor_pool.cc:254] collecting diagnostics on the listening RPC socket unix:/tmp/dist-test-taskF3NKtF/test-tmp/rpc-test-78fbfc1788664af3925e9014d72439c2.sock every 8 connection(s)
I20260928 02:36:15.714046  1765 acceptor_pool.cc:254] collecting diagnostics on the listening RPC socket unix:/tmp/dist-test-taskF3NKtF/test-tmp/rpc-test-78fbfc1788664af3925e9014d72439c2.sock every 8 connection(s)
W20260928 02:36:15.752822  1761 connection.cc:196] Error closing socket: Network error: TlsSocket::Close: Broken pipe
[       OK ] Parameters/TestRpc.TestRpcSidecar/SSL_UnixSocket (55 ms)
[ RUN      ] Parameters/TestRpc.TestRpcSidecarLimits/SSL_UnixSocket
I20260928 02:36:17.262253  1790 acceptor_pool.cc:254] collecting diagnostics on the listening RPC socket unix:/tmp/dist-test-taskF3NKtF/test-tmp/rpc-test-a747c49c68a64d5d9d19f44d732e43ad.sock every 8 connection(s)
I20260928 02:36:17.262212  1789 acceptor_pool.cc:254] collecting diagnostics on the listening RPC socket unix:/tmp/dist-test-taskF3NKtF/test-tmp/rpc-test-a747c49c68a64d5d9d19f44d732e43ad.sock every 8 connection(s)
W20260928 02:36:17.270623  1547 serialization.cc:72] Serialized kudu.rpc_test.PushStringsRequestPB (2147483654 bytes) is larger than the maximum configured RPC message size (52428800 bytes). Sending anyway, but peer may reject the data.
W20260928 02:36:17.273568  1786 connection.cc:535] server connection from unix:<unnamed> recv error: Network error: RPC frame had a length of 2147483714, but we only support messages up to 52428800 bytes long.
W20260928 02:36:17.273625  1786 connection.cc:158] shutting down server connection from unix:<unnamed> with pending inbound data: 4/2147483714 bytes received; last active 0 ns ago: status Network error: RPC frame had a length of 2147483714, but we only support messages up to 52428800 bytes long.
W20260928 02:36:17.273727  1802 connection.cc:698] client connection to unix:/tmp/dist-test-taskF3NKtF/test-tmp/rpc-test-a747c49c68a64d5d9d19f44d732e43ad.sock send error: Network error: failed to write to TLS socket: Broken pipe
W20260928 02:36:17.273839  1802 connection.cc:196] Error closing socket: Network error: TlsSocket::Close: Success
I20260928 02:36:17.278985  1814 acceptor_pool.cc:254] collecting diagnostics on the listening RPC socket unix:/tmp/dist-test-taskF3NKtF/test-tmp/rpc-test-a747c49c68a64d5d9d19f44d732e43ad.sock every 8 connection(s)
I20260928 02:36:17.278995  1815 acceptor_pool.cc:254] collecting diagnostics on the listening RPC socket unix:/tmp/dist-test-taskF3NKtF/test-tmp/rpc-test-a747c49c68a64d5d9d19f44d732e43ad.sock every 8 connection(s)
W20260928 02:36:21.384717  1811 connection.cc:577] server connection from unix:<unnamed>: received bad data: 'Corruption: Invalid packet: message had a length of 2147483710, but we only support messages up to 2147483647 bytes
'
W20260928 02:36:21.385012  1827 connection.cc:196] Error closing socket: Network error: TlsSocket::Close: Broken pipe
[       OK ] Parameters/TestRpc.TestRpcSidecarLimits/SSL_UnixSocket (5633 ms)
[ RUN      ] Parameters/TestRpc.TestCallTimeoutDoesntAffectNegotiation/SSL_UnixSocket
I20260928 02:36:21.402566  1839 acceptor_pool.cc:254] collecting diagnostics on the listening RPC socket unix:/tmp/dist-test-taskF3NKtF/test-tmp/rpc-test-908f8ef5973646fcbaba48497df95d45.sock every 8 connection(s)
I20260928 02:36:21.402627  1840 acceptor_pool.cc:254] collecting diagnostics on the listening RPC socket unix:/tmp/dist-test-taskF3NKtF/test-tmp/rpc-test-908f8ef5973646fcbaba48497df95d45.sock every 8 connection(s)
W20260928 02:36:21.423955  1835 negotiation.cc:266] Injecting 500ms delay in negotiation
I20260928 02:36:21.474155  1547 rpc-test-base.h:595] status: Timed out: connection negotiation to unix:/tmp/dist-test-taskF3NKtF/test-tmp/rpc-test-908f8ef5973646fcbaba48497df95d45.sock for RPC Sleep timed out after 0.050s (ON_OUTBOUND_QUEUE), seconds elapsed: 0.050497
W20260928 02:36:21.927757  1836 connection.cc:196] Error closing socket: Network error: TlsSocket::Close: Broken pipe
[       OK ] Parameters/TestRpc.TestCallTimeoutDoesntAffectNegotiation/SSL_UnixSocket (541 ms)
[ RUN      ] Parameters/TestRpc.TestRpcHandlerLatencyMetric/SSL_UnixSocket
I20260928 02:36:21.937773  1864 acceptor_pool.cc:254] collecting diagnostics on the listening RPC socket unix:/tmp/dist-test-taskF3NKtF/test-tmp/rpc-test-c52dc9a0b56a4293891098c228f89242.sock every 8 connection(s)
I20260928 02:36:21.937829  1865 acceptor_pool.cc:254] collecting diagnostics on the listening RPC socket unix:/tmp/dist-test-taskF3NKtF/test-tmp/rpc-test-c52dc9a0b56a4293891098c228f89242.sock every 8 connection(s)
I20260928 02:36:21.969738  1547 rpc-test.cc:1236] Sleep() min lat: 20268
I20260928 02:36:21.969825  1547 rpc-test.cc:1237] Sleep() mean lat: 20268
I20260928 02:36:21.969853  1547 rpc-test.cc:1238] Sleep() max lat: 20268
I20260928 02:36:21.969866  1547 rpc-test.cc:1239] Sleep() #calls: 1
W20260928 02:36:21.970355  1861 connection.cc:196] Error closing socket: Network error: TlsSocket::Close: Broken pipe
[       OK ] Parameters/TestRpc.TestRpcHandlerLatencyMetric/SSL_UnixSocket (42 ms)
[ RUN      ] Parameters/TestRpc.TimedOutOnResponseMetricServiceQueue/SSL_UnixSocket
I20260928 02:36:21.985020  1890 acceptor_pool.cc:254] collecting diagnostics on the listening RPC socket unix:/tmp/dist-test-taskF3NKtF/test-tmp/rpc-test-4f7f866f1ddc4fafa3960c08178ed954.sock every 8 connection(s)
I20260928 02:36:21.985054  1891 acceptor_pool.cc:254] collecting diagnostics on the listening RPC socket unix:/tmp/dist-test-taskF3NKtF/test-tmp/rpc-test-4f7f866f1ddc4fafa3960c08178ed954.sock every 8 connection(s)
W20260928 02:36:22.042300  1892 rpcz_store.cc:267] Call kudu.rpc_test.CalculatorService.Sleep from unix:<unnamed> (request call id 2) took 20 ms (client timeout 20 ms). Trace:
W20260928 02:36:22.042388  1892 rpcz_store.cc:269] 0928 02:36:22.021993 (+     0us) service_pool.cc:170] Inserting onto call queue
0928 02:36:22.042277 (+ 20284us) service_pool.cc:214] Skipping call since client already timed out
0928 02:36:22.042286 (+     9us) inbound_call.cc:173] Queueing failure response
Metrics: {}
W20260928 02:36:22.043040  1887 connection.cc:196] Error closing socket: Network error: TlsSocket::Close: Broken pipe
[       OK ] Parameters/TestRpc.TimedOutOnResponseMetricServiceQueue/SSL_UnixSocket (72 ms)
[ RUN      ] Parameters/TestRpc.RpcPendingConnectionsMetric/SSL_UnixSocket
I20260928 02:36:22.045552  1913 acceptor_pool.cc:254] collecting diagnostics on the listening RPC socket 0.0.0.0:33359 every 8 connection(s)
I20260928 02:36:22.045620  1914 acceptor_pool.cc:254] collecting diagnostics on the listening RPC socket 0.0.0.0:33359 every 8 connection(s)
W20260928 02:36:22.053753  1909 negotiation.cc:337] Failed RPC negotiation. Trace:
0928 02:36:22.053497 (+     0us) reactor.cc:625] Submitting negotiation task for server connection from 127.0.0.1:54924 (local address 127.0.0.1:33359)
0928 02:36:22.053567 (+    70us) server_negotiation.cc:206] Beginning negotiation
0928 02:36:22.053569 (+     2us) server_negotiation.cc:399] Waiting for connection header
0928 02:36:22.053670 (+   101us) negotiation.cc:327] Negotiation complete: Network error: Server connection negotiation failed: server connection from 127.0.0.1:54924: BlockingRecv error: recv got EOF from 127.0.0.1:54924 (error 108)
Metrics: {"server-negotiator.queue_time_us":32}
[       OK ] Parameters/TestRpc.RpcPendingConnectionsMetric/SSL_UnixSocket (20 ms)
[ RUN      ] Parameters/TestRpc.TestRpcContextClientDeadline/SSL_UnixSocket
I20260928 02:36:22.079789  1929 acceptor_pool.cc:254] collecting diagnostics on the listening RPC socket unix:/tmp/dist-test-taskF3NKtF/test-tmp/rpc-test-9702e23e525b4c0e838bb2c155f2e4ca.sock every 8 connection(s)
I20260928 02:36:22.079828  1930 acceptor_pool.cc:254] collecting diagnostics on the listening RPC socket unix:/tmp/dist-test-taskF3NKtF/test-tmp/rpc-test-9702e23e525b4c0e838bb2c155f2e4ca.sock every 8 connection(s)
[       OK ] Parameters/TestRpc.TestRpcContextClientDeadline/SSL_UnixSocket (57 ms)
[ RUN      ] Parameters/TestRpc.TestApplicationFeatureFlagUnsupportedServer/SSL_UnixSocket
I20260928 02:36:22.137678  1954 acceptor_pool.cc:254] collecting diagnostics on the listening RPC socket unix:/tmp/dist-test-taskF3NKtF/test-tmp/rpc-test-13dcac44564244d58e5e586b5a419193.sock every 8 connection(s)
I20260928 02:36:22.137742  1955 acceptor_pool.cc:254] collecting diagnostics on the listening RPC socket unix:/tmp/dist-test-taskF3NKtF/test-tmp/rpc-test-13dcac44564244d58e5e586b5a419193.sock every 8 connection(s)
W20260928 02:36:22.158469  1951 connection.cc:196] Error closing socket: Network error: TlsSocket::Close: Broken pipe
[       OK ] Parameters/TestRpc.TestApplicationFeatureFlagUnsupportedServer/SSL_UnixSocket (37 ms)
[ RUN      ] Parameters/TestRpc.TestCancellationAsync/SSL_UnixSocket
I20260928 02:36:22.173578  1979 acceptor_pool.cc:254] collecting diagnostics on the listening RPC socket unix:/tmp/dist-test-taskF3NKtF/test-tmp/rpc-test-5b742e687eec45989736363310b75c02.sock every 8 connection(s)
I20260928 02:36:22.173611  1980 acceptor_pool.cc:254] collecting diagnostics on the listening RPC socket unix:/tmp/dist-test-taskF3NKtF/test-tmp/rpc-test-5b742e687eec45989736363310b75c02.sock every 8 connection(s)
I20260928 02:36:22.173738  1547 rpc-test.cc:1716] Connecting to unix:/tmp/dist-test-taskF3NKtF/test-tmp/rpc-test-5b742e687eec45989736363310b75c02.sock
I20260928 02:36:22.184482  1547 test_util.cc:268] Using random seed: -293583329
I20260928 02:36:22.198558  1982 rpc-test-base.h:240] got call: sleep_micros: 500 pattern: 4294967295 num_repetitions: 2097152 sidecar_idx: 0
I20260928 02:36:22.208516  1982 rpc-test-base.h:240] got call: sleep_micros: 500 pattern: 4294967295 num_repetitions: 2097152 sidecar_idx: 0
I20260928 02:36:22.218400  1982 rpc-test-base.h:240] got call: sleep_micros: 500 pattern: 4294967295 num_repetitions: 2097152 sidecar_idx: 0
I20260928 02:36:22.228663  1982 rpc-test-base.h:240] got call: sleep_micros: 500 pattern: 4294967295 num_repetitions: 2097152 sidecar_idx: 0
I20260928 02:36:22.239037  1982 rpc-test-base.h:240] got call: sleep_micros: 500 pattern: 4294967295 num_repetitions: 2097152 sidecar_idx: 0
I20260928 02:36:22.249265  1982 rpc-test-base.h:240] got call: sleep_micros: 500 pattern: 4294967295 num_repetitions: 2097152 sidecar_idx: 0
I20260928 02:36:22.259658  1982 rpc-test-base.h:240] got call: sleep_micros: 500 pattern: 4294967295 num_repetitions: 2097152 sidecar_idx: 0
W20260928 02:36:22.261015  1976 connection.cc:196] Error closing socket: Network error: TlsSocket::Close: Broken pipe
W20260928 02:36:22.262631  1976 connection.cc:441] server connection from unix:<unnamed> torn down before Call kudu.rpc.GenericCalculatorService.SleepWithSidecar from unix:<unnamed> (request call id 9) could send its response
[       OK ] Parameters/TestRpc.TestCancellationAsync/SSL_UnixSocket (104 ms)
[ RUN      ] Parameters/TestRpc.TestPerformanceBySocketType/SSL_UnixSocket
I20260928 02:36:22.287500  2004 acceptor_pool.cc:254] collecting diagnostics on the listening RPC socket unix:/tmp/dist-test-taskF3NKtF/test-tmp/rpc-test-d163b1f827f14a92b0f5277035872f99.sock every 8 connection(s)
I20260928 02:36:22.287547  2005 acceptor_pool.cc:254] collecting diagnostics on the listening RPC socket unix:/tmp/dist-test-taskF3NKtF/test-tmp/rpc-test-d163b1f827f14a92b0f5277035872f99.sock every 8 connection(s)
I20260928 02:36:22.287665  1547 rpc-test.cc:1846] Connecting to unix:/tmp/dist-test-taskF3NKtF/test-tmp/rpc-test-d163b1f827f14a92b0f5277035872f99.sock
I20260928 02:36:23.429453  1547 rpc-test.cc:1859] Sending 1024MB via ssl-enabled unix socket: real 1.134s	user 1.268s	sys 0.779s
I20260928 02:36:24.605983  1547 rpc-test.cc:1859] Sending 1024MB via ssl-enabled unix socket: real 1.176s	user 1.376s	sys 0.757s
I20260928 02:36:25.752282  1547 rpc-test.cc:1859] Sending 1024MB via ssl-enabled unix socket: real 1.146s	user 1.323s	sys 0.755s
I20260928 02:36:26.866041  1547 rpc-test.cc:1859] Sending 1024MB via ssl-enabled unix socket: real 1.114s	user 1.186s	sys 0.828s
I20260928 02:36:27.977831  1547 rpc-test.cc:1859] Sending 1024MB via ssl-enabled unix socket: real 1.112s	user 1.342s	sys 0.676s
W20260928 02:36:27.978400  2001 connection.cc:196] Error closing socket: Network error: TlsSocket::Close: Broken pipe
[       OK ] Parameters/TestRpc.TestPerformanceBySocketType/SSL_UnixSocket (5715 ms)
[----------] 20 tests from Parameters/TestRpc (24511 ms total)

[----------] 1 test from Parameters/TestRpcSocketTxRxQueue
[ RUN      ] Parameters/TestRpcSocketTxRxQueue.AcceptorRxQueueSizeMetric/0
I20260928 02:36:27.984556  2029 acceptor_pool.cc:254] collecting diagnostics on the listening RPC socket 0.0.0.0:33369 every 1 connection(s)
I20260928 02:36:27.984614  2030 acceptor_pool.cc:254] collecting diagnostics on the listening RPC socket 0.0.0.0:33369 every 1 connection(s)
W20260928 02:36:27.985108  2025 negotiation.cc:337] Failed RPC negotiation. Trace:
0928 02:36:27.984987 (+     0us) reactor.cc:625] Submitting negotiation task for server connection from 127.0.0.1:51718 (local address 127.0.0.1:33369)
0928 02:36:27.985028 (+    41us) server_negotiation.cc:206] Beginning negotiation
0928 02:36:27.985030 (+     2us) server_negotiation.cc:399] Waiting for connection header
0928 02:36:27.985083 (+    53us) negotiation.cc:327] Negotiation complete: Network error: Server connection negotiation failed: server connection from 127.0.0.1:51718: BlockingRecv error: recv got EOF from 127.0.0.1:51718 (error 108)
Metrics: {"server-negotiator.queue_time_us":17}
[       OK ] Parameters/TestRpcSocketTxRxQueue.AcceptorRxQueueSizeMetric/0 (7 ms)
[----------] 1 test from Parameters/TestRpcSocketTxRxQueue (7 ms total)

[----------] Global test environment tear-down
[==========] 21 tests from 2 test suites ran. (24518 ms total)
[  PASSED  ] 20 tests.
[  FAILED  ] 1 test, listed below:
[  FAILED  ] Parameters/TestRpc.TestCallWithChainCertAndChainCA/SSL_UnixSocket, where GetParam() = (true, true)

 1 FAILED TEST