Diagnosed failure
Parameters/TestRpc.TestCallWithChainCertAndChainCA/SSL_UnixSocket: /data0/somelongdirectorytoavoidrpathissues/src/kudu/src/kudu/rpc/rpc-test.cc:270: Failure
Failed
Bad status: Runtime error: could not verify certificate chain (error with cert: subject=CN = localhost, ST = sadfjas, C = AS, emailAddress = sdflkdsajf, O = lskdfjlsad, OU = sldfkja, issuer=C = AS, ST = ASDfkjdhf, L = lskdjf, O = saldfja, OU = skdjf, CN = localhost, emailAddress = sadjflkadsj): : certificate has expired
Google Test trace:
/data0/somelongdirectorytoavoidrpathissues/src/kudu/src/kudu/rpc/rpc-test.cc:267: Connecting to unix:/tmp/dist-test-task8TMsSX/test-tmp/rpc-test-356b186f9b254f4eb80a234e4838cfa2.sock
I20260928 14:52:51.043581 19536 test_util.cc:175] -----------------------------------------------
I20260928 14:52:51.043668 19536 test_util.cc:176] Had fatal failures, leaving test files at /tmp/dist-test-task8TMsSX/test-tmp/rpc-test.6.Parameters_TestRpc.TestCallWithChainCertAndChainCA_SSL_UnixSocket.1790607170905958-19536-0
Full log
Note: This is test shard 7 of 8.
[==========] Running 21 tests from 2 test suites.
[----------] Global test environment set-up.
[----------] 20 tests from Parameters/TestRpc
[ RUN ] Parameters/TestRpc.TestMessengerCreateDestroy/SSL_UnixSocket
WARNING: Logging before InitGoogleLogging() is written to STDERR
I20260928 14:52:50.966296 19536 rpc-test.cc:169] started messenger TestCreateDestroy
[ OK ] Parameters/TestRpc.TestMessengerCreateDestroy/SSL_UnixSocket (44 ms)
[ RUN ] Parameters/TestRpc.TestNegotiationDeadlock/SSL_UnixSocket
I20260928 14:52:50.992461 19556 acceptor_pool.cc:254] collecting diagnostics on the listening RPC socket unix:/tmp/dist-test-task8TMsSX/test-tmp/rpc-test-22c4877c86a74653abf9a5ed6cfe0194.sock every 8 connection(s)
I20260928 14:52:50.992748 19557 acceptor_pool.cc:254] collecting diagnostics on the listening RPC socket unix:/tmp/dist-test-task8TMsSX/test-tmp/rpc-test-22c4877c86a74653abf9a5ed6cfe0194.sock every 8 connection(s)
[ OK ] Parameters/TestRpc.TestNegotiationDeadlock/SSL_UnixSocket (42 ms)
[ RUN ] Parameters/TestRpc.TestCallWithChainCertAndChainCA/SSL_UnixSocket
I20260928 14:52:51.031930 19572 acceptor_pool.cc:254] collecting diagnostics on the listening RPC socket unix:/tmp/dist-test-task8TMsSX/test-tmp/rpc-test-356b186f9b254f4eb80a234e4838cfa2.sock every 8 connection(s)
I20260928 14:52:51.032294 19573 acceptor_pool.cc:254] collecting diagnostics on the listening RPC socket unix:/tmp/dist-test-task8TMsSX/test-tmp/rpc-test-356b186f9b254f4eb80a234e4838cfa2.sock every 8 connection(s)
/data0/somelongdirectorytoavoidrpathissues/src/kudu/src/kudu/rpc/rpc-test.cc:270: Failure
Failed
Bad status: Runtime error: could not verify certificate chain (error with cert: subject=CN = localhost, ST = sadfjas, C = AS, emailAddress = sdflkdsajf, O = lskdfjlsad, OU = sldfkja, issuer=C = AS, ST = ASDfkjdhf, L = lskdjf, O = saldfja, OU = skdjf, CN = localhost, emailAddress = sadjflkadsj): : certificate has expired
Google Test trace:
/data0/somelongdirectorytoavoidrpathissues/src/kudu/src/kudu/rpc/rpc-test.cc:267: Connecting to unix:/tmp/dist-test-task8TMsSX/test-tmp/rpc-test-356b186f9b254f4eb80a234e4838cfa2.sock
I20260928 14:52:51.043581 19536 test_util.cc:175] -----------------------------------------------
I20260928 14:52:51.043668 19536 test_util.cc:176] Had fatal failures, leaving test files at /tmp/dist-test-task8TMsSX/test-tmp/rpc-test.6.Parameters_TestRpc.TestCallWithChainCertAndChainCA_SSL_UnixSocket.1790607170905958-19536-0
[ FAILED ] Parameters/TestRpc.TestCallWithChainCertAndChainCA/SSL_UnixSocket, where GetParam() = (true, true) (31 ms)
[ RUN ] Parameters/TestRpc.TestCallWithPasswordProtectedKey/SSL_UnixSocket
I20260928 14:52:51.064883 19597 acceptor_pool.cc:254] collecting diagnostics on the listening RPC socket unix:/tmp/dist-test-task8TMsSX/test-tmp/rpc-test-6d7039c9639247149b4f2edb7dbe1a19.sock every 8 connection(s)
I20260928 14:52:51.065217 19598 acceptor_pool.cc:254] collecting diagnostics on the listening RPC socket unix:/tmp/dist-test-task8TMsSX/test-tmp/rpc-test-6d7039c9639247149b4f2edb7dbe1a19.sock every 8 connection(s)
W20260928 14:52:51.095918 19594 connection.cc:196] Error closing socket: Network error: TlsSocket::Close: Broken pipe
[ OK ] Parameters/TestRpc.TestCallWithPasswordProtectedKey/SSL_UnixSocket (56 ms)
[ RUN ] Parameters/TestRpc.TestCallToBadServer/SSL_UnixSocket
I20260928 14:52:51.112699 19536 rpc-test.cc:394] Status: Network error: Client connection negotiation failed: client connection to 0.0.0.0:0: connect: Connection refused (error 111)
I20260928 14:52:51.113395 19536 rpc-test.cc:394] Status: Network error: Client connection negotiation failed: client connection to 0.0.0.0:0: connect: Connection refused (error 111)
I20260928 14:52:51.113929 19536 rpc-test.cc:394] Status: Network error: Client connection negotiation failed: client connection to 0.0.0.0:0: connect: Connection refused (error 111)
I20260928 14:52:51.114466 19536 rpc-test.cc:394] Status: Network error: Client connection negotiation failed: client connection to 0.0.0.0:0: connect: Connection refused (error 111)
I20260928 14:52:51.114979 19536 rpc-test.cc:394] Status: Network error: Client connection negotiation failed: client connection to 0.0.0.0:0: connect: Connection refused (error 111)
[ OK ] Parameters/TestRpc.TestCallToBadServer/SSL_UnixSocket (16 ms)
[ RUN ] Parameters/TestRpc.TestWrongService/SSL_UnixSocket
I20260928 14:52:51.137110 19632 acceptor_pool.cc:254] collecting diagnostics on the listening RPC socket unix:/tmp/dist-test-task8TMsSX/test-tmp/rpc-test-f7c62aa108bd4b6aaefd76aee49d8116.sock every 8 connection(s)
I20260928 14:52:51.137358 19633 acceptor_pool.cc:254] collecting diagnostics on the listening RPC socket unix:/tmp/dist-test-task8TMsSX/test-tmp/rpc-test-f7c62aa108bd4b6aaefd76aee49d8116.sock every 8 connection(s)
I20260928 14:52:51.152660 19629 messenger.cc:345] service WrongServiceName not registered on TestServer
[ OK ] Parameters/TestRpc.TestWrongService/SSL_UnixSocket (40 ms)
[ RUN ] Parameters/TestRpc.TestConnectionKeepalive/SSL_UnixSocket
I20260928 14:52:51.166199 19655 acceptor_pool.cc:254] collecting diagnostics on the listening RPC socket unix:/tmp/dist-test-task8TMsSX/test-tmp/rpc-test-a63fd69b4898417491374833a76a8980.sock every 8 connection(s)
I20260928 14:52:51.166450 19656 acceptor_pool.cc:254] collecting diagnostics on the listening RPC socket unix:/tmp/dist-test-task8TMsSX/test-tmp/rpc-test-a63fd69b4898417491374833a76a8980.sock every 8 connection(s)
I20260928 14:52:51.167377 19536 rpc-test.cc:488] Connecting to unix:/tmp/dist-test-task8TMsSX/test-tmp/rpc-test-a63fd69b4898417491374833a76a8980.sock
W20260928 14:52:51.660645 19668 connection.cc:196] Error closing socket: Network error: TlsSocket::Close: Broken pipe
[ OK ] Parameters/TestRpc.TestConnectionKeepalive/SSL_UnixSocket (1047 ms)
[ RUN ] Parameters/TestRpc.TestClientConnectionMetrics/SSL_UnixSocket
I20260928 14:52:52.222433 19680 acceptor_pool.cc:254] collecting diagnostics on the listening RPC socket unix:/tmp/dist-test-task8TMsSX/test-tmp/rpc-test-8e5397d44e4b4508b504502af6fd3379.sock every 8 connection(s)
I20260928 14:52:52.222728 19681 acceptor_pool.cc:254] collecting diagnostics on the listening RPC socket unix:/tmp/dist-test-task8TMsSX/test-tmp/rpc-test-8e5397d44e4b4508b504502af6fd3379.sock every 8 connection(s)
I20260928 14:52:52.223740 19536 rpc-test.cc:569] Connecting to unix:/tmp/dist-test-task8TMsSX/test-tmp/rpc-test-8e5397d44e4b4508b504502af6fd3379.sock
W20260928 14:53:13.848289 19677 connection.cc:196] Error closing socket: Network error: TlsSocket::Close: Broken pipe
[ OK ] Parameters/TestRpc.TestClientConnectionMetrics/SSL_UnixSocket (21649 ms)
[ RUN ] Parameters/TestRpc.TestCredentialsPolicy/SSL_UnixSocket
I20260928 14:53:13.864506 19703 acceptor_pool.cc:254] collecting diagnostics on the listening RPC socket unix:/tmp/dist-test-task8TMsSX/test-tmp/rpc-test-729f2e58864f4699a6be567b655ed420.sock every 8 connection(s)
I20260928 14:53:13.864750 19704 acceptor_pool.cc:254] collecting diagnostics on the listening RPC socket unix:/tmp/dist-test-task8TMsSX/test-tmp/rpc-test-729f2e58864f4699a6be567b655ed420.sock every 8 connection(s)
I20260928 14:53:13.865706 19536 rpc-test.cc:700] Connecting to unix:/tmp/dist-test-task8TMsSX/test-tmp/rpc-test-729f2e58864f4699a6be567b655ed420.sock
W20260928 14:53:13.893379 19702 connection.cc:196] Error closing socket: Network error: TlsSocket::Close: Broken pipe
W20260928 14:53:13.901409 19702 connection.cc:196] Error closing socket: Network error: TlsSocket::Close: Broken pipe
[ OK ] Parameters/TestRpc.TestCredentialsPolicy/SSL_UnixSocket (49 ms)
[ RUN ] Parameters/TestRpc.TestCallLongerThanKeepalive/SSL_UnixSocket
I20260928 14:53:13.919605 19728 acceptor_pool.cc:254] collecting diagnostics on the listening RPC socket unix:/tmp/dist-test-task8TMsSX/test-tmp/rpc-test-e3ef6f212d6f4a95b0300fe4b489a819.sock every 8 connection(s)
I20260928 14:53:13.919819 19729 acceptor_pool.cc:254] collecting diagnostics on the listening RPC socket unix:/tmp/dist-test-task8TMsSX/test-tmp/rpc-test-e3ef6f212d6f4a95b0300fe4b489a819.sock every 8 connection(s)
I20260928 14:53:13.941921 19732 rpc-test-base.h:222] got call: sleep_micros: 3000000 deferred: true
I20260928 14:53:16.943699 19732 rpcz_store.cc:275] Call kudu.rpc.GenericCalculatorService.Sleep from unix:<unnamed> (request call id 0) took 3001 ms. Trace:
I20260928 14:53:16.943862 19732 rpcz_store.cc:276] 0928 14:53:13.941816 (+ 0us) service_pool.cc:170] Inserting onto call queue
0928 14:53:13.941876 (+ 60us) service_pool.cc:227] Handling call
0928 14:53:16.943606 (+3001730us) inbound_call.cc:173] Queueing success response
Metrics: {}
[ OK ] Parameters/TestRpc.TestCallLongerThanKeepalive/SSL_UnixSocket (3045 ms)
[ RUN ] Parameters/TestRpc.TestRpcSidecar/SSL_UnixSocket
I20260928 14:53:16.978382 19753 acceptor_pool.cc:254] collecting diagnostics on the listening RPC socket unix:/tmp/dist-test-task8TMsSX/test-tmp/rpc-test-0da18eefafb147ed8b566addec1a8f8d.sock every 8 connection(s)
I20260928 14:53:16.978636 19754 acceptor_pool.cc:254] collecting diagnostics on the listening RPC socket unix:/tmp/dist-test-task8TMsSX/test-tmp/rpc-test-0da18eefafb147ed8b566addec1a8f8d.sock every 8 connection(s)
W20260928 14:53:17.073396 19750 connection.cc:196] Error closing socket: Network error: TlsSocket::Close: Broken pipe
[ OK ] Parameters/TestRpc.TestRpcSidecar/SSL_UnixSocket (126 ms)
[ RUN ] Parameters/TestRpc.TestRpcSidecarLimits/SSL_UnixSocket
I20260928 14:53:19.524718 19778 acceptor_pool.cc:254] collecting diagnostics on the listening RPC socket unix:/tmp/dist-test-task8TMsSX/test-tmp/rpc-test-5bc9b9d4d9024ed083f38f44da2a47e1.sock every 8 connection(s)
I20260928 14:53:19.524998 19779 acceptor_pool.cc:254] collecting diagnostics on the listening RPC socket unix:/tmp/dist-test-task8TMsSX/test-tmp/rpc-test-5bc9b9d4d9024ed083f38f44da2a47e1.sock every 8 connection(s)
W20260928 14:53:19.547166 19536 serialization.cc:72] Serialized kudu.rpc_test.PushStringsRequestPB (2147483654 bytes) is larger than the maximum configured RPC message size (52428800 bytes). Sending anyway, but peer may reject the data.
W20260928 14:53:19.553447 19775 connection.cc:535] server connection from unix:<unnamed> recv error: Network error: RPC frame had a length of 2147483714, but we only support messages up to 52428800 bytes long.
W20260928 14:53:19.553558 19775 connection.cc:158] shutting down server connection from unix:<unnamed> with pending inbound data: 4/2147483714 bytes received; last active 0 ns ago: status Network error: RPC frame had a length of 2147483714, but we only support messages up to 52428800 bytes long.
W20260928 14:53:19.554127 19791 connection.cc:196] Error closing socket: Network error: TlsSocket::Close: Broken pipe
I20260928 14:53:19.567582 19803 acceptor_pool.cc:254] collecting diagnostics on the listening RPC socket unix:/tmp/dist-test-task8TMsSX/test-tmp/rpc-test-5bc9b9d4d9024ed083f38f44da2a47e1.sock every 8 connection(s)
I20260928 14:53:19.567843 19804 acceptor_pool.cc:254] collecting diagnostics on the listening RPC socket unix:/tmp/dist-test-task8TMsSX/test-tmp/rpc-test-5bc9b9d4d9024ed083f38f44da2a47e1.sock every 8 connection(s)
W20260928 14:53:27.455062 19800 connection.cc:577] server connection from unix:<unnamed>: received bad data: 'Corruption: Invalid packet: message had a length of 2147483710, but we only support messages up to 2147483647 bytes
'
W20260928 14:53:27.455900 19816 connection.cc:196] Error closing socket: Network error: TlsSocket::Close: Broken pipe
[ OK ] Parameters/TestRpc.TestRpcSidecarLimits/SSL_UnixSocket (10873 ms)
[ RUN ] Parameters/TestRpc.TestCallTimeoutDoesntAffectNegotiation/SSL_UnixSocket
I20260928 14:53:27.963761 19828 acceptor_pool.cc:254] collecting diagnostics on the listening RPC socket unix:/tmp/dist-test-task8TMsSX/test-tmp/rpc-test-b0af7437c4df4187b691b2d017ec6431.sock every 8 connection(s)
I20260928 14:53:27.964030 19829 acceptor_pool.cc:254] collecting diagnostics on the listening RPC socket unix:/tmp/dist-test-task8TMsSX/test-tmp/rpc-test-b0af7437c4df4187b691b2d017ec6431.sock every 8 connection(s)
W20260928 14:53:27.978291 19824 negotiation.cc:266] Injecting 500ms delay in negotiation
I20260928 14:53:28.028855 19536 rpc-test-base.h:595] status: Timed out: connection negotiation to unix:/tmp/dist-test-task8TMsSX/test-tmp/rpc-test-b0af7437c4df4187b691b2d017ec6431.sock for RPC Sleep timed out after 0.050s (ON_OUTBOUND_QUEUE), seconds elapsed: 0.0510553
[ OK ] Parameters/TestRpc.TestCallTimeoutDoesntAffectNegotiation/SSL_UnixSocket (543 ms)
[ RUN ] Parameters/TestRpc.TestRpcHandlerLatencyMetric/SSL_UnixSocket
I20260928 14:53:28.508692 19853 acceptor_pool.cc:254] collecting diagnostics on the listening RPC socket unix:/tmp/dist-test-task8TMsSX/test-tmp/rpc-test-016f69e149b3458fbaef4b5bb199a4d5.sock every 8 connection(s)
I20260928 14:53:28.508980 19854 acceptor_pool.cc:254] collecting diagnostics on the listening RPC socket unix:/tmp/dist-test-task8TMsSX/test-tmp/rpc-test-016f69e149b3458fbaef4b5bb199a4d5.sock every 8 connection(s)
I20260928 14:53:28.554864 19536 rpc-test.cc:1236] Sleep() min lat: 20603
I20260928 14:53:28.554965 19536 rpc-test.cc:1237] Sleep() mean lat: 20603
I20260928 14:53:28.555006 19536 rpc-test.cc:1238] Sleep() max lat: 20603
I20260928 14:53:28.555034 19536 rpc-test.cc:1239] Sleep() #calls: 1
[ OK ] Parameters/TestRpc.TestRpcHandlerLatencyMetric/SSL_UnixSocket (66 ms)
[ RUN ] Parameters/TestRpc.TimedOutOnResponseMetricServiceQueue/SSL_UnixSocket
I20260928 14:53:28.587661 19879 acceptor_pool.cc:254] collecting diagnostics on the listening RPC socket unix:/tmp/dist-test-task8TMsSX/test-tmp/rpc-test-ac0d28150da74ea2aebaf8d3dba8e746.sock every 8 connection(s)
I20260928 14:53:28.587968 19880 acceptor_pool.cc:254] collecting diagnostics on the listening RPC socket unix:/tmp/dist-test-task8TMsSX/test-tmp/rpc-test-ac0d28150da74ea2aebaf8d3dba8e746.sock every 8 connection(s)
W20260928 14:53:28.653978 19881 rpcz_store.cc:267] Call kudu.rpc_test.CalculatorService.Sleep from unix:<unnamed> (request call id 2) took 20 ms (client timeout 20 ms). Trace:
W20260928 14:53:28.654116 19881 rpcz_store.cc:269] 0928 14:53:28.633540 (+ 0us) service_pool.cc:170] Inserting onto call queue
0928 14:53:28.653889 (+ 20349us) service_pool.cc:214] Skipping call since client already timed out
0928 14:53:28.653941 (+ 52us) inbound_call.cc:173] Queueing failure response
Metrics: {}
[ OK ] Parameters/TestRpc.TimedOutOnResponseMetricServiceQueue/SSL_UnixSocket (98 ms)
[ RUN ] Parameters/TestRpc.RpcPendingConnectionsMetric/SSL_UnixSocket
I20260928 14:53:28.662964 19902 acceptor_pool.cc:254] collecting diagnostics on the listening RPC socket 0.0.0.0:42779 every 8 connection(s)
I20260928 14:53:28.663184 19903 acceptor_pool.cc:254] collecting diagnostics on the listening RPC socket 0.0.0.0:42779 every 8 connection(s)
W20260928 14:53:28.665220 19898 negotiation.cc:337] Failed RPC negotiation. Trace:
0928 14:53:28.664531 (+ 0us) reactor.cc:625] Submitting negotiation task for server connection from 127.0.0.1:49386 (local address 127.0.0.1:42779)
0928 14:53:28.664700 (+ 169us) server_negotiation.cc:206] Beginning negotiation
0928 14:53:28.664704 (+ 4us) server_negotiation.cc:399] Waiting for connection header
0928 14:53:28.664841 (+ 137us) negotiation.cc:327] Negotiation complete: Network error: Server connection negotiation failed: server connection from 127.0.0.1:49386: BlockingRecv error: recv got EOF from 127.0.0.1:49386 (error 108)
Metrics: {"server-negotiator.queue_time_us":53}
[ OK ] Parameters/TestRpc.RpcPendingConnectionsMetric/SSL_UnixSocket (19 ms)
[ RUN ] Parameters/TestRpc.TestRpcContextClientDeadline/SSL_UnixSocket
I20260928 14:53:28.697163 19918 acceptor_pool.cc:254] collecting diagnostics on the listening RPC socket unix:/tmp/dist-test-task8TMsSX/test-tmp/rpc-test-0c93016ae6a8451bb7ce7969ac52f020.sock every 8 connection(s)
I20260928 14:53:28.697392 19919 acceptor_pool.cc:254] collecting diagnostics on the listening RPC socket unix:/tmp/dist-test-task8TMsSX/test-tmp/rpc-test-0c93016ae6a8451bb7ce7969ac52f020.sock every 8 connection(s)
[ OK ] Parameters/TestRpc.TestRpcContextClientDeadline/SSL_UnixSocket (60 ms)
[ RUN ] Parameters/TestRpc.TestApplicationFeatureFlagUnsupportedServer/SSL_UnixSocket
I20260928 14:53:28.751093 19943 acceptor_pool.cc:254] collecting diagnostics on the listening RPC socket unix:/tmp/dist-test-task8TMsSX/test-tmp/rpc-test-455bdd533679462bb1b98b1c5db4fd7e.sock every 8 connection(s)
I20260928 14:53:28.751322 19944 acceptor_pool.cc:254] collecting diagnostics on the listening RPC socket unix:/tmp/dist-test-task8TMsSX/test-tmp/rpc-test-455bdd533679462bb1b98b1c5db4fd7e.sock every 8 connection(s)
[ OK ] Parameters/TestRpc.TestApplicationFeatureFlagUnsupportedServer/SSL_UnixSocket (45 ms)
[ RUN ] Parameters/TestRpc.TestCancellationAsync/SSL_UnixSocket
I20260928 14:53:28.793630 19968 acceptor_pool.cc:254] collecting diagnostics on the listening RPC socket unix:/tmp/dist-test-task8TMsSX/test-tmp/rpc-test-16f863592abc42e0b459277de8be6832.sock every 8 connection(s)
I20260928 14:53:28.793849 19969 acceptor_pool.cc:254] collecting diagnostics on the listening RPC socket unix:/tmp/dist-test-task8TMsSX/test-tmp/rpc-test-16f863592abc42e0b459277de8be6832.sock every 8 connection(s)
I20260928 14:53:28.794860 19536 rpc-test.cc:1716] Connecting to unix:/tmp/dist-test-task8TMsSX/test-tmp/rpc-test-16f863592abc42e0b459277de8be6832.sock
I20260928 14:53:28.815075 19536 test_util.cc:268] Using random seed: 983374287
I20260928 14:53:28.861384 19972 rpc-test-base.h:240] got call: sleep_micros: 500 pattern: 4294967295 num_repetitions: 2097152 sidecar_idx: 0
I20260928 14:53:28.894867 19972 rpc-test-base.h:240] got call: sleep_micros: 500 pattern: 4294967295 num_repetitions: 2097152 sidecar_idx: 0
I20260928 14:53:28.928174 19972 rpc-test-base.h:240] got call: sleep_micros: 500 pattern: 4294967295 num_repetitions: 2097152 sidecar_idx: 0
I20260928 14:53:28.960960 19972 rpc-test-base.h:240] got call: sleep_micros: 500 pattern: 4294967295 num_repetitions: 2097152 sidecar_idx: 0
I20260928 14:53:28.994123 19972 rpc-test-base.h:240] got call: sleep_micros: 500 pattern: 4294967295 num_repetitions: 2097152 sidecar_idx: 0
I20260928 14:53:29.027304 19972 rpc-test-base.h:240] got call: sleep_micros: 500 pattern: 4294967295 num_repetitions: 2097152 sidecar_idx: 0
I20260928 14:53:29.050500 19971 rpc-test-base.h:240] got call: sleep_micros: 500 pattern: 4294967295 num_repetitions: 2097152 sidecar_idx: 0
W20260928 14:53:29.057006 19965 connection.cc:196] Error closing socket: Network error: TlsSocket::Close: Broken pipe
W20260928 14:53:29.066854 19965 connection.cc:441] server connection from unix:<unnamed> torn down before Call kudu.rpc.GenericCalculatorService.SleepWithSidecar from unix:<unnamed> (request call id 8) could send its response
W20260928 14:53:29.084654 19965 connection.cc:441] server connection from unix:<unnamed> torn down before Call kudu.rpc.GenericCalculatorService.SleepWithSidecar from unix:<unnamed> (request call id 9) could send its response
[ OK ] Parameters/TestRpc.TestCancellationAsync/SSL_UnixSocket (304 ms)
[ RUN ] Parameters/TestRpc.TestPerformanceBySocketType/SSL_UnixSocket
I20260928 14:53:29.101051 19993 acceptor_pool.cc:254] collecting diagnostics on the listening RPC socket unix:/tmp/dist-test-task8TMsSX/test-tmp/rpc-test-2379ac4064ae4264a30722aaac21504b.sock every 8 connection(s)
I20260928 14:53:29.101310 19994 acceptor_pool.cc:254] collecting diagnostics on the listening RPC socket unix:/tmp/dist-test-task8TMsSX/test-tmp/rpc-test-2379ac4064ae4264a30722aaac21504b.sock every 8 connection(s)
I20260928 14:53:29.102232 19536 rpc-test.cc:1846] Connecting to unix:/tmp/dist-test-task8TMsSX/test-tmp/rpc-test-2379ac4064ae4264a30722aaac21504b.sock
I20260928 14:53:32.285946 19536 rpc-test.cc:1859] Sending 1024MB via ssl-enabled unix socket: real 3.173s user 3.165s sys 2.186s
I20260928 14:53:35.521121 19536 rpc-test.cc:1859] Sending 1024MB via ssl-enabled unix socket: real 3.235s user 3.158s sys 2.337s
I20260928 14:53:38.767084 19536 rpc-test.cc:1859] Sending 1024MB via ssl-enabled unix socket: real 3.246s user 3.250s sys 2.269s
I20260928 14:53:42.021458 19536 rpc-test.cc:1859] Sending 1024MB via ssl-enabled unix socket: real 3.254s user 3.176s sys 2.330s
I20260928 14:53:45.233744 19536 rpc-test.cc:1859] Sending 1024MB via ssl-enabled unix socket: real 3.212s user 3.123s sys 2.319s
W20260928 14:53:45.234795 19990 connection.cc:196] Error closing socket: Network error: TlsSocket::Close: Broken pipe
[ OK ] Parameters/TestRpc.TestPerformanceBySocketType/SSL_UnixSocket (16154 ms)
[----------] 20 tests from Parameters/TestRpc (54317 ms total)
[----------] 1 test from Parameters/TestRpcSocketTxRxQueue
[ RUN ] Parameters/TestRpcSocketTxRxQueue.AcceptorRxQueueSizeMetric/0
I20260928 14:53:45.247608 20018 acceptor_pool.cc:254] collecting diagnostics on the listening RPC socket 0.0.0.0:35105 every 1 connection(s)
I20260928 14:53:45.247911 20019 acceptor_pool.cc:254] collecting diagnostics on the listening RPC socket 0.0.0.0:35105 every 1 connection(s)
W20260928 14:53:45.249694 20014 negotiation.cc:337] Failed RPC negotiation. Trace:
0928 14:53:45.249309 (+ 0us) reactor.cc:625] Submitting negotiation task for server connection from 127.0.0.1:50062 (local address 127.0.0.1:35105)
0928 14:53:45.249458 (+ 149us) server_negotiation.cc:206] Beginning negotiation
0928 14:53:45.249462 (+ 4us) server_negotiation.cc:399] Waiting for connection header
0928 14:53:45.249582 (+ 120us) negotiation.cc:327] Negotiation complete: Network error: Server connection negotiation failed: server connection from 127.0.0.1:50062: BlockingRecv error: recv got EOF from 127.0.0.1:50062 (error 108)
Metrics: {"server-negotiator.queue_time_us":51}
[ OK ] Parameters/TestRpcSocketTxRxQueue.AcceptorRxQueueSizeMetric/0 (10 ms)
[----------] 1 test from Parameters/TestRpcSocketTxRxQueue (10 ms total)
[----------] Global test environment tear-down
[==========] 21 tests from 2 test suites ran. (54328 ms total)
[ PASSED ] 20 tests.
[ FAILED ] 1 test, listed below:
[ FAILED ] Parameters/TestRpc.TestCallWithChainCertAndChainCA/SSL_UnixSocket, where GetParam() = (true, true)
1 FAILED TEST