Diagnosed failure

Parameters/TestRpc.TestCallWithChainCertAndChainCA/SSL_TCP: /data0/somelongdirectorytoavoidrpathissues/src/kudu/src/kudu/rpc/rpc-test.cc:270: Failure
Failed
Bad status: Runtime error: could not verify certificate chain (error with cert: subject=CN = localhost, ST = sadfjas, C = AS, emailAddress = sdflkdsajf, O = lskdfjlsad, OU = sldfkja, issuer=C = AS, ST = ASDfkjdhf, L = lskdjf, O = saldfja, OU = skdjf, CN = localhost, emailAddress = sadjflkadsj): : certificate has expired
Google Test trace:
/data0/somelongdirectorytoavoidrpathissues/src/kudu/src/kudu/rpc/rpc-test.cc:267: Connecting to 0.0.0.0:45121
I20260925 06:06:47.604040   379 test_util.cc:175] -----------------------------------------------
I20260925 06:06:47.604123   379 test_util.cc:176] Had fatal failures, leaving test files at /tmp/dist-test-task1Ts_CS/test-tmp/rpc-test.5.Parameters_TestRpc.TestCallWithChainCertAndChainCA_SSL_TCP.1790316407484606-379-0

Full log

Note: This is test shard 6 of 8.
[==========] Running 21 tests from 2 test suites.
[----------] Global test environment set-up.
[----------] 20 tests from Parameters/TestRpc
[ RUN      ] Parameters/TestRpc.TestMessengerCreateDestroy/SSL_TCP
WARNING: Logging before InitGoogleLogging() is written to STDERR
I20260925 06:06:47.526182   379 rpc-test.cc:169] started messenger TestCreateDestroy
[       OK ] Parameters/TestRpc.TestMessengerCreateDestroy/SSL_TCP (25 ms)
[ RUN      ] Parameters/TestRpc.TestNegotiationDeadlock/SSL_TCP
I20260925 06:06:47.542349   399 acceptor_pool.cc:254] collecting diagnostics on the listening RPC socket 0.0.0.0:37573 every 8 connection(s)
I20260925 06:06:47.542686   400 acceptor_pool.cc:254] collecting diagnostics on the listening RPC socket 0.0.0.0:37573 every 8 connection(s)
[       OK ] Parameters/TestRpc.TestNegotiationDeadlock/SSL_TCP (31 ms)
[ RUN      ] Parameters/TestRpc.TestCallWithChainCertAndChainCA/SSL_TCP
I20260925 06:06:47.589047   415 acceptor_pool.cc:254] collecting diagnostics on the listening RPC socket 0.0.0.0:45121 every 8 connection(s)
I20260925 06:06:47.589360   416 acceptor_pool.cc:254] collecting diagnostics on the listening RPC socket 0.0.0.0:45121 every 8 connection(s)
/data0/somelongdirectorytoavoidrpathissues/src/kudu/src/kudu/rpc/rpc-test.cc:270: Failure
Failed
Bad status: Runtime error: could not verify certificate chain (error with cert: subject=CN = localhost, ST = sadfjas, C = AS, emailAddress = sdflkdsajf, O = lskdfjlsad, OU = sldfkja, issuer=C = AS, ST = ASDfkjdhf, L = lskdjf, O = saldfja, OU = skdjf, CN = localhost, emailAddress = sadjflkadsj): : certificate has expired
Google Test trace:
/data0/somelongdirectorytoavoidrpathissues/src/kudu/src/kudu/rpc/rpc-test.cc:267: Connecting to 0.0.0.0:45121
I20260925 06:06:47.604040   379 test_util.cc:175] -----------------------------------------------
I20260925 06:06:47.604123   379 test_util.cc:176] Had fatal failures, leaving test files at /tmp/dist-test-task1Ts_CS/test-tmp/rpc-test.5.Parameters_TestRpc.TestCallWithChainCertAndChainCA_SSL_TCP.1790316407484606-379-0
[  FAILED  ] Parameters/TestRpc.TestCallWithChainCertAndChainCA/SSL_TCP, where GetParam() = (true, false) (43 ms)
[ RUN      ] Parameters/TestRpc.TestCallWithPasswordProtectedKey/SSL_TCP
I20260925 06:06:47.638588   440 acceptor_pool.cc:254] collecting diagnostics on the listening RPC socket 0.0.0.0:45845 every 8 connection(s)
I20260925 06:06:47.638841   441 acceptor_pool.cc:254] collecting diagnostics on the listening RPC socket 0.0.0.0:45845 every 8 connection(s)
[       OK ] Parameters/TestRpc.TestCallWithPasswordProtectedKey/SSL_TCP (68 ms)
[ RUN      ] Parameters/TestRpc.TestCallToBadServer/SSL_TCP
I20260925 06:06:47.688187   379 rpc-test.cc:394] Status: Network error: Client connection negotiation failed: client connection to 0.0.0.0:0: connect: Connection refused (error 111)
I20260925 06:06:47.688828   379 rpc-test.cc:394] Status: Network error: Client connection negotiation failed: client connection to 0.0.0.0:0: connect: Connection refused (error 111)
I20260925 06:06:47.689409   379 rpc-test.cc:394] Status: Network error: Client connection negotiation failed: client connection to 0.0.0.0:0: connect: Connection refused (error 111)
I20260925 06:06:47.689955   379 rpc-test.cc:394] Status: Network error: Client connection negotiation failed: client connection to 0.0.0.0:0: connect: Connection refused (error 111)
I20260925 06:06:47.690452   379 rpc-test.cc:394] Status: Network error: Client connection negotiation failed: client connection to 0.0.0.0:0: connect: Connection refused (error 111)
[       OK ] Parameters/TestRpc.TestCallToBadServer/SSL_TCP (19 ms)
[ RUN      ] Parameters/TestRpc.TestWrongService/SSL_TCP
I20260925 06:06:47.701231   475 acceptor_pool.cc:254] collecting diagnostics on the listening RPC socket 0.0.0.0:37925 every 8 connection(s)
I20260925 06:06:47.701510   476 acceptor_pool.cc:254] collecting diagnostics on the listening RPC socket 0.0.0.0:37925 every 8 connection(s)
I20260925 06:06:47.719902   472 messenger.cc:345] service WrongServiceName not registered on TestServer
[       OK ] Parameters/TestRpc.TestWrongService/SSL_TCP (32 ms)
[ RUN      ] Parameters/TestRpc.TestConnectionKeepalive/SSL_TCP
I20260925 06:06:47.750383   498 acceptor_pool.cc:254] collecting diagnostics on the listening RPC socket 0.0.0.0:37403 every 8 connection(s)
I20260925 06:06:47.750661   499 acceptor_pool.cc:254] collecting diagnostics on the listening RPC socket 0.0.0.0:37403 every 8 connection(s)
I20260925 06:06:47.751477   379 rpc-test.cc:488] Connecting to 0.0.0.0:37403
[       OK ] Parameters/TestRpc.TestConnectionKeepalive/SSL_TCP (1076 ms)
[ RUN      ] Parameters/TestRpc.TestClientConnectionMetrics/SSL_TCP
I20260925 06:06:48.824786   523 acceptor_pool.cc:254] collecting diagnostics on the listening RPC socket 0.0.0.0:46293 every 8 connection(s)
I20260925 06:06:48.825062   524 acceptor_pool.cc:254] collecting diagnostics on the listening RPC socket 0.0.0.0:46293 every 8 connection(s)
I20260925 06:06:48.826071   379 rpc-test.cc:569] Connecting to 0.0.0.0:46293
[       OK ] Parameters/TestRpc.TestClientConnectionMetrics/SSL_TCP (19501 ms)
[ RUN      ] Parameters/TestRpc.TestCredentialsPolicy/SSL_TCP
I20260925 06:07:08.313235   546 acceptor_pool.cc:254] collecting diagnostics on the listening RPC socket 0.0.0.0:41091 every 8 connection(s)
I20260925 06:07:08.313485   547 acceptor_pool.cc:254] collecting diagnostics on the listening RPC socket 0.0.0.0:41091 every 8 connection(s)
I20260925 06:07:08.314394   379 rpc-test.cc:700] Connecting to 0.0.0.0:41091
[       OK ] Parameters/TestRpc.TestCredentialsPolicy/SSL_TCP (43 ms)
[ RUN      ] Parameters/TestRpc.TestCallLongerThanKeepalive/SSL_TCP
I20260925 06:07:08.371454   571 acceptor_pool.cc:254] collecting diagnostics on the listening RPC socket 0.0.0.0:43645 every 8 connection(s)
I20260925 06:07:08.371708   572 acceptor_pool.cc:254] collecting diagnostics on the listening RPC socket 0.0.0.0:43645 every 8 connection(s)
I20260925 06:07:08.405097   575 rpc-test-base.h:222] got call: sleep_micros: 3000000 deferred: true
I20260925 06:07:11.406817   575 rpcz_store.cc:275] Call kudu.rpc.GenericCalculatorService.Sleep from 127.0.0.1:42516 (request call id 0) took 3001 ms. Trace:
I20260925 06:07:11.406975   575 rpcz_store.cc:276] 0925 06:07:08.404998 (+     0us) service_pool.cc:170] Inserting onto call queue
0925 06:07:08.405055 (+    57us) service_pool.cc:227] Handling call
0925 06:07:11.406773 (+3001718us) inbound_call.cc:173] Queueing success response
Metrics: {}
[       OK ] Parameters/TestRpc.TestCallLongerThanKeepalive/SSL_TCP (3067 ms)
[ RUN      ] Parameters/TestRpc.TestRpcSidecar/SSL_TCP
I20260925 06:07:11.425769   596 acceptor_pool.cc:254] collecting diagnostics on the listening RPC socket 0.0.0.0:37005 every 8 connection(s)
I20260925 06:07:11.425997   597 acceptor_pool.cc:254] collecting diagnostics on the listening RPC socket 0.0.0.0:37005 every 8 connection(s)
[       OK ] Parameters/TestRpc.TestRpcSidecar/SSL_TCP (115 ms)
[ RUN      ] Parameters/TestRpc.TestRpcSidecarLimits/SSL_TCP
I20260925 06:07:13.648478   621 acceptor_pool.cc:254] collecting diagnostics on the listening RPC socket 0.0.0.0:45831 every 8 connection(s)
I20260925 06:07:13.648748   622 acceptor_pool.cc:254] collecting diagnostics on the listening RPC socket 0.0.0.0:45831 every 8 connection(s)
W20260925 06:07:13.674422   379 serialization.cc:72] Serialized kudu.rpc_test.PushStringsRequestPB (2147483654 bytes) is larger than the maximum configured RPC message size (52428800 bytes). Sending anyway, but peer may reject the data.
W20260925 06:07:13.680624   618 connection.cc:535] server connection from 127.0.0.1:60712 recv error: Network error: RPC frame had a length of 2147483714, but we only support messages up to 52428800 bytes long.
W20260925 06:07:13.680766   618 connection.cc:158] shutting down server connection from 127.0.0.1:60712 with pending inbound data: 4/2147483714 bytes received; last active 0 ns ago: status Network error: RPC frame had a length of 2147483714, but we only support messages up to 52428800 bytes long.
W20260925 06:07:13.681269   634 connection.cc:196] Error closing socket: Network error: TlsSocket::Close: Connection reset by peer
I20260925 06:07:13.695057   646 acceptor_pool.cc:254] collecting diagnostics on the listening RPC socket 0.0.0.0:44443 every 8 connection(s)
I20260925 06:07:13.695266   647 acceptor_pool.cc:254] collecting diagnostics on the listening RPC socket 0.0.0.0:44443 every 8 connection(s)
W20260925 06:07:18.814289   645 connection.cc:577] server connection from 127.0.0.1:34948: received bad data: 'Corruption: Invalid packet: message had a length of 2147483710, but we only support messages up to 2147483647 bytes
'
[       OK ] Parameters/TestRpc.TestRpcSidecarLimits/SSL_TCP (7755 ms)
[ RUN      ] Parameters/TestRpc.TestCallTimeoutDoesntAffectNegotiation/SSL_TCP
I20260925 06:07:19.312511   671 acceptor_pool.cc:254] collecting diagnostics on the listening RPC socket 0.0.0.0:39593 every 8 connection(s)
I20260925 06:07:19.312855   672 acceptor_pool.cc:254] collecting diagnostics on the listening RPC socket 0.0.0.0:39593 every 8 connection(s)
W20260925 06:07:19.361707   667 negotiation.cc:266] Injecting 500ms delay in negotiation
I20260925 06:07:19.412184   379 rpc-test-base.h:595] status: Timed out: connection negotiation to 0.0.0.0:39593 for RPC Sleep timed out after 0.050s (ON_OUTBOUND_QUEUE), seconds elapsed: 0.0511009
[       OK ] Parameters/TestRpc.TestCallTimeoutDoesntAffectNegotiation/SSL_TCP (588 ms)
[ RUN      ] Parameters/TestRpc.TestRpcHandlerLatencyMetric/SSL_TCP
I20260925 06:07:19.908985   696 acceptor_pool.cc:254] collecting diagnostics on the listening RPC socket 0.0.0.0:37095 every 8 connection(s)
I20260925 06:07:19.909204   697 acceptor_pool.cc:254] collecting diagnostics on the listening RPC socket 0.0.0.0:37095 every 8 connection(s)
I20260925 06:07:19.950858   379 rpc-test.cc:1236] Sleep() min lat: 20596
I20260925 06:07:19.950958   379 rpc-test.cc:1237] Sleep() mean lat: 20596
I20260925 06:07:19.951013   379 rpc-test.cc:1238] Sleep() max lat: 20596
I20260925 06:07:19.951048   379 rpc-test.cc:1239] Sleep() #calls: 1
[       OK ] Parameters/TestRpc.TestRpcHandlerLatencyMetric/SSL_TCP (83 ms)
[ RUN      ] Parameters/TestRpc.TimedOutOnResponseMetricServiceQueue/SSL_TCP
I20260925 06:07:19.966464   722 acceptor_pool.cc:254] collecting diagnostics on the listening RPC socket 0.0.0.0:44989 every 8 connection(s)
I20260925 06:07:19.966717   723 acceptor_pool.cc:254] collecting diagnostics on the listening RPC socket 0.0.0.0:44989 every 8 connection(s)
W20260925 06:07:20.042307   724 rpcz_store.cc:267] Call kudu.rpc_test.CalculatorService.Sleep from 127.0.0.1:55720 (request call id 2) took 20 ms (client timeout 20 ms). Trace:
W20260925 06:07:20.042469   724 rpcz_store.cc:269] 0925 06:07:20.021778 (+     0us) service_pool.cc:170] Inserting onto call queue
0925 06:07:20.042166 (+ 20388us) service_pool.cc:214] Skipping call since client already timed out
0925 06:07:20.042241 (+    75us) inbound_call.cc:173] Queueing failure response
Metrics: {}
[       OK ] Parameters/TestRpc.TimedOutOnResponseMetricServiceQueue/SSL_TCP (91 ms)
[ RUN      ] Parameters/TestRpc.RpcPendingConnectionsMetric/SSL_TCP
I20260925 06:07:20.051745   745 acceptor_pool.cc:254] collecting diagnostics on the listening RPC socket 0.0.0.0:33431 every 8 connection(s)
I20260925 06:07:20.052016   746 acceptor_pool.cc:254] collecting diagnostics on the listening RPC socket 0.0.0.0:33431 every 8 connection(s)
W20260925 06:07:20.063023   741 negotiation.cc:337] Failed RPC negotiation. Trace:
0925 06:07:20.062182 (+     0us) reactor.cc:625] Submitting negotiation task for server connection from 127.0.0.1:46810 (local address 127.0.0.1:33431)
0925 06:07:20.062386 (+   204us) server_negotiation.cc:206] Beginning negotiation
0925 06:07:20.062394 (+     8us) server_negotiation.cc:399] Waiting for connection header
0925 06:07:20.062578 (+   184us) negotiation.cc:327] Negotiation complete: Network error: Server connection negotiation failed: server connection from 127.0.0.1:46810: BlockingRecv error: recv got EOF from 127.0.0.1:46810 (error 108)
Metrics: {"server-negotiator.queue_time_us":47}
[       OK ] Parameters/TestRpc.RpcPendingConnectionsMetric/SSL_TCP (28 ms)
[ RUN      ] Parameters/TestRpc.TestRpcContextClientDeadline/SSL_TCP
I20260925 06:07:20.086876   761 acceptor_pool.cc:254] collecting diagnostics on the listening RPC socket 0.0.0.0:39495 every 8 connection(s)
I20260925 06:07:20.087116   762 acceptor_pool.cc:254] collecting diagnostics on the listening RPC socket 0.0.0.0:39495 every 8 connection(s)
[       OK ] Parameters/TestRpc.TestRpcContextClientDeadline/SSL_TCP (64 ms)
[ RUN      ] Parameters/TestRpc.TestApplicationFeatureFlagUnsupportedServer/SSL_TCP
I20260925 06:07:20.150897   786 acceptor_pool.cc:254] collecting diagnostics on the listening RPC socket 0.0.0.0:44161 every 8 connection(s)
I20260925 06:07:20.151117   787 acceptor_pool.cc:254] collecting diagnostics on the listening RPC socket 0.0.0.0:44161 every 8 connection(s)
[       OK ] Parameters/TestRpc.TestApplicationFeatureFlagUnsupportedServer/SSL_TCP (50 ms)
[ RUN      ] Parameters/TestRpc.TestCancellationAsync/SSL_TCP
I20260925 06:07:20.209890   811 acceptor_pool.cc:254] collecting diagnostics on the listening RPC socket 0.0.0.0:33205 every 8 connection(s)
I20260925 06:07:20.210125   812 acceptor_pool.cc:254] collecting diagnostics on the listening RPC socket 0.0.0.0:33205 every 8 connection(s)
I20260925 06:07:20.211022   379 rpc-test.cc:1716] Connecting to 0.0.0.0:33205
I20260925 06:07:20.222646   379 test_util.cc:268] Using random seed: -2022409336
I20260925 06:07:20.254669   815 rpc-test-base.h:240] got call: sleep_micros: 500 pattern: 4294967295 num_repetitions: 2097152 sidecar_idx: 0
I20260925 06:07:20.274173   814 rpc-test-base.h:240] got call: sleep_micros: 500 pattern: 4294967295 num_repetitions: 2097152 sidecar_idx: 0
I20260925 06:07:20.299949   813 rpc-test-base.h:240] got call: sleep_micros: 500 pattern: 4294967295 num_repetitions: 2097152 sidecar_idx: 0
I20260925 06:07:20.339723   814 rpc-test-base.h:240] got call: sleep_micros: 500 pattern: 4294967295 num_repetitions: 2097152 sidecar_idx: 0
I20260925 06:07:20.373231   813 rpc-test-base.h:240] got call: sleep_micros: 500 pattern: 4294967295 num_repetitions: 2097152 sidecar_idx: 0
W20260925 06:07:20.398454   808 connection.cc:698] server connection from 127.0.0.1:55492 send error: Network error: failed to write to TLS socket: Broken pipe
W20260925 06:07:20.398607   808 connection.cc:441] server connection from 127.0.0.1:55492 torn down before Call kudu.rpc.GenericCalculatorService.SleepWithSidecar from 127.0.0.1:55492 (request call id 9) could send its response
W20260925 06:07:20.398957   808 connection.cc:196] Error closing socket: Network error: TlsSocket::Close: Success
W20260925 06:07:20.415400   808 connection.cc:441] server connection from 127.0.0.1:55492 torn down before Call kudu.rpc.GenericCalculatorService.SleepWithSidecar from 127.0.0.1:55492 (request call id 8) could send its response
[       OK ] Parameters/TestRpc.TestCancellationAsync/SSL_TCP (228 ms)
[ RUN      ] Parameters/TestRpc.TestPerformanceBySocketType/SSL_TCP
I20260925 06:07:20.436208   836 acceptor_pool.cc:254] collecting diagnostics on the listening RPC socket 0.0.0.0:33923 every 8 connection(s)
I20260925 06:07:20.436472   837 acceptor_pool.cc:254] collecting diagnostics on the listening RPC socket 0.0.0.0:33923 every 8 connection(s)
I20260925 06:07:20.437335   379 rpc-test.cc:1846] Connecting to 0.0.0.0:33923
I20260925 06:07:23.326853   379 rpc-test.cc:1859] Sending 1024MB via ssl-enabled tcp socket: real 2.862s	user 2.605s	sys 2.173s
I20260925 06:07:26.103029   379 rpc-test.cc:1859] Sending 1024MB via ssl-enabled tcp socket: real 2.776s	user 2.570s	sys 2.017s
I20260925 06:07:28.928411   379 rpc-test.cc:1859] Sending 1024MB via ssl-enabled tcp socket: real 2.825s	user 2.678s	sys 2.033s
I20260925 06:07:31.746522   379 rpc-test.cc:1859] Sending 1024MB via ssl-enabled tcp socket: real 2.818s	user 2.528s	sys 2.174s
I20260925 06:07:34.560204   379 rpc-test.cc:1859] Sending 1024MB via ssl-enabled tcp socket: real 2.814s	user 2.576s	sys 2.108s
[       OK ] Parameters/TestRpc.TestPerformanceBySocketType/SSL_TCP (14148 ms)
[----------] 20 tests from Parameters/TestRpc (47063 ms total)

[----------] 1 test from Parameters/TestRpcSocketTxRxQueue
[ RUN      ] Parameters/TestRpcSocketTxRxQueue.OverCapacity/0
W20260925 06:07:34.871686   853 negotiation.cc:337] Failed RPC negotiation. Trace:
0925 06:07:34.580283 (+     0us) reactor.cc:625] Submitting negotiation task for client connection to 0.0.0.0:38463 (local address 127.0.0.1:48014)
0925 06:07:34.580463 (+   180us) negotiation.cc:107] Waiting for socket to connect
0925 06:07:34.580481 (+    18us) client_negotiation.cc:174] Beginning negotiation
0925 06:07:34.580604 (+   123us) client_negotiation.cc:252] Sending NEGOTIATE NegotiatePB request
0925 06:07:34.871094 (+290490us) negotiation.cc:327] Negotiation complete: Network error: Client connection negotiation failed: client connection to 0.0.0.0:38463: BlockingRecv error: recv error from unknown peer: Transport endpoint is not connected (error 107)
Metrics: {"client-negotiator.queue_time_us":47}
W20260925 06:07:34.871762   862 negotiation.cc:337] Failed RPC negotiation. Trace:
0925 06:07:34.582662 (+     0us) reactor.cc:625] Submitting negotiation task for client connection to 0.0.0.0:38463 (local address 127.0.0.1:48018)
0925 06:07:34.582803 (+   141us) negotiation.cc:107] Waiting for socket to connect
0925 06:07:34.582816 (+    13us) client_negotiation.cc:174] Beginning negotiation
0925 06:07:34.582897 (+    81us) client_negotiation.cc:252] Sending NEGOTIATE NegotiatePB request
0925 06:07:34.871188 (+288291us) negotiation.cc:327] Negotiation complete: Network error: Client connection negotiation failed: client connection to 0.0.0.0:38463: BlockingRecv error: recv error from unknown peer: Transport endpoint is not connected (error 107)
Metrics: {"client-negotiator.queue_time_us":37}
W20260925 06:07:34.871691   889 negotiation.cc:337] Failed RPC negotiation. Trace:
0925 06:07:34.589782 (+     0us) reactor.cc:625] Submitting negotiation task for client connection to 0.0.0.0:38463 (local address 127.0.0.1:48058)
0925 06:07:34.589948 (+   166us) negotiation.cc:107] Waiting for socket to connect
0925 06:07:34.589976 (+    28us) client_negotiation.cc:174] Beginning negotiation
0925 06:07:34.590074 (+    98us) client_negotiation.cc:252] Sending NEGOTIATE NegotiatePB request
0925 06:07:34.871372 (+281298us) negotiation.cc:327] Negotiation complete: Network error: Client connection negotiation failed: client connection to 0.0.0.0:38463: BlockingRecv error: recv error from unknown peer: Transport endpoint is not connected (error 107)
Metrics: {"client-negotiator.queue_time_us":47}
W20260925 06:07:34.871982   880 negotiation.cc:337] Failed RPC negotiation. Trace:
0925 06:07:34.587323 (+     0us) reactor.cc:625] Submitting negotiation task for client connection to 0.0.0.0:38463 (local address 127.0.0.1:48048)
0925 06:07:34.587481 (+   158us) negotiation.cc:107] Waiting for socket to connect
0925 06:07:34.587499 (+    18us) client_negotiation.cc:174] Beginning negotiation
0925 06:07:34.587592 (+    93us) client_negotiation.cc:252] Sending NEGOTIATE NegotiatePB request
0925 06:07:34.871097 (+283505us) negotiation.cc:327] Negotiation complete: Network error: Client connection negotiation failed: client connection to 0.0.0.0:38463: BlockingRecv error: recv error from unknown peer: Transport endpoint is not connected (error 107)
Metrics: {"client-negotiator.queue_time_us":30}
W20260925 06:07:34.876523   871 negotiation.cc:337] Failed RPC negotiation. Trace:
0925 06:07:34.584925 (+     0us) reactor.cc:625] Submitting negotiation task for client connection to 0.0.0.0:38463 (local address 127.0.0.1:48034)
0925 06:07:34.585067 (+   142us) negotiation.cc:107] Waiting for socket to connect
0925 06:07:34.585082 (+    15us) client_negotiation.cc:174] Beginning negotiation
0925 06:07:34.585161 (+    79us) client_negotiation.cc:252] Sending NEGOTIATE NegotiatePB request
0925 06:07:34.871263 (+286102us) negotiation.cc:327] Negotiation complete: Network error: Client connection negotiation failed: client connection to 0.0.0.0:38463: BlockingRecv error: recv error from unknown peer: Transport endpoint is not connected (error 107)
Metrics: {"client-negotiator.queue_time_us":47}
W20260925 06:07:34.880399   898 negotiation.cc:337] Failed RPC negotiation. Trace:
0925 06:07:34.592927 (+     0us) reactor.cc:625] Submitting negotiation task for client connection to 0.0.0.0:38463 (local address 127.0.0.1:48072)
0925 06:07:34.593106 (+   179us) negotiation.cc:107] Waiting for socket to connect
0925 06:07:34.593123 (+    17us) client_negotiation.cc:174] Beginning negotiation
0925 06:07:34.593224 (+   101us) client_negotiation.cc:252] Sending NEGOTIATE NegotiatePB request
0925 06:07:34.871704 (+278480us) negotiation.cc:327] Negotiation complete: Network error: Client connection negotiation failed: client connection to 0.0.0.0:38463: BlockingRecv error: recv error from unknown peer: Transport endpoint is not connected (error 107)
Metrics: {"client-negotiator.queue_time_us":53}
[       OK ] Parameters/TestRpcSocketTxRxQueue.OverCapacity/0 (1069 ms)
[----------] 1 test from Parameters/TestRpcSocketTxRxQueue (1069 ms total)

[----------] Global test environment tear-down
[==========] 21 tests from 2 test suites ran. (48133 ms total)
[  PASSED  ] 20 tests.
[  FAILED  ] 1 test, listed below:
[  FAILED  ] Parameters/TestRpc.TestCallWithChainCertAndChainCA/SSL_TCP, where GetParam() = (true, false)

 1 FAILED TEST