Diagnosed failure
Parameters/TestRpc.TestCallWithChainCertAndChainCA/SSL_UnixSocket: /data0/somelongdirectorytoavoidrpathissues/src/kudu/src/kudu/rpc/rpc-test.cc:270: Failure
Failed
Bad status: Runtime error: could not verify certificate chain (error with cert: subject=CN = localhost, ST = sadfjas, C = AS, emailAddress = sdflkdsajf, O = lskdfjlsad, OU = sldfkja, issuer=C = AS, ST = ASDfkjdhf, L = lskdjf, O = saldfja, OU = skdjf, CN = localhost, emailAddress = sadjflkadsj): : certificate has expired
Google Test trace:
/data0/somelongdirectorytoavoidrpathissues/src/kudu/src/kudu/rpc/rpc-test.cc:267: Connecting to unix:/tmp/dist-test-taskqTO5Gx/test-tmp/rpc-test-a97a70b1a43341298c39e9376e947a66.sock
I20260928 03:43:33.436265 4011 test_util.cc:175] -----------------------------------------------
I20260928 03:43:33.436471 4011 test_util.cc:176] Had fatal failures, leaving test files at /tmp/dist-test-taskqTO5Gx/test-tmp/rpc-test.6.Parameters_TestRpc.TestCallWithChainCertAndChainCA_SSL_UnixSocket.1790567012157600-4011-0
Full log
Note: This is test shard 7 of 8.
[==========] Running 21 tests from 2 test suites.
[----------] Global test environment set-up.
[----------] 20 tests from Parameters/TestRpc
[ RUN ] Parameters/TestRpc.TestMessengerCreateDestroy/SSL_UnixSocket
WARNING: Logging before InitGoogleLogging() is written to STDERR
I20260928 03:43:32.254645 4011 rpc-test.cc:169] started messenger TestCreateDestroy
[ OK ] Parameters/TestRpc.TestMessengerCreateDestroy/SSL_UnixSocket (1097 ms)
[ RUN ] Parameters/TestRpc.TestNegotiationDeadlock/SSL_UnixSocket
I20260928 03:43:33.337620 4033 acceptor_pool.cc:254] collecting diagnostics on the listening RPC socket unix:/tmp/dist-test-taskqTO5Gx/test-tmp/rpc-test-3e813ea2e48b42e2a68572aaa2008f7a.sock every 8 connection(s)
I20260928 03:43:33.339067 4034 acceptor_pool.cc:254] collecting diagnostics on the listening RPC socket unix:/tmp/dist-test-taskqTO5Gx/test-tmp/rpc-test-3e813ea2e48b42e2a68572aaa2008f7a.sock every 8 connection(s)
[ OK ] Parameters/TestRpc.TestNegotiationDeadlock/SSL_UnixSocket (81 ms)
[ RUN ] Parameters/TestRpc.TestCallWithChainCertAndChainCA/SSL_UnixSocket
I20260928 03:43:33.407616 4049 acceptor_pool.cc:254] collecting diagnostics on the listening RPC socket unix:/tmp/dist-test-taskqTO5Gx/test-tmp/rpc-test-a97a70b1a43341298c39e9376e947a66.sock every 8 connection(s)
I20260928 03:43:33.409718 4050 acceptor_pool.cc:254] collecting diagnostics on the listening RPC socket unix:/tmp/dist-test-taskqTO5Gx/test-tmp/rpc-test-a97a70b1a43341298c39e9376e947a66.sock every 8 connection(s)
/data0/somelongdirectorytoavoidrpathissues/src/kudu/src/kudu/rpc/rpc-test.cc:270: Failure
Failed
Bad status: Runtime error: could not verify certificate chain (error with cert: subject=CN = localhost, ST = sadfjas, C = AS, emailAddress = sdflkdsajf, O = lskdfjlsad, OU = sldfkja, issuer=C = AS, ST = ASDfkjdhf, L = lskdjf, O = saldfja, OU = skdjf, CN = localhost, emailAddress = sadjflkadsj): : certificate has expired
Google Test trace:
/data0/somelongdirectorytoavoidrpathissues/src/kudu/src/kudu/rpc/rpc-test.cc:267: Connecting to unix:/tmp/dist-test-taskqTO5Gx/test-tmp/rpc-test-a97a70b1a43341298c39e9376e947a66.sock
I20260928 03:43:33.436265 4011 test_util.cc:175] -----------------------------------------------
I20260928 03:43:33.436471 4011 test_util.cc:176] Had fatal failures, leaving test files at /tmp/dist-test-taskqTO5Gx/test-tmp/rpc-test.6.Parameters_TestRpc.TestCallWithChainCertAndChainCA_SSL_UnixSocket.1790567012157600-4011-0
[ FAILED ] Parameters/TestRpc.TestCallWithChainCertAndChainCA/SSL_UnixSocket, where GetParam() = (true, true) (47 ms)
[ RUN ] Parameters/TestRpc.TestCallWithPasswordProtectedKey/SSL_UnixSocket
I20260928 03:43:33.460085 4074 acceptor_pool.cc:254] collecting diagnostics on the listening RPC socket unix:/tmp/dist-test-taskqTO5Gx/test-tmp/rpc-test-9d3644b702e443e59e0df2a21d786b6d.sock every 8 connection(s)
I20260928 03:43:33.460601 4075 acceptor_pool.cc:254] collecting diagnostics on the listening RPC socket unix:/tmp/dist-test-taskqTO5Gx/test-tmp/rpc-test-9d3644b702e443e59e0df2a21d786b6d.sock every 8 connection(s)
W20260928 03:43:33.504427 4071 connection.cc:196] Error closing socket: Network error: TlsSocket::Close: Broken pipe
[ OK ] Parameters/TestRpc.TestCallWithPasswordProtectedKey/SSL_UnixSocket (74 ms)
[ RUN ] Parameters/TestRpc.TestCallToBadServer/SSL_UnixSocket
I20260928 03:43:33.534130 4011 rpc-test.cc:394] Status: Network error: Client connection negotiation failed: client connection to 0.0.0.0:0: connect: Connection refused (error 111)
I20260928 03:43:33.535589 4011 rpc-test.cc:394] Status: Network error: Client connection negotiation failed: client connection to 0.0.0.0:0: connect: Connection refused (error 111)
I20260928 03:43:33.537048 4011 rpc-test.cc:394] Status: Network error: Client connection negotiation failed: client connection to 0.0.0.0:0: connect: Connection refused (error 111)
I20260928 03:43:33.538422 4011 rpc-test.cc:394] Status: Network error: Client connection negotiation failed: client connection to 0.0.0.0:0: connect: Connection refused (error 111)
I20260928 03:43:33.539824 4011 rpc-test.cc:394] Status: Network error: Client connection negotiation failed: client connection to 0.0.0.0:0: connect: Connection refused (error 111)
[ OK ] Parameters/TestRpc.TestCallToBadServer/SSL_UnixSocket (31 ms)
[ RUN ] Parameters/TestRpc.TestWrongService/SSL_UnixSocket
I20260928 03:43:33.568379 4109 acceptor_pool.cc:254] collecting diagnostics on the listening RPC socket unix:/tmp/dist-test-taskqTO5Gx/test-tmp/rpc-test-a2ae51f6b30e46e59de4b1baf5c16833.sock every 8 connection(s)
I20260928 03:43:33.569195 4110 acceptor_pool.cc:254] collecting diagnostics on the listening RPC socket unix:/tmp/dist-test-taskqTO5Gx/test-tmp/rpc-test-a2ae51f6b30e46e59de4b1baf5c16833.sock every 8 connection(s)
I20260928 03:43:33.606201 4106 messenger.cc:345] service WrongServiceName not registered on TestServer
W20260928 03:43:33.609304 4106 connection.cc:196] Error closing socket: Network error: TlsSocket::Close: Broken pipe
[ OK ] Parameters/TestRpc.TestWrongService/SSL_UnixSocket (71 ms)
[ RUN ] Parameters/TestRpc.TestConnectionKeepalive/SSL_UnixSocket
I20260928 03:43:33.637295 4132 acceptor_pool.cc:254] collecting diagnostics on the listening RPC socket unix:/tmp/dist-test-taskqTO5Gx/test-tmp/rpc-test-07a04a6a0a1942119a6789315f6a7cf2.sock every 8 connection(s)
I20260928 03:43:33.638008 4133 acceptor_pool.cc:254] collecting diagnostics on the listening RPC socket unix:/tmp/dist-test-taskqTO5Gx/test-tmp/rpc-test-07a04a6a0a1942119a6789315f6a7cf2.sock every 8 connection(s)
I20260928 03:43:33.641198 4011 rpc-test.cc:488] Connecting to unix:/tmp/dist-test-taskqTO5Gx/test-tmp/rpc-test-07a04a6a0a1942119a6789315f6a7cf2.sock
W20260928 03:43:34.117995 4145 connection.cc:196] Error closing socket: Network error: TlsSocket::Close: Broken pipe
[ OK ] Parameters/TestRpc.TestConnectionKeepalive/SSL_UnixSocket (1065 ms)
[ RUN ] Parameters/TestRpc.TestClientConnectionMetrics/SSL_UnixSocket
I20260928 03:43:34.699661 4157 acceptor_pool.cc:254] collecting diagnostics on the listening RPC socket unix:/tmp/dist-test-taskqTO5Gx/test-tmp/rpc-test-53ef7ee37a8743c3a0856593765ac8c1.sock every 8 connection(s)
I20260928 03:43:34.700385 4158 acceptor_pool.cc:254] collecting diagnostics on the listening RPC socket unix:/tmp/dist-test-taskqTO5Gx/test-tmp/rpc-test-53ef7ee37a8743c3a0856593765ac8c1.sock every 8 connection(s)
I20260928 03:43:34.703621 4011 rpc-test.cc:569] Connecting to unix:/tmp/dist-test-taskqTO5Gx/test-tmp/rpc-test-53ef7ee37a8743c3a0856593765ac8c1.sock
W20260928 03:45:51.131654 4154 connection.cc:196] Error closing socket: Network error: TlsSocket::Close: Broken pipe
[ OK ] Parameters/TestRpc.TestClientConnectionMetrics/SSL_UnixSocket (136458 ms)
[ RUN ] Parameters/TestRpc.TestCredentialsPolicy/SSL_UnixSocket
I20260928 03:45:51.176112 4193 acceptor_pool.cc:254] collecting diagnostics on the listening RPC socket unix:/tmp/dist-test-taskqTO5Gx/test-tmp/rpc-test-cad2d05f3d5e4b5ba6e68e392ecf511a.sock every 8 connection(s)
I20260928 03:45:51.176936 4194 acceptor_pool.cc:254] collecting diagnostics on the listening RPC socket unix:/tmp/dist-test-taskqTO5Gx/test-tmp/rpc-test-cad2d05f3d5e4b5ba6e68e392ecf511a.sock every 8 connection(s)
I20260928 03:45:51.180238 4011 rpc-test.cc:700] Connecting to unix:/tmp/dist-test-taskqTO5Gx/test-tmp/rpc-test-cad2d05f3d5e4b5ba6e68e392ecf511a.sock
W20260928 03:45:51.212249 4192 connection.cc:196] Error closing socket: Network error: TlsSocket::Close: Broken pipe
[ OK ] Parameters/TestRpc.TestCredentialsPolicy/SSL_UnixSocket (94 ms)
[ RUN ] Parameters/TestRpc.TestCallLongerThanKeepalive/SSL_UnixSocket
I20260928 03:45:51.250362 4218 acceptor_pool.cc:254] collecting diagnostics on the listening RPC socket unix:/tmp/dist-test-taskqTO5Gx/test-tmp/rpc-test-f97cc2946eff414badab17886d7e4d77.sock every 8 connection(s)
I20260928 03:45:51.251019 4219 acceptor_pool.cc:254] collecting diagnostics on the listening RPC socket unix:/tmp/dist-test-taskqTO5Gx/test-tmp/rpc-test-f97cc2946eff414badab17886d7e4d77.sock every 8 connection(s)
I20260928 03:45:51.278877 4222 rpc-test-base.h:222] got call: sleep_micros: 3000000 deferred: true
I20260928 03:45:54.283363 4222 rpcz_store.cc:275] Call kudu.rpc.GenericCalculatorService.Sleep from unix:<unnamed> (request call id 0) took 3004 ms. Trace:
I20260928 03:45:54.283881 4222 rpcz_store.cc:276] 0928 03:45:51.278655 (+ 0us) service_pool.cc:170] Inserting onto call queue
0928 03:45:51.278822 (+ 167us) service_pool.cc:227] Handling call
0928 03:45:54.283190 (+3004368us) inbound_call.cc:173] Queueing success response
Metrics: {}
[ OK ] Parameters/TestRpc.TestCallLongerThanKeepalive/SSL_UnixSocket (3062 ms)
[ RUN ] Parameters/TestRpc.TestRpcSidecar/SSL_UnixSocket
I20260928 03:45:54.314507 4244 acceptor_pool.cc:254] collecting diagnostics on the listening RPC socket unix:/tmp/dist-test-taskqTO5Gx/test-tmp/rpc-test-bf8a1d3d55fd4089937dc50e34b2a7e1.sock every 8 connection(s)
I20260928 03:45:54.315285 4245 acceptor_pool.cc:254] collecting diagnostics on the listening RPC socket unix:/tmp/dist-test-taskqTO5Gx/test-tmp/rpc-test-bf8a1d3d55fd4089937dc50e34b2a7e1.sock every 8 connection(s)
W20260928 03:45:54.843698 4241 connection.cc:196] Error closing socket: Network error: TlsSocket::Close: Broken pipe
[ OK ] Parameters/TestRpc.TestRpcSidecar/SSL_UnixSocket (554 ms)
[ RUN ] Parameters/TestRpc.TestRpcSidecarLimits/SSL_UnixSocket
I20260928 03:46:10.295740 4270 acceptor_pool.cc:254] collecting diagnostics on the listening RPC socket unix:/tmp/dist-test-taskqTO5Gx/test-tmp/rpc-test-d2a31a03f31b41668c29bcc816ed2ebf.sock every 8 connection(s)
I20260928 03:46:10.296482 4271 acceptor_pool.cc:254] collecting diagnostics on the listening RPC socket unix:/tmp/dist-test-taskqTO5Gx/test-tmp/rpc-test-d2a31a03f31b41668c29bcc816ed2ebf.sock every 8 connection(s)
W20260928 03:46:10.334434 4011 serialization.cc:72] Serialized kudu.rpc_test.PushStringsRequestPB (2147483654 bytes) is larger than the maximum configured RPC message size (52428800 bytes). Sending anyway, but peer may reject the data.
W20260928 03:46:10.345419 4267 connection.cc:535] server connection from unix:<unnamed> recv error: Network error: RPC frame had a length of 2147483714, but we only support messages up to 52428800 bytes long.
W20260928 03:46:10.345763 4267 connection.cc:158] shutting down server connection from unix:<unnamed> with pending inbound data: 4/2147483714 bytes received; last active 0 ns ago: status Network error: RPC frame had a length of 2147483714, but we only support messages up to 52428800 bytes long.
W20260928 03:46:10.346982 4283 connection.cc:196] Error closing socket: Network error: TlsSocket::Close: Broken pipe
[ OK ] Parameters/TestRpc.TestRpcSidecarLimits/SSL_UnixSocket (16221 ms)
[ RUN ] Parameters/TestRpc.TestCallTimeoutDoesntAffectNegotiation/SSL_UnixSocket
I20260928 03:46:11.096701 4295 acceptor_pool.cc:254] collecting diagnostics on the listening RPC socket unix:/tmp/dist-test-taskqTO5Gx/test-tmp/rpc-test-23a6aa4efb9f45cea45f0465cc050494.sock every 8 connection(s)
I20260928 03:46:11.097438 4296 acceptor_pool.cc:254] collecting diagnostics on the listening RPC socket unix:/tmp/dist-test-taskqTO5Gx/test-tmp/rpc-test-23a6aa4efb9f45cea45f0465cc050494.sock every 8 connection(s)
W20260928 03:46:11.124020 4291 negotiation.cc:266] Injecting 500ms delay in negotiation
I20260928 03:46:11.174302 4011 rpc-test-base.h:595] status: Timed out: connection negotiation to unix:/tmp/dist-test-taskqTO5Gx/test-tmp/rpc-test-23a6aa4efb9f45cea45f0465cc050494.sock for RPC Sleep timed out after 0.050s (ON_OUTBOUND_QUEUE), seconds elapsed: 0.0516872
W20260928 03:46:11.635816 4292 connection.cc:196] Error closing socket: Network error: TlsSocket::Close: Broken pipe
[ OK ] Parameters/TestRpc.TestCallTimeoutDoesntAffectNegotiation/SSL_UnixSocket (568 ms)
[ RUN ] Parameters/TestRpc.TestRpcHandlerLatencyMetric/SSL_UnixSocket
I20260928 03:46:11.677186 4320 acceptor_pool.cc:254] collecting diagnostics on the listening RPC socket unix:/tmp/dist-test-taskqTO5Gx/test-tmp/rpc-test-dd5082aff4b5429ab0cf59f80c7da53a.sock every 8 connection(s)
I20260928 03:46:11.677894 4321 acceptor_pool.cc:254] collecting diagnostics on the listening RPC socket unix:/tmp/dist-test-taskqTO5Gx/test-tmp/rpc-test-dd5082aff4b5429ab0cf59f80c7da53a.sock every 8 connection(s)
I20260928 03:46:11.742460 4011 rpc-test.cc:1236] Sleep() min lat: 21743
I20260928 03:46:11.742666 4011 rpc-test.cc:1237] Sleep() mean lat: 21743
I20260928 03:46:11.742935 4011 rpc-test.cc:1238] Sleep() max lat: 21743
I20260928 03:46:11.743100 4011 rpc-test.cc:1239] Sleep() #calls: 1
W20260928 03:46:11.746025 4317 connection.cc:196] Error closing socket: Network error: TlsSocket::Close: Broken pipe
[ OK ] Parameters/TestRpc.TestRpcHandlerLatencyMetric/SSL_UnixSocket (110 ms)
[ RUN ] Parameters/TestRpc.TimedOutOnResponseMetricServiceQueue/SSL_UnixSocket
I20260928 03:46:11.781807 4346 acceptor_pool.cc:254] collecting diagnostics on the listening RPC socket unix:/tmp/dist-test-taskqTO5Gx/test-tmp/rpc-test-3c95e985215e45e6b9de604c49e2283d.sock every 8 connection(s)
I20260928 03:46:11.782549 4347 acceptor_pool.cc:254] collecting diagnostics on the listening RPC socket unix:/tmp/dist-test-taskqTO5Gx/test-tmp/rpc-test-3c95e985215e45e6b9de604c49e2283d.sock every 8 connection(s)
W20260928 03:46:11.854755 4348 rpcz_store.cc:267] Call kudu.rpc_test.CalculatorService.Sleep from unix:<unnamed> (request call id 2) took 20 ms (client timeout 20 ms). Trace:
W20260928 03:46:11.855123 4348 rpcz_store.cc:269] 0928 03:46:11.834268 (+ 0us) service_pool.cc:170] Inserting onto call queue
0928 03:46:11.854611 (+ 20343us) service_pool.cc:214] Skipping call since client already timed out
0928 03:46:11.854706 (+ 95us) inbound_call.cc:173] Queueing failure response
Metrics: {}
W20260928 03:46:11.857501 4343 connection.cc:196] Error closing socket: Network error: TlsSocket::Close: Broken pipe
[ OK ] Parameters/TestRpc.TimedOutOnResponseMetricServiceQueue/SSL_UnixSocket (110 ms)
[ RUN ] Parameters/TestRpc.RpcPendingConnectionsMetric/SSL_UnixSocket
I20260928 03:46:11.871985 4369 acceptor_pool.cc:254] collecting diagnostics on the listening RPC socket 0.0.0.0:36813 every 8 connection(s)
I20260928 03:46:11.872641 4370 acceptor_pool.cc:254] collecting diagnostics on the listening RPC socket 0.0.0.0:36813 every 8 connection(s)
W20260928 03:46:11.877584 4365 negotiation.cc:337] Failed RPC negotiation. Trace:
0928 03:46:11.876305 (+ 0us) reactor.cc:625] Submitting negotiation task for server connection from 127.0.0.1:45708 (local address 127.0.0.1:36813)
0928 03:46:11.876725 (+ 420us) server_negotiation.cc:206] Beginning negotiation
0928 03:46:11.876742 (+ 17us) server_negotiation.cc:399] Waiting for connection header
0928 03:46:11.876993 (+ 251us) negotiation.cc:327] Negotiation complete: Network error: Server connection negotiation failed: server connection from 127.0.0.1:45708: BlockingRecv error: recv got EOF from 127.0.0.1:45708 (error 108)
Metrics: {"server-negotiator.queue_time_us":104}
[ OK ] Parameters/TestRpc.RpcPendingConnectionsMetric/SSL_UnixSocket (28 ms)
[ RUN ] Parameters/TestRpc.TestRpcContextClientDeadline/SSL_UnixSocket
I20260928 03:46:11.912549 4385 acceptor_pool.cc:254] collecting diagnostics on the listening RPC socket unix:/tmp/dist-test-taskqTO5Gx/test-tmp/rpc-test-72ae3a52bb664c6380f411cf7db71c68.sock every 8 connection(s)
I20260928 03:46:11.913249 4386 acceptor_pool.cc:254] collecting diagnostics on the listening RPC socket unix:/tmp/dist-test-taskqTO5Gx/test-tmp/rpc-test-72ae3a52bb664c6380f411cf7db71c68.sock every 8 connection(s)
[ OK ] Parameters/TestRpc.TestRpcContextClientDeadline/SSL_UnixSocket (114 ms)
[ RUN ] Parameters/TestRpc.TestApplicationFeatureFlagUnsupportedServer/SSL_UnixSocket
I20260928 03:46:12.021875 4410 acceptor_pool.cc:254] collecting diagnostics on the listening RPC socket unix:/tmp/dist-test-taskqTO5Gx/test-tmp/rpc-test-035cf7eb03284f49b0362b539b0d5615.sock every 8 connection(s)
I20260928 03:46:12.022522 4411 acceptor_pool.cc:254] collecting diagnostics on the listening RPC socket unix:/tmp/dist-test-taskqTO5Gx/test-tmp/rpc-test-035cf7eb03284f49b0362b539b0d5615.sock every 8 connection(s)
W20260928 03:46:12.059944 4407 connection.cc:196] Error closing socket: Network error: TlsSocket::Close: Broken pipe
[ OK ] Parameters/TestRpc.TestApplicationFeatureFlagUnsupportedServer/SSL_UnixSocket (59 ms)
[ RUN ] Parameters/TestRpc.TestCancellationAsync/SSL_UnixSocket
I20260928 03:46:12.085471 4435 acceptor_pool.cc:254] collecting diagnostics on the listening RPC socket unix:/tmp/dist-test-taskqTO5Gx/test-tmp/rpc-test-641b20695f93492ebf4e3271dd03eb44.sock every 8 connection(s)
I20260928 03:46:12.086112 4436 acceptor_pool.cc:254] collecting diagnostics on the listening RPC socket unix:/tmp/dist-test-taskqTO5Gx/test-tmp/rpc-test-641b20695f93492ebf4e3271dd03eb44.sock every 8 connection(s)
I20260928 03:46:12.089706 4011 rpc-test.cc:1716] Connecting to unix:/tmp/dist-test-taskqTO5Gx/test-tmp/rpc-test-641b20695f93492ebf4e3271dd03eb44.sock
I20260928 03:46:12.107432 4011 test_util.cc:268] Using random seed: -398627693
I20260928 03:46:12.329375 4439 rpc-test-base.h:240] got call: sleep_micros: 500 pattern: 4294967295 num_repetitions: 2097152 sidecar_idx: 0
I20260928 03:46:12.534986 4438 rpc-test-base.h:240] got call: sleep_micros: 500 pattern: 4294967295 num_repetitions: 2097152 sidecar_idx: 0
I20260928 03:46:12.770725 4439 rpc-test-base.h:240] got call: sleep_micros: 500 pattern: 4294967295 num_repetitions: 2097152 sidecar_idx: 0
W20260928 03:46:12.869402 4448 outbound_call.cc:322] RPC callback for RPC call kudu.rpc.GenericCalculatorService.SleepWithSidecar -> {remote=unix:/tmp/dist-test-taskqTO5Gx/test-tmp/rpc-test-641b20695f93492ebf4e3271dd03eb44.sock, user_credentials={real_user=slave}} blocked reactor thread for 101602us
I20260928 03:46:13.055778 4438 rpc-test-base.h:240] got call: sleep_micros: 500 pattern: 4294967295 num_repetitions: 2097152 sidecar_idx: 0
I20260928 03:46:13.272753 4438 rpc-test-base.h:240] got call: sleep_micros: 500 pattern: 4294967295 num_repetitions: 2097152 sidecar_idx: 0
I20260928 03:46:13.465353 4439 rpc-test-base.h:240] got call: sleep_micros: 500 pattern: 4294967295 num_repetitions: 2097152 sidecar_idx: 0
I20260928 03:46:13.683641 4438 rpc-test-base.h:240] got call: sleep_micros: 500 pattern: 4294967295 num_repetitions: 2097152 sidecar_idx: 0
I20260928 03:46:13.860620 4439 rpc-test-base.h:240] got call: sleep_micros: 500 pattern: 4294967295 num_repetitions: 2097152 sidecar_idx: 0
I20260928 03:46:14.085882 4439 rpc-test-base.h:240] got call: sleep_micros: 500 pattern: 4294967295 num_repetitions: 2097152 sidecar_idx: 0
W20260928 03:46:14.232015 4432 connection.cc:441] server connection from unix:<unnamed> torn down before Call kudu.rpc.GenericCalculatorService.SleepWithSidecar from unix:<unnamed> (request call id 9) could send its response
[ OK ] Parameters/TestRpc.TestCancellationAsync/SSL_UnixSocket (2180 ms)
[ RUN ] Parameters/TestRpc.TestPerformanceBySocketType/SSL_UnixSocket
I20260928 03:46:14.338862 4461 acceptor_pool.cc:254] collecting diagnostics on the listening RPC socket unix:/tmp/dist-test-taskqTO5Gx/test-tmp/rpc-test-d0cd9cc7425d4a4780c405eba2a42abc.sock every 8 connection(s)
I20260928 03:46:14.339644 4462 acceptor_pool.cc:254] collecting diagnostics on the listening RPC socket unix:/tmp/dist-test-taskqTO5Gx/test-tmp/rpc-test-d0cd9cc7425d4a4780c405eba2a42abc.sock every 8 connection(s)
I20260928 03:46:14.342767 4011 rpc-test.cc:1846] Connecting to unix:/tmp/dist-test-taskqTO5Gx/test-tmp/rpc-test-d0cd9cc7425d4a4780c405eba2a42abc.sock
I20260928 03:46:35.826436 4011 rpc-test.cc:1859] Sending 1024MB via ssl-enabled unix socket: real 21.467s user 20.252s sys 12.766s
I20260928 03:46:56.884999 4011 rpc-test.cc:1859] Sending 1024MB via ssl-enabled unix socket: real 21.058s user 19.331s sys 12.692s
I20260928 03:47:18.048264 4011 rpc-test.cc:1859] Sending 1024MB via ssl-enabled unix socket: real 21.163s user 19.688s sys 12.501s
I20260928 03:47:39.469455 4011 rpc-test.cc:1859] Sending 1024MB via ssl-enabled unix socket: real 21.421s user 19.942s sys 12.822s
I20260928 03:48:00.506484 4011 rpc-test.cc:1859] Sending 1024MB via ssl-enabled unix socket: real 21.037s user 19.363s sys 12.663s
W20260928 03:48:00.511022 4458 connection.cc:196] Error closing socket: Network error: TlsSocket::Close: Broken pipe
[ OK ] Parameters/TestRpc.TestPerformanceBySocketType/SSL_UnixSocket (106276 ms)
[----------] 20 tests from Parameters/TestRpc (268312 ms total)
[----------] 1 test from Parameters/TestRpcSocketTxRxQueue
[ RUN ] Parameters/TestRpcSocketTxRxQueue.AcceptorRxQueueSizeMetric/0
I20260928 03:48:00.532295 4496 acceptor_pool.cc:254] collecting diagnostics on the listening RPC socket 0.0.0.0:42879 every 1 connection(s)
I20260928 03:48:00.533142 4497 acceptor_pool.cc:254] collecting diagnostics on the listening RPC socket 0.0.0.0:42879 every 1 connection(s)
W20260928 03:48:00.539628 4492 negotiation.cc:337] Failed RPC negotiation. Trace:
0928 03:48:00.537099 (+ 0us) reactor.cc:625] Submitting negotiation task for server connection from 127.0.0.1:33268 (local address 127.0.0.1:42879)
0928 03:48:00.537544 (+ 445us) server_negotiation.cc:206] Beginning negotiation
0928 03:48:00.537567 (+ 23us) server_negotiation.cc:399] Waiting for connection header
0928 03:48:00.537801 (+ 234us) negotiation.cc:327] Negotiation complete: Network error: Server connection negotiation failed: server connection from 127.0.0.1:33268: BlockingRecv error: recv got EOF from 127.0.0.1:33268 (error 108)
Metrics: {"server-negotiator.queue_time_us":109}
[ OK ] Parameters/TestRpcSocketTxRxQueue.AcceptorRxQueueSizeMetric/0 (24 ms)
[----------] 1 test from Parameters/TestRpcSocketTxRxQueue (25 ms total)
[----------] Global test environment tear-down
[==========] 21 tests from 2 test suites ran. (268338 ms total)
[ PASSED ] 20 tests.
[ FAILED ] 1 test, listed below:
[ FAILED ] Parameters/TestRpc.TestCallWithChainCertAndChainCA/SSL_UnixSocket, where GetParam() = (true, true)
1 FAILED TEST