Diagnosed failure

Parameters/TestRpc.TestCallWithChainCertAndRootCA/SSL_UnixSocket: /data0/somelongdirectorytoavoidrpathissues/src/kudu/src/kudu/rpc/rpc-test.cc:303: Failure
Failed
Bad status: Runtime error: could not verify certificate chain (error with cert: subject=CN = localhost, ST = sadfjas, C = AS, emailAddress = sdflkdsajf, O = lskdfjlsad, OU = sldfkja, issuer=C = AS, ST = ASDfkjdhf, L = lskdjf, O = saldfja, OU = skdjf, CN = localhost, emailAddress = sadjflkadsj): : certificate has expired
Google Test trace:
/data0/somelongdirectorytoavoidrpathissues/src/kudu/src/kudu/rpc/rpc-test.cc:300: Connecting to unix:/tmp/dist-test-taskp7Fqz4/test-tmp/rpc-test-2c438dc3ed004cbea5e56c76822e337f.sock
I20260927 23:29:38.924932   390 test_util.cc:175] -----------------------------------------------
I20260927 23:29:38.925101   390 test_util.cc:176] Had fatal failures, leaving test files at /tmp/dist-test-taskp7Fqz4/test-tmp/rpc-test.2.Parameters_TestRpc.TestCallWithChainCertAndRootCA_SSL_UnixSocket.1790551775384362-390-0

Full log

Note: This is test shard 3 of 8.
[==========] Running 21 tests from 2 test suites.
[----------] Global test environment set-up.
[----------] 1 test from TestRpc
[ RUN      ] TestRpc.TestNegotiationTimeout
WARNING: Logging before InitGoogleLogging() is written to STDERR
I20260927 23:29:35.579058   390 rpc-test-base.h:595] status: Timed out: connection negotiation to 0.0.0.0:43271 for RPC Sleep timed out after 0.100s (ON_OUTBOUND_QUEUE), seconds elapsed: 0.100914
W20260927 23:29:38.608124   400 negotiation.cc:337] Failed RPC negotiation. Trace:
0927 23:29:35.479367 (+     0us) reactor.cc:625] Submitting negotiation task for client connection to 0.0.0.0:43271 (local address 127.0.0.1:59976)
0927 23:29:35.480143 (+   776us) negotiation.cc:107] Waiting for socket to connect
0927 23:29:35.480195 (+    52us) client_negotiation.cc:174] Beginning negotiation
0927 23:29:35.492586 (+ 12391us) client_negotiation.cc:252] Sending NEGOTIATE NegotiatePB request
0927 23:29:38.606875 (+3114289us) negotiation.cc:327] Negotiation complete: Timed out: Client connection negotiation failed: client connection to 0.0.0.0:43271: received 0 of 4 requested bytes
Metrics: {"client-negotiator.queue_time_us":280}
[       OK ] TestRpc.TestNegotiationTimeout (3169 ms)
[----------] 1 test from TestRpc (3169 ms total)

[----------] 20 tests from Parameters/TestRpc
[ RUN      ] Parameters/TestRpc.TestAcceptorPoolStartStop/SSL_UnixSocket
I20260927 23:29:38.644665   416 acceptor_pool.cc:254] collecting diagnostics on the listening RPC socket unix:/tmp/dist-test-taskp7Fqz4/test-tmp/rpc-test-667d59056fe94795a17de3dcd28cc0e5.sock every 8 connection(s)
I20260927 23:29:38.646541   417 acceptor_pool.cc:254] collecting diagnostics on the listening RPC socket unix:/tmp/dist-test-taskp7Fqz4/test-tmp/rpc-test-667d59056fe94795a17de3dcd28cc0e5.sock every 8 connection(s)
I20260927 23:29:38.693641   427 acceptor_pool.cc:254] collecting diagnostics on the listening RPC socket unix:/tmp/dist-test-taskp7Fqz4/test-tmp/rpc-test-667d59056fe94795a17de3dcd28cc0e5.sock every 8 connection(s)
I20260927 23:29:38.695547   428 acceptor_pool.cc:254] collecting diagnostics on the listening RPC socket unix:/tmp/dist-test-taskp7Fqz4/test-tmp/rpc-test-667d59056fe94795a17de3dcd28cc0e5.sock every 8 connection(s)
I20260927 23:29:38.733276   438 acceptor_pool.cc:254] collecting diagnostics on the listening RPC socket unix:/tmp/dist-test-taskp7Fqz4/test-tmp/rpc-test-667d59056fe94795a17de3dcd28cc0e5.sock every 8 connection(s)
I20260927 23:29:38.734026   439 acceptor_pool.cc:254] collecting diagnostics on the listening RPC socket unix:/tmp/dist-test-taskp7Fqz4/test-tmp/rpc-test-667d59056fe94795a17de3dcd28cc0e5.sock every 8 connection(s)
I20260927 23:29:38.753932   449 acceptor_pool.cc:254] collecting diagnostics on the listening RPC socket unix:/tmp/dist-test-taskp7Fqz4/test-tmp/rpc-test-667d59056fe94795a17de3dcd28cc0e5.sock every 8 connection(s)
I20260927 23:29:38.754671   450 acceptor_pool.cc:254] collecting diagnostics on the listening RPC socket unix:/tmp/dist-test-taskp7Fqz4/test-tmp/rpc-test-667d59056fe94795a17de3dcd28cc0e5.sock every 8 connection(s)
I20260927 23:29:38.787608   460 acceptor_pool.cc:254] collecting diagnostics on the listening RPC socket unix:/tmp/dist-test-taskp7Fqz4/test-tmp/rpc-test-667d59056fe94795a17de3dcd28cc0e5.sock every 8 connection(s)
I20260927 23:29:38.788335   461 acceptor_pool.cc:254] collecting diagnostics on the listening RPC socket unix:/tmp/dist-test-taskp7Fqz4/test-tmp/rpc-test-667d59056fe94795a17de3dcd28cc0e5.sock every 8 connection(s)
[       OK ] Parameters/TestRpc.TestAcceptorPoolStartStop/SSL_UnixSocket (179 ms)
[ RUN      ] Parameters/TestRpc.TestCall/SSL_UnixSocket
I20260927 23:29:38.815542   473 acceptor_pool.cc:254] collecting diagnostics on the listening RPC socket unix:/tmp/dist-test-taskp7Fqz4/test-tmp/rpc-test-c7a671174eac4fa39904076b3c509b39.sock every 8 connection(s)
I20260927 23:29:38.818109   474 acceptor_pool.cc:254] collecting diagnostics on the listening RPC socket unix:/tmp/dist-test-taskp7Fqz4/test-tmp/rpc-test-c7a671174eac4fa39904076b3c509b39.sock every 8 connection(s)
I20260927 23:29:38.823248   390 rpc-test.cc:234] Connecting to unix:/tmp/dist-test-taskp7Fqz4/test-tmp/rpc-test-c7a671174eac4fa39904076b3c509b39.sock
[       OK ] Parameters/TestRpc.TestCall/SSL_UnixSocket (88 ms)
[ RUN      ] Parameters/TestRpc.TestCallWithChainCertAndRootCA/SSL_UnixSocket
I20260927 23:29:38.903124   498 acceptor_pool.cc:254] collecting diagnostics on the listening RPC socket unix:/tmp/dist-test-taskp7Fqz4/test-tmp/rpc-test-2c438dc3ed004cbea5e56c76822e337f.sock every 8 connection(s)
I20260927 23:29:38.903892   499 acceptor_pool.cc:254] collecting diagnostics on the listening RPC socket unix:/tmp/dist-test-taskp7Fqz4/test-tmp/rpc-test-2c438dc3ed004cbea5e56c76822e337f.sock every 8 connection(s)
/data0/somelongdirectorytoavoidrpathissues/src/kudu/src/kudu/rpc/rpc-test.cc:303: Failure
Failed
Bad status: Runtime error: could not verify certificate chain (error with cert: subject=CN = localhost, ST = sadfjas, C = AS, emailAddress = sdflkdsajf, O = lskdfjlsad, OU = sldfkja, issuer=C = AS, ST = ASDfkjdhf, L = lskdjf, O = saldfja, OU = skdjf, CN = localhost, emailAddress = sadjflkadsj): : certificate has expired
Google Test trace:
/data0/somelongdirectorytoavoidrpathissues/src/kudu/src/kudu/rpc/rpc-test.cc:300: Connecting to unix:/tmp/dist-test-taskp7Fqz4/test-tmp/rpc-test-2c438dc3ed004cbea5e56c76822e337f.sock
I20260927 23:29:38.924932   390 test_util.cc:175] -----------------------------------------------
I20260927 23:29:38.925101   390 test_util.cc:176] Had fatal failures, leaving test files at /tmp/dist-test-taskp7Fqz4/test-tmp/rpc-test.2.Parameters_TestRpc.TestCallWithChainCertAndRootCA_SSL_UnixSocket.1790551775384362-390-0
[  FAILED  ] Parameters/TestRpc.TestCallWithChainCertAndRootCA/SSL_UnixSocket, where GetParam() = (true, true) (44 ms)
[ RUN      ] Parameters/TestRpc.TestCallWithBadPasswordProtectedKey/SSL_UnixSocket
[       OK ] Parameters/TestRpc.TestCallWithBadPasswordProtectedKey/SSL_UnixSocket (31 ms)
[ RUN      ] Parameters/TestRpc.TestInvalidMethodCall/SSL_UnixSocket
I20260927 23:29:38.987910   535 acceptor_pool.cc:254] collecting diagnostics on the listening RPC socket unix:/tmp/dist-test-taskp7Fqz4/test-tmp/rpc-test-c23eed98fb5c4d788107c3f2db1e7e8b.sock every 8 connection(s)
I20260927 23:29:38.988761   536 acceptor_pool.cc:254] collecting diagnostics on the listening RPC socket unix:/tmp/dist-test-taskp7Fqz4/test-tmp/rpc-test-c23eed98fb5c4d788107c3f2db1e7e8b.sock every 8 connection(s)
I20260927 23:29:38.992343   390 rpc-test.cc:406] Connecting to unix:/tmp/dist-test-taskp7Fqz4/test-tmp/rpc-test-c23eed98fb5c4d788107c3f2db1e7e8b.sock
W20260927 23:29:39.028977   532 connection.cc:196] Error closing socket: Network error: TlsSocket::Close: Broken pipe
[       OK ] Parameters/TestRpc.TestInvalidMethodCall/SSL_UnixSocket (77 ms)
[ RUN      ] Parameters/TestRpc.TestHighFDs/SSL_UnixSocket
I20260927 23:29:39.254987   560 acceptor_pool.cc:254] collecting diagnostics on the listening RPC socket unix:/tmp/dist-test-taskp7Fqz4/test-tmp/rpc-test-10b450c7750a44dbab23558aca3b9492.sock every 8 connection(s)
I20260927 23:29:39.255707   561 acceptor_pool.cc:254] collecting diagnostics on the listening RPC socket unix:/tmp/dist-test-taskp7Fqz4/test-tmp/rpc-test-10b450c7750a44dbab23558aca3b9492.sock every 8 connection(s)
W20260927 23:29:39.299037   557 connection.cc:196] Error closing socket: Network error: TlsSocket::Close: Broken pipe
[       OK ] Parameters/TestRpc.TestHighFDs/SSL_UnixSocket (276 ms)
[ RUN      ] Parameters/TestRpc.TestConnectionAlwaysKeepalive/SSL_UnixSocket
I20260927 23:29:39.339444   583 acceptor_pool.cc:254] collecting diagnostics on the listening RPC socket unix:/tmp/dist-test-taskp7Fqz4/test-tmp/rpc-test-9646f712e79d4422bfe4e2ddffeec455.sock every 8 connection(s)
I20260927 23:29:39.340137   584 acceptor_pool.cc:254] collecting diagnostics on the listening RPC socket unix:/tmp/dist-test-taskp7Fqz4/test-tmp/rpc-test-9646f712e79d4422bfe4e2ddffeec455.sock every 8 connection(s)
I20260927 23:29:39.343319   390 rpc-test.cc:532] Connecting to unix:/tmp/dist-test-taskp7Fqz4/test-tmp/rpc-test-9646f712e79d4422bfe4e2ddffeec455.sock
W20260927 23:29:42.395306   582 connection.cc:196] Error closing socket: Network error: TlsSocket::Close: Broken pipe
[       OK ] Parameters/TestRpc.TestConnectionAlwaysKeepalive/SSL_UnixSocket (3091 ms)
[ RUN      ] Parameters/TestRpc.TestReopenOutboundConnections/SSL_UnixSocket
I20260927 23:29:42.429790   606 acceptor_pool.cc:254] collecting diagnostics on the listening RPC socket unix:/tmp/dist-test-taskp7Fqz4/test-tmp/rpc-test-d14d45e957954174b809933fb5ae33d7.sock every 8 connection(s)
I20260927 23:29:42.430588   607 acceptor_pool.cc:254] collecting diagnostics on the listening RPC socket unix:/tmp/dist-test-taskp7Fqz4/test-tmp/rpc-test-d14d45e957954174b809933fb5ae33d7.sock every 8 connection(s)
I20260927 23:29:42.433789   390 rpc-test.cc:658] Connecting to unix:/tmp/dist-test-taskp7Fqz4/test-tmp/rpc-test-d14d45e957954174b809933fb5ae33d7.sock
W20260927 23:29:42.463707   605 connection.cc:196] Error closing socket: Network error: TlsSocket::Close: Broken pipe
W20260927 23:29:42.487996   605 connection.cc:196] Error closing socket: Network error: TlsSocket::Close: Broken pipe
W20260927 23:29:42.500056   605 connection.cc:196] Error closing socket: Network error: TlsSocket::Close: Broken pipe
W20260927 23:29:42.523274   605 connection.cc:196] Error closing socket: Network error: TlsSocket::Close: Broken pipe
W20260927 23:29:42.534876   605 connection.cc:196] Error closing socket: Network error: TlsSocket::Close: Broken pipe
W20260927 23:29:42.544795   605 connection.cc:196] Error closing socket: Network error: TlsSocket::Close: Broken pipe
W20260927 23:29:42.557750   605 connection.cc:196] Error closing socket: Network error: TlsSocket::Close: Broken pipe
W20260927 23:29:42.569773   605 connection.cc:196] Error closing socket: Network error: TlsSocket::Close: Broken pipe
W20260927 23:29:42.581652   605 connection.cc:196] Error closing socket: Network error: TlsSocket::Close: Broken pipe
W20260927 23:29:42.593570   605 connection.cc:196] Error closing socket: Network error: TlsSocket::Close: Broken pipe
W20260927 23:29:42.605086   605 connection.cc:196] Error closing socket: Network error: TlsSocket::Close: Broken pipe
W20260927 23:29:42.615890   605 connection.cc:196] Error closing socket: Network error: TlsSocket::Close: Broken pipe
W20260927 23:29:42.615983   606 acceptor_pool.cc:285] unable to collect diagnostics on RPC socket unix:/tmp/dist-test-taskp7Fqz4/test-tmp/rpc-test-d14d45e957954174b809933fb5ae33d7.sock: Not implemented: netlink diagnostics is currently supported only on IPv4 TCP sockets
W20260927 23:29:42.638387   605 connection.cc:196] Error closing socket: Network error: TlsSocket::Close: Broken pipe
W20260927 23:29:42.649829   605 connection.cc:196] Error closing socket: Network error: TlsSocket::Close: Broken pipe
W20260927 23:29:42.661787   605 connection.cc:196] Error closing socket: Network error: TlsSocket::Close: Broken pipe
W20260927 23:29:42.673518   605 connection.cc:196] Error closing socket: Network error: TlsSocket::Close: Broken pipe
W20260927 23:29:42.685657   605 connection.cc:196] Error closing socket: Network error: TlsSocket::Close: Broken pipe
W20260927 23:29:42.697494   605 connection.cc:196] Error closing socket: Network error: TlsSocket::Close: Broken pipe
W20260927 23:29:42.708933   605 connection.cc:196] Error closing socket: Network error: TlsSocket::Close: Broken pipe
W20260927 23:29:42.720618   605 connection.cc:196] Error closing socket: Network error: TlsSocket::Close: Broken pipe
W20260927 23:29:42.732306   605 connection.cc:196] Error closing socket: Network error: TlsSocket::Close: Broken pipe
W20260927 23:29:42.743811   605 connection.cc:196] Error closing socket: Network error: TlsSocket::Close: Broken pipe
W20260927 23:29:42.754896   605 connection.cc:196] Error closing socket: Network error: TlsSocket::Close: Broken pipe
W20260927 23:29:42.765950   605 connection.cc:196] Error closing socket: Network error: TlsSocket::Close: Broken pipe
W20260927 23:29:42.776486   605 connection.cc:196] Error closing socket: Network error: TlsSocket::Close: Broken pipe
W20260927 23:29:42.787104   605 connection.cc:196] Error closing socket: Network error: TlsSocket::Close: Broken pipe
W20260927 23:29:42.798204   605 connection.cc:196] Error closing socket: Network error: TlsSocket::Close: Broken pipe
W20260927 23:29:42.808084   605 connection.cc:196] Error closing socket: Network error: TlsSocket::Close: Broken pipe
W20260927 23:29:42.819814   605 connection.cc:196] Error closing socket: Network error: TlsSocket::Close: Broken pipe
[       OK ] Parameters/TestRpc.TestReopenOutboundConnections/SSL_UnixSocket (422 ms)
[ RUN      ] Parameters/TestRpc.TestConnectionNetworkPlane/SSL_UnixSocket
I20260927 23:29:42.845536   629 acceptor_pool.cc:254] collecting diagnostics on the listening RPC socket unix:/tmp/dist-test-taskp7Fqz4/test-tmp/rpc-test-8824eb72ffae46508ff24054d1285e88.sock every 8 connection(s)
I20260927 23:29:42.846320   630 acceptor_pool.cc:254] collecting diagnostics on the listening RPC socket unix:/tmp/dist-test-taskp7Fqz4/test-tmp/rpc-test-8824eb72ffae46508ff24054d1285e88.sock every 8 connection(s)
I20260927 23:29:42.849573   390 rpc-test.cc:772] Connecting to unix:/tmp/dist-test-taskp7Fqz4/test-tmp/rpc-test-8824eb72ffae46508ff24054d1285e88.sock
W20260927 23:29:42.901795   628 connection.cc:196] Error closing socket: Network error: TlsSocket::Close: Broken pipe
W20260927 23:29:42.902681   628 connection.cc:196] Error closing socket: Network error: TlsSocket::Close: Broken pipe
[       OK ] Parameters/TestRpc.TestConnectionNetworkPlane/SSL_UnixSocket (82 ms)
[ RUN      ] Parameters/TestRpc.TestTCPKeepalive/SSL_UnixSocket
I20260927 23:29:42.941959   654 acceptor_pool.cc:254] collecting diagnostics on the listening RPC socket unix:/tmp/dist-test-taskp7Fqz4/test-tmp/rpc-test-ae0d56b90ded46ebb8944741bce3e39e.sock every 8 connection(s)
I20260927 23:29:42.942750   655 acceptor_pool.cc:254] collecting diagnostics on the listening RPC socket unix:/tmp/dist-test-taskp7Fqz4/test-tmp/rpc-test-ae0d56b90ded46ebb8944741bce3e39e.sock every 8 connection(s)
I20260927 23:29:42.971029   658 rpc-test-base.h:222] got call: sleep_micros: 8000000 deferred: true
I20260927 23:29:50.976504   658 rpcz_store.cc:275] Call kudu.rpc.GenericCalculatorService.Sleep from unix:<unnamed> (request call id 0) took 8005 ms. Trace:
I20260927 23:29:50.976969   658 rpcz_store.cc:276] 0927 23:29:42.970813 (+     0us) service_pool.cc:170] Inserting onto call queue
0927 23:29:42.970971 (+   158us) service_pool.cc:227] Handling call
0927 23:29:50.976318 (+8005347us) inbound_call.cc:173] Queueing success response
Metrics: {}
W20260927 23:29:50.984416   651 connection.cc:196] Error closing socket: Network error: TlsSocket::Close: Broken pipe
[       OK ] Parameters/TestRpc.TestTCPKeepalive/SSL_UnixSocket (8086 ms)
[ RUN      ] Parameters/TestRpc.TestMaxSmallSidecars/SSL_UnixSocket
I20260927 23:29:51.026923   680 acceptor_pool.cc:254] collecting diagnostics on the listening RPC socket unix:/tmp/dist-test-taskp7Fqz4/test-tmp/rpc-test-8bde59522dcd49b891710a13cb2e1955.sock every 8 connection(s)
I20260927 23:29:51.027923   681 acceptor_pool.cc:254] collecting diagnostics on the listening RPC socket unix:/tmp/dist-test-taskp7Fqz4/test-tmp/rpc-test-8bde59522dcd49b891710a13cb2e1955.sock every 8 connection(s)
W20260927 23:29:51.200975   677 connection.cc:196] Error closing socket: Network error: TlsSocket::Close: Broken pipe
[       OK ] Parameters/TestRpc.TestMaxSmallSidecars/SSL_UnixSocket (213 ms)
[ RUN      ] Parameters/TestRpc.TestCallTimeout/SSL_UnixSocket
I20260927 23:29:51.236233   705 acceptor_pool.cc:254] collecting diagnostics on the listening RPC socket unix:/tmp/dist-test-taskp7Fqz4/test-tmp/rpc-test-9c95e923181048d78cc703e1456798a3.sock every 8 connection(s)
I20260927 23:29:51.236991   706 acceptor_pool.cc:254] collecting diagnostics on the listening RPC socket unix:/tmp/dist-test-taskp7Fqz4/test-tmp/rpc-test-9c95e923181048d78cc703e1456798a3.sock every 8 connection(s)
I20260927 23:29:51.296763   390 rpc-test-base.h:595] status: Timed out: connection negotiation to unix:/tmp/dist-test-taskp7Fqz4/test-tmp/rpc-test-9c95e923181048d78cc703e1456798a3.sock for RPC Sleep timed out after 0.000s (ON_OUTBOUND_QUEUE), seconds elapsed: 0.00273501
I20260927 23:29:51.305881   709 rpc-test-base.h:222] got call: sleep_micros: 700000
I20260927 23:29:51.497730   390 rpc-test-base.h:595] status: Timed out: Sleep RPC to unix:/tmp/dist-test-taskp7Fqz4/test-tmp/rpc-test-9c95e923181048d78cc703e1456798a3.sock timed out after 0.200s (SENT), seconds elapsed: 0.200623
I20260927 23:29:51.499287   708 rpc-test-base.h:222] got call: sleep_micros: 2000000
W20260927 23:29:52.006685   709 rpcz_store.cc:267] Call kudu.rpc.GenericCalculatorService.Sleep from unix:<unnamed> (request call id 1) took 701 ms (client timeout 200 ms). Trace:
W20260927 23:29:52.007097   709 rpcz_store.cc:269] 0927 23:29:51.305681 (+     0us) service_pool.cc:170] Inserting onto call queue
0927 23:29:51.305819 (+   138us) service_pool.cc:227] Handling call
0927 23:29:52.006630 (+700811us) inbound_call.cc:173] Queueing success response
Metrics: {}
I20260927 23:29:52.999799   390 rpc-test-base.h:595] status: Timed out: Sleep RPC to unix:/tmp/dist-test-taskp7Fqz4/test-tmp/rpc-test-9c95e923181048d78cc703e1456798a3.sock timed out after 1.500s (SENT), seconds elapsed: 1.50174
W20260927 23:29:53.500008   708 rpcz_store.cc:267] Call kudu.rpc.GenericCalculatorService.Sleep from unix:<unnamed> (request call id 2) took 2001 ms (client timeout 1500 ms). Trace:
W20260927 23:29:53.500454   708 rpcz_store.cc:269] 0927 23:29:51.498974 (+     0us) service_pool.cc:170] Inserting onto call queue
0927 23:29:51.499199 (+   225us) service_pool.cc:227] Handling call
0927 23:29:53.499948 (+2000749us) inbound_call.cc:173] Queueing success response
Metrics: {}
W20260927 23:29:53.501171   702 connection.cc:441] server connection from unix:<unnamed> torn down before Call kudu.rpc.GenericCalculatorService.Sleep from unix:<unnamed> (request call id 2) could send its response
[       OK ] Parameters/TestRpc.TestCallTimeout/SSL_UnixSocket (2299 ms)
[ RUN      ] Parameters/TestRpc.TestServerShutsDown/SSL_UnixSocket
I20260927 23:29:53.509047   390 rpc-test.cc:1125] Connecting to 0.0.0.0:36835
W20260927 23:29:53.519388   722 negotiation.cc:337] Failed RPC negotiation. Trace:
0927 23:29:53.517599 (+     0us) reactor.cc:625] Submitting negotiation task for client connection to 0.0.0.0:36835 (local address 127.0.0.1:39750)
0927 23:29:53.518141 (+   542us) negotiation.cc:107] Waiting for socket to connect
0927 23:29:53.518176 (+    35us) client_negotiation.cc:174] Beginning negotiation
0927 23:29:53.518512 (+   336us) client_negotiation.cc:252] Sending NEGOTIATE NegotiatePB request
0927 23:29:53.518779 (+   267us) negotiation.cc:327] Negotiation complete: Network error: Client connection negotiation failed: client connection to 0.0.0.0:36835: BlockingWrite error: write error: Broken pipe (error 32)
Metrics: {"client-negotiator.queue_time_us":153}
[       OK ] Parameters/TestRpc.TestServerShutsDown/SSL_UnixSocket (14 ms)
[ RUN      ] Parameters/TestRpc.TimedOutOnResponseMetric/SSL_UnixSocket
I20260927 23:29:53.541479   739 acceptor_pool.cc:254] collecting diagnostics on the listening RPC socket unix:/tmp/dist-test-taskp7Fqz4/test-tmp/rpc-test-9017a6897f904580b37e4ea663c2916c.sock every 8 connection(s)
I20260927 23:29:53.542155   740 acceptor_pool.cc:254] collecting diagnostics on the listening RPC socket unix:/tmp/dist-test-taskp7Fqz4/test-tmp/rpc-test-9017a6897f904580b37e4ea663c2916c.sock every 8 connection(s)
W20260927 23:29:53.793116   743 rpcz_store.cc:267] Call kudu.rpc_test.CalculatorService.Sleep from unix:<unnamed> (request call id 3) took 50 ms (client timeout 25 ms). Trace:
W20260927 23:29:53.793401   743 rpcz_store.cc:269] 0927 23:29:53.742511 (+     0us) service_pool.cc:170] Inserting onto call queue
0927 23:29:53.742632 (+   121us) service_pool.cc:227] Handling call
0927 23:29:53.793041 (+ 50409us) inbound_call.cc:173] Queueing success response
Related trace 'test_child':
Metrics: {"test_sleep_us":50000,"child_traces":[["test_child",{"related_trace_metric":1}]]}
W20260927 23:29:53.852802   743 rpcz_store.cc:267] Call kudu.rpc_test.CalculatorService.Sleep from unix:<unnamed> (request call id 4) took 50 ms (client timeout 50 ms). Trace:
W20260927 23:29:53.853310   743 rpcz_store.cc:269] 0927 23:29:53.802001 (+     0us) service_pool.cc:170] Inserting onto call queue
0927 23:29:53.802149 (+   148us) service_pool.cc:227] Handling call
0927 23:29:53.852709 (+ 50560us) inbound_call.cc:173] Queueing success response
Related trace 'test_child':
Metrics: {"test_sleep_us":50000,"child_traces":[["test_child",{"related_trace_metric":1}]]}
W20260927 23:29:53.855921   736 connection.cc:441] server connection from unix:<unnamed> torn down before Call kudu.rpc_test.CalculatorService.Sleep from unix:<unnamed> (request call id 4) could send its response
[       OK ] Parameters/TestRpc.TimedOutOnResponseMetric/SSL_UnixSocket (340 ms)
[ RUN      ] Parameters/TestRpc.AcceptorDispatchingTimesMetric/SSL_UnixSocket
I20260927 23:29:53.874835   764 acceptor_pool.cc:254] collecting diagnostics on the listening RPC socket 0.0.0.0:34075 every 8 connection(s)
I20260927 23:29:53.875499   765 acceptor_pool.cc:254] collecting diagnostics on the listening RPC socket 0.0.0.0:34075 every 8 connection(s)
W20260927 23:29:53.881517   760 negotiation.cc:337] Failed RPC negotiation. Trace:
0927 23:29:53.879374 (+     0us) reactor.cc:625] Submitting negotiation task for server connection from 127.0.0.1:44258 (local address 127.0.0.1:34075)
0927 23:29:53.880003 (+   629us) server_negotiation.cc:206] Beginning negotiation
0927 23:29:53.880032 (+    29us) server_negotiation.cc:399] Waiting for connection header
0927 23:29:53.880356 (+   324us) negotiation.cc:327] Negotiation complete: Network error: Server connection negotiation failed: server connection from 127.0.0.1:44258: BlockingRecv error: recv got EOF from 127.0.0.1:44258 (error 108)
Metrics: {"server-negotiator.queue_time_us":134}
[       OK ] Parameters/TestRpc.AcceptorDispatchingTimesMetric/SSL_UnixSocket (21 ms)
[ RUN      ] Parameters/TestRpc.TestRpcCallbackDestroysMessenger/SSL_UnixSocket
[       OK ] Parameters/TestRpc.TestRpcCallbackDestroysMessenger/SSL_UnixSocket (17 ms)
[ RUN      ] Parameters/TestRpc.TestApplicationFeatureFlag/SSL_UnixSocket
I20260927 23:29:53.920846   789 acceptor_pool.cc:254] collecting diagnostics on the listening RPC socket unix:/tmp/dist-test-taskp7Fqz4/test-tmp/rpc-test-efd67502d4cc4250a6bf0f3dc0185517.sock every 8 connection(s)
I20260927 23:29:53.921561   790 acceptor_pool.cc:254] collecting diagnostics on the listening RPC socket unix:/tmp/dist-test-taskp7Fqz4/test-tmp/rpc-test-efd67502d4cc4250a6bf0f3dc0185517.sock every 8 connection(s)
W20260927 23:29:53.950184   786 messenger.cc:357] Unable to handle RPC call: Not implemented: call requires unsupported application feature flags: 99
[       OK ] Parameters/TestRpc.TestApplicationFeatureFlag/SSL_UnixSocket (55 ms)
[ RUN      ] Parameters/TestRpc.TestCancellation/SSL_UnixSocket
I20260927 23:29:53.983712   814 acceptor_pool.cc:254] collecting diagnostics on the listening RPC socket unix:/tmp/dist-test-taskp7Fqz4/test-tmp/rpc-test-9b644b89efe94ceea0db580483cffeee.sock every 8 connection(s)
I20260927 23:29:53.984441   815 acceptor_pool.cc:254] collecting diagnostics on the listening RPC socket unix:/tmp/dist-test-taskp7Fqz4/test-tmp/rpc-test-9b644b89efe94ceea0db580483cffeee.sock every 8 connection(s)
I20260927 23:29:53.987578   390 rpc-test.cc:1648] Connecting to unix:/tmp/dist-test-taskp7Fqz4/test-tmp/rpc-test-9b644b89efe94ceea0db580483cffeee.sock
I20260927 23:29:54.097684   390 rpc-test-base.h:595] status: Aborted: Sleep RPC to unix:/tmp/dist-test-taskp7Fqz4/test-tmp/rpc-test-9b644b89efe94ceea0db580483cffeee.sock is cancelled in state READY, seconds elapsed: 0.000453012
I20260927 23:29:54.312760   390 rpc-test-base.h:595] status: Aborted: Sleep RPC to unix:/tmp/dist-test-taskp7Fqz4/test-tmp/rpc-test-9b644b89efe94ceea0db580483cffeee.sock is cancelled in state SENT, seconds elapsed: 0.00103259
I20260927 23:29:54.312974   817 rpc-test-base.h:222] got call: sleep_micros: 510000
I20260927 23:29:54.501673   390 rpc-test-base.h:595] status: Aborted: Sleep RPC to unix:/tmp/dist-test-taskp7Fqz4/test-tmp/rpc-test-9b644b89efe94ceea0db580483cffeee.sock is cancelled in state SENT, seconds elapsed: 0.000738466
I20260927 23:29:54.502061   816 rpc-test-base.h:222] got call: sleep_micros: 510000
I20260927 23:29:54.678417   390 rpc-test-base.h:595] status: Aborted: Sleep RPC to unix:/tmp/dist-test-taskp7Fqz4/test-tmp/rpc-test-9b644b89efe94ceea0db580483cffeee.sock is cancelled in state SENT, seconds elapsed: 0.000930721
W20260927 23:29:54.689410   818 rpcz_store.cc:267] Call kudu.rpc.GenericCalculatorService.Sleep from unix:<unnamed> (request call id 11) took 10 ms (client timeout 10 ms). Trace:
W20260927 23:29:54.689756   818 rpcz_store.cc:269] 0927 23:29:54.678555 (+     0us) service_pool.cc:170] Inserting onto call queue
0927 23:29:54.689138 (+ 10583us) service_pool.cc:214] Skipping call since client already timed out
0927 23:29:54.689220 (+    82us) inbound_call.cc:173] Queueing failure response
Metrics: {}
I20260927 23:29:54.690320   818 rpc-test-base.h:222] got call: sleep_micros: 1500000
W20260927 23:29:54.823663   817 rpcz_store.cc:267] Call kudu.rpc.GenericCalculatorService.Sleep from unix:<unnamed> (request call id 3) took 511 ms (client timeout 10 ms). Trace:
W20260927 23:29:54.823979   817 rpcz_store.cc:269] 0927 23:29:54.312783 (+     0us) service_pool.cc:170] Inserting onto call queue
0927 23:29:54.312898 (+   115us) service_pool.cc:227] Handling call
0927 23:29:54.823596 (+510698us) inbound_call.cc:173] Queueing success response
Metrics: {}
W20260927 23:29:55.012707   816 rpcz_store.cc:267] Call kudu.rpc.GenericCalculatorService.Sleep from unix:<unnamed> (request call id 7) took 510 ms (client timeout 10 ms). Trace:
W20260927 23:29:55.013021   816 rpcz_store.cc:269] 0927 23:29:54.501853 (+     0us) service_pool.cc:170] Inserting onto call queue
0927 23:29:54.502013 (+   160us) service_pool.cc:227] Handling call
0927 23:29:55.012645 (+510632us) inbound_call.cc:173] Queueing success response
Metrics: {}
I20260927 23:29:55.681027   390 rpc-test-base.h:595] status: Timed out: Sleep RPC to unix:/tmp/dist-test-taskp7Fqz4/test-tmp/rpc-test-9b644b89efe94ceea0db580483cffeee.sock timed out after 1.000s (SENT), seconds elapsed: 1.00208
I20260927 23:29:55.682936   816 rpc-test-base.h:222] got call: sleep_micros: 1500000
W20260927 23:29:56.191000   818 rpcz_store.cc:267] Call kudu.rpc.GenericCalculatorService.Sleep from unix:<unnamed> (request call id 12) took 1511 ms (client timeout 1000 ms). Trace:
W20260927 23:29:56.191466   818 rpcz_store.cc:269] 0927 23:29:54.679532 (+     0us) service_pool.cc:170] Inserting onto call queue
0927 23:29:54.690291 (+ 10759us) service_pool.cc:227] Handling call
0927 23:29:56.190826 (+1500535us) inbound_call.cc:173] Queueing success response
Metrics: {}
I20260927 23:29:56.683214   390 rpc-test-base.h:595] status: Timed out: Sleep RPC to unix:/tmp/dist-test-taskp7Fqz4/test-tmp/rpc-test-9b644b89efe94ceea0db580483cffeee.sock timed out after 1.000s (SENT), seconds elapsed: 1.0017
W20260927 23:29:56.684966   811 messenger.cc:357] Unable to handle RPC call: Not implemented: call requires unsupported application feature flags: 99, 1
W20260927 23:29:56.686877   811 messenger.cc:357] Unable to handle RPC call: Not implemented: call requires unsupported application feature flags: 99, 1
W20260927 23:29:56.933600   811 connection.cc:196] Error closing socket: Network error: TlsSocket::Close: Broken pipe
W20260927 23:29:57.183509   816 rpcz_store.cc:267] Call kudu.rpc.GenericCalculatorService.Sleep from unix:<unnamed> (request call id 13) took 1501 ms (client timeout 1000 ms). Trace:
W20260927 23:29:57.183799   816 rpcz_store.cc:269] 0927 23:29:55.682610 (+     0us) service_pool.cc:170] Inserting onto call queue
0927 23:29:55.682817 (+   207us) service_pool.cc:227] Handling call
0927 23:29:57.183462 (+1500645us) inbound_call.cc:173] Queueing success response
Metrics: {}
W20260927 23:29:57.184326   811 connection.cc:441] server connection from unix:<unnamed> torn down before Call kudu.rpc.GenericCalculatorService.Sleep from unix:<unnamed> (request call id 13) could send its response
[       OK ] Parameters/TestRpc.TestCancellation/SSL_UnixSocket (3235 ms)
[ RUN      ] Parameters/TestRpc.TestCancellationMultiThreads/SSL_UnixSocket
I20260927 23:29:57.234148   840 acceptor_pool.cc:254] collecting diagnostics on the listening RPC socket unix:/tmp/dist-test-taskp7Fqz4/test-tmp/rpc-test-2e6f46f04779433a8ef8c57e00d5a30f.sock every 8 connection(s)
I20260927 23:29:57.235093   841 acceptor_pool.cc:254] collecting diagnostics on the listening RPC socket unix:/tmp/dist-test-taskp7Fqz4/test-tmp/rpc-test-2e6f46f04779433a8ef8c57e00d5a30f.sock every 8 connection(s)
I20260927 23:29:57.238260   390 rpc-test.cc:1808] Connecting to unix:/tmp/dist-test-taskp7Fqz4/test-tmp/rpc-test-2e6f46f04779433a8ef8c57e00d5a30f.sock
I20260927 23:29:57.408702   854 test_util.cc:268] Using random seed: 1406542680
I20260927 23:29:57.410779   855 test_util.cc:268] Using random seed: 1406544834
I20260927 23:29:57.412222   856 test_util.cc:268] Using random seed: 1406546207
I20260927 23:29:57.413519   857 test_util.cc:268] Using random seed: 1406547552
I20260927 23:29:57.414981   858 test_util.cc:268] Using random seed: 1406548941
I20260927 23:29:57.416746   859 test_util.cc:268] Using random seed: 1406550708
I20260927 23:29:57.418809   860 test_util.cc:268] Using random seed: 1406552751
I20260927 23:29:57.420142   861 test_util.cc:268] Using random seed: 1406554116
I20260927 23:29:57.422690   862 test_util.cc:268] Using random seed: 1406556657
I20260927 23:29:57.424554   863 test_util.cc:268] Using random seed: 1406558520
I20260927 23:29:57.426163   864 test_util.cc:268] Using random seed: 1406560130
I20260927 23:29:57.427906   865 test_util.cc:268] Using random seed: 1406561443
I20260927 23:29:57.430055   866 test_util.cc:268] Using random seed: 1406563954
I20260927 23:29:57.432384   867 test_util.cc:268] Using random seed: 1406566262
I20260927 23:29:57.435150   868 test_util.cc:268] Using random seed: 1406569032
I20260927 23:29:57.437227   869 test_util.cc:268] Using random seed: 1406571094
I20260927 23:29:57.439477   870 test_util.cc:268] Using random seed: 1406573354
I20260927 23:29:57.442871   871 test_util.cc:268] Using random seed: 1406576746
I20260927 23:29:57.445772   872 test_util.cc:268] Using random seed: 1406579605
I20260927 23:29:57.447741   873 test_util.cc:268] Using random seed: 1406581531
I20260927 23:29:57.449725   874 test_util.cc:268] Using random seed: 1406583698
I20260927 23:29:57.452051   875 test_util.cc:268] Using random seed: 1406585248
I20260927 23:29:57.454638   876 test_util.cc:268] Using random seed: 1406588055
I20260927 23:29:57.456307   877 test_util.cc:268] Using random seed: 1406590200
I20260927 23:29:57.458402   878 test_util.cc:268] Using random seed: 1406592265
I20260927 23:29:57.460412   879 test_util.cc:268] Using random seed: 1406594323
I20260927 23:29:57.462407   880 test_util.cc:268] Using random seed: 1406596330
I20260927 23:29:57.464581   881 test_util.cc:268] Using random seed: 1406598461
I20260927 23:29:57.466631   882 test_util.cc:268] Using random seed: 1406600550
I20260927 23:29:57.468231   883 test_util.cc:268] Using random seed: 1406602156
W20260927 23:30:17.811038   837 connection.cc:196] Error closing socket: Network error: TlsSocket::Close: Broken pipe
[       OK ] Parameters/TestRpc.TestCancellationMultiThreads/SSL_UnixSocket (20637 ms)
[ RUN      ] Parameters/TestRpc.TestCallId/SSL_UnixSocket
I20260927 23:30:17.869405   897 acceptor_pool.cc:254] collecting diagnostics on the listening RPC socket unix:/tmp/dist-test-taskp7Fqz4/test-tmp/rpc-test-b3ceea892b1240d1b98f16cc0f11e1ad.sock every 8 connection(s)
I20260927 23:30:17.870291   898 acceptor_pool.cc:254] collecting diagnostics on the listening RPC socket unix:/tmp/dist-test-taskp7Fqz4/test-tmp/rpc-test-b3ceea892b1240d1b98f16cc0f11e1ad.sock every 8 connection(s)
W20260927 23:30:17.914044   894 connection.cc:196] Error closing socket: Network error: TlsSocket::Close: Broken pipe
[       OK ] Parameters/TestRpc.TestCallId/SSL_UnixSocket (89 ms)
[----------] 20 tests from Parameters/TestRpc (39308 ms total)

[----------] Global test environment tear-down
[==========] 21 tests from 2 test suites ran. (42478 ms total)
[  PASSED  ] 20 tests.
[  FAILED  ] 1 test, listed below:
[  FAILED  ] Parameters/TestRpc.TestCallWithChainCertAndRootCA/SSL_UnixSocket, where GetParam() = (true, true)

 1 FAILED TEST
I20260927 23:30:17.938671   390 logging.cc:424] LogThrottler /data0/somelongdirectorytoavoidrpathissues/src/kudu/src/kudu/rpc/acceptor_pool.cc:285: suppressed but not reported on 3 messages since previous log ~35 seconds ago