Diagnosed failure

DifferentRaces/RaceTest.TestStackTraceRaces/1: /home/jenkins-slave/workspace/build_and_test_flaky@2/src/kudu/util/debug-util-test.cc:398: Failure
Failed
Bad status: Timed out: thread did not respond: maybe it is blocking signals
I20260927 01:54:36.504820  7296 test_util.cc:182] -----------------------------------------------
I20260927 01:54:36.504966  7296 test_util.cc:183] Had failures, leaving test files at /tmp/dist-test-taskidlsNV/test-tmp/debug-util-test.0.DifferentRaces_RaceTest.TestStackTraceRaces_1.1790474063253907-7296-0

Full log

[==========] Running 13 tests from 2 test suites.
[----------] Global test environment set-up.
[----------] 9 tests from DebugUtilTest
[ RUN      ] DebugUtilTest.TestStackTrace
[       OK ] DebugUtilTest.TestStackTrace (17 ms)
[ RUN      ] DebugUtilTest.TestStackTraceInvalidTid
[       OK ] DebugUtilTest.TestStackTraceInvalidTid (1 ms)
[ RUN      ] DebugUtilTest.TestStackTraceSelf
[       OK ] DebugUtilTest.TestStackTraceSelf (23 ms)
[ RUN      ] DebugUtilTest.TestStackTraceMainThread
[       OK ] DebugUtilTest.TestStackTraceMainThread (22 ms)
[ RUN      ] DebugUtilTest.TestSignalStackTrace
WARNING: Logging before InitGoogleLogging() is written to STDERR
W20260927 01:54:23.375331  7296 debug-util.cc:317] signal handler for stack trace signal 1 is already in use: Kudu will not produce thread stack traces.
[       OK ] DebugUtilTest.TestSignalStackTrace (42 ms)
[ RUN      ] DebugUtilTest.TestSnapshot
W20260927 01:54:24.423256  7296 debug-util.cc:398] Leaking SignalData structure 0x7b0800002840 after lost signal to thread 7299
I20260927 01:54:24.424054  7296 debug-util-test.cc:242] 7316 test thread-731 (OK)
I20260927 01:54:24.424324  7296 debug-util-test.cc:245] 00000000002a54bf 00000000002a7aa7 00007f37e719597f 00007f37e7190fb8 0000000000322a97 00000000002c6a86 00000000002c6d3c 00007f37ea4c52ca 0000000000371438 00000000003713ae 0000000000356b08 000000000035a2a1 000000000035a259 000000000035a1e9 000000000035a1b1 00000000003594ad
I20260927 01:54:24.424506  7296 debug-util-test.cc:242] 7299 debug-util-test (Timed out: thread did not respond: maybe it is blocking signals)
I20260927 01:54:24.424708  7296 debug-util-test.cc:245] 
I20260927 01:54:24.424857  7296 debug-util-test.cc:242] 7331 test thread-733 (OK)
I20260927 01:54:24.424971  7296 debug-util-test.cc:242] 7330 test thread-733 (OK)
I20260927 01:54:24.425161  7296 debug-util-test.cc:242] 7303 test thread-730 (OK)
I20260927 01:54:24.425354  7296 debug-util-test.cc:242] 7304 test thread-730 (OK)
I20260927 01:54:24.425513  7296 debug-util-test.cc:242] 7305 test thread-730 (OK)
I20260927 01:54:24.425676  7296 debug-util-test.cc:242] 7306 test thread-730 (OK)
I20260927 01:54:24.425845  7296 debug-util-test.cc:242] 7307 test thread-730 (OK)
I20260927 01:54:24.426000  7296 debug-util-test.cc:242] 7308 test thread-730 (OK)
I20260927 01:54:24.426165  7296 debug-util-test.cc:242] 7309 test thread-730 (OK)
I20260927 01:54:24.426366  7296 debug-util-test.cc:242] 7310 test thread-731 (OK)
I20260927 01:54:24.426504  7296 debug-util-test.cc:242] 7311 test thread-731 (OK)
I20260927 01:54:24.426688  7296 debug-util-test.cc:242] 7312 test thread-731 (OK)
I20260927 01:54:24.426841  7296 debug-util-test.cc:242] 7313 test thread-731 (OK)
I20260927 01:54:24.426995  7296 debug-util-test.cc:242] 7314 test thread-731 (OK)
I20260927 01:54:24.427124  7296 debug-util-test.cc:242] 7315 test thread-731 (OK)
I20260927 01:54:24.427300  7296 debug-util-test.cc:242] 7332 test thread-733 (OK)
I20260927 01:54:24.427464  7296 debug-util-test.cc:242] 7317 test thread-731 (OK)
I20260927 01:54:24.427626  7296 debug-util-test.cc:242] 7318 test thread-731 (OK)
I20260927 01:54:24.427773  7296 debug-util-test.cc:242] 7319 test thread-731 (OK)
I20260927 01:54:24.427915  7296 debug-util-test.cc:242] 7320 test thread-732 (OK)
I20260927 01:54:24.428068  7296 debug-util-test.cc:242] 7321 test thread-732 (OK)
I20260927 01:54:24.428220  7296 debug-util-test.cc:242] 7322 test thread-732 (OK)
I20260927 01:54:24.428373  7296 debug-util-test.cc:242] 7323 test thread-732 (OK)
I20260927 01:54:24.428526  7296 debug-util-test.cc:242] 7324 test thread-732 (OK)
I20260927 01:54:24.428675  7296 debug-util-test.cc:242] 7325 test thread-732 (OK)
I20260927 01:54:24.428828  7296 debug-util-test.cc:242] 7326 test thread-732 (OK)
I20260927 01:54:24.428977  7296 debug-util-test.cc:242] 7327 test thread-732 (OK)
I20260927 01:54:24.429128  7296 debug-util-test.cc:242] 7328 test thread-732 (OK)
I20260927 01:54:24.429272  7296 debug-util-test.cc:242] 7329 test thread-732 (OK)
I20260927 01:54:24.429426  7296 debug-util-test.cc:245] 00000000002a54bf 00000000002a7aa7 00007f37e719597f 00007f37e7190fb8 0000000000322a97 00000000002c6a86 00000000002c6d3c 00007f37ea4c52ca 0000000000371438 00000000003713ae 0000000000356b08 000000000035a2a1 000000000035a259 000000000035a1e9 000000000035a1b1 00000000003594ad
I20260927 01:54:24.429610  7296 debug-util-test.cc:242] 7301 kernel-watcher- (OK)
I20260927 01:54:24.429776  7296 debug-util-test.cc:245] 00000000002a54bf 00000000002a7aa7 00007f37e719597f 00007f37e7190fb8 0000000000322a97 00000000002c6a86 00000000002c6d3c 00007f37ea4c52ca 0000000000371438 00000000003713ae 00007f37ea560b3e 00007f37ea562361 00007f37ea562319 00007f37ea5622a9 00007f37ea562271 00007f37ea56156d
I20260927 01:54:24.429967  7296 debug-util-test.cc:242] 7300 debug-util-test (OK)
I20260927 01:54:24.430624  7296 debug-util-test.cc:245] 00000000002a54bf 00000000002a7aa7 00007f37e719597f 00007f37e7194d4f 00000000002ca2a3 00007f37ea8daf0a 00007f37ea5b73b6 000000000037fa9b 000000000037fa33 000000000037f9a3 000000000037f77a 00000000002a537f 00007f37e718a6da 00007f37e6c9b61e
I20260927 01:54:24.430814  7296 debug-util-test.cc:242] 7296 debug-util-test (OK)
I20260927 01:54:24.430984  7296 debug-util-test.cc:245] 00000000002a84b3 00000000002fcbc4 00007f37ea4ab047 00007f37ea4c2920 00007f37ea4c8c28 00007f37ea4c624e 00007f37ea4c74a3 00000000003532d7 00007f37e80fcdff 00007f37e80daa01 00007f37e80dbd18 00007f37e80dccf4 00007f37e80f17e4 00007f37e80fdcbf 00007f37e80f0d9c 00000000003806eb
[       OK ] DebugUtilTest.TestSnapshot (1065 ms)
[ RUN      ] DebugUtilTest.Benchmark
I20260927 01:54:25.444924  7296 debug-util-test.cc:282] Throughput: 3389 dumps/second (symbolize=0)
I20260927 01:54:26.446702  7296 debug-util-test.cc:282] Throughput: 75 dumps/second (symbolize=1)
[       OK ] DebugUtilTest.Benchmark (2005 ms)
[ RUN      ] DebugUtilTest.TestThreadBlockingSignals
I20260927 01:54:26.487658  7296 debug-util-test.cc:419]     @           0x2a84b4  __tsan::ProcessPendingSignals()
    @           0x2c7128  __tsan::ScopedInterceptor::~ScopedInterceptor() at /home/jenkins-slave/workspace/build_and_test/thirdparty/src/llvm-11.0.0.src/projects/compiler-rt/lib/tsan/rtl/tsan_interceptors_posix.cpp:267
    @           0x34e509  operator new() at /home/jenkins-slave/workspace/build_and_test/thirdparty/src/llvm-11.0.0.src/projects/compiler-rt/lib/tsan/rtl/tsan_new_delete.cpp:64 (discriminator 4)
    @     0x7f37ea4adf57  std::__1::__libcpp_allocate() at ??:0
    @     0x7f37ea634bd3  std::__1::allocator<>::allocate() at ??:0
    @     0x7f37ea634a01  std::__1::allocator_traits<>::allocate() at ??:0
    @     0x7f37ea634127  std::__1::__hash_table<>::__construct_node_hash<>() at ??:0
    @     0x7f37ea633b12  std::__1::__hash_table<>::__emplace_unique_key_args<>() at ??:0
    @     0x7f37ea62a765  std::__1::unordered_map<>::operator[]() at ??:0
    @     0x7f37ea61f05e  kudu::ThreadMgr::AddThread() at ??:0
    @     0x7f37ea6217f9  kudu::Thread::SuperviseThread() at ??:0
    @           0x2a5380  __tsan_thread_start_func at /home/jenkins-slave/workspace/build_and_test/thirdparty/src/llvm-11.0.0.src/projects/compiler-rt/lib/tsan/rtl/tsan_interceptors_posix.cpp:959
    @     0x7f37e718a6db  start_thread at ??:0
    @     0x7f37e6c9b61f  clone at ??:0
I20260927 01:54:27.464913  7296 debug-util-test.cc:419]     @           0x2a84b4  __tsan::ProcessPendingSignals()
    @           0x2cf5a1  __interceptor_pthread_sigmask at /home/jenkins-slave/workspace/build_and_test/thirdparty/src/llvm-11.0.0.src/projects/compiler-rt/lib/tsan/rtl/tsan_interceptors_posix.cpp:267
    @           0x354a10  kudu::BlockSignalsThread() at /home/jenkins-slave/workspace/build_and_test_flaky@2/src/kudu/util/debug-util-test.cc:407
    @           0x37d677  _ZNSt3__18__invokeIRPFvvEJEEEDTclclsr3std3__1E7forwardIT_Efp_Espclsr3std3__1E7forwardIT0_Efp0_EEEOS4_DpOS5_ at /home/jenkins-slave/workspace/build_and_test_flaky@2/thirdparty/installed/tsan/include/c++/v1/type_traits:3905
    @           0x37d602  std::__1::__invoke_void_return_wrapper<>::__call<>() at /home/jenkins-slave/workspace/build_and_test_flaky@2/thirdparty/installed/tsan/include/c++/v1/__functional_base:349
    @           0x37d5c2  std::__1::__function::__alloc_func<>::operator()() at /home/jenkins-slave/workspace/build_and_test_flaky@2/thirdparty/installed/tsan/include/c++/v1/functional:1557
    @           0x37c25e  std::__1::__function::__func<>::operator()() at /home/jenkins-slave/workspace/build_and_test_flaky@2/thirdparty/installed/tsan/include/c++/v1/functional:1731
    @           0x3807f5  std::__1::__function::__value_func<>::operator()() at /home/jenkins-slave/workspace/build_and_test_flaky@2/thirdparty/installed/tsan/include/c++/v1/functional:1884
    @           0x38075a  std::__1::function<>::operator()() at /home/jenkins-slave/workspace/build_and_test_flaky@2/thirdparty/installed/tsan/include/c++/v1/functional:2556
    @     0x7f37ea62181b  kudu::Thread::SuperviseThread() at ??:0
    @           0x2a5380  __tsan_thread_start_func at /home/jenkins-slave/workspace/build_and_test/thirdparty/src/llvm-11.0.0.src/projects/compiler-rt/lib/tsan/rtl/tsan_interceptors_posix.cpp:959
    @     0x7f37e718a6db  start_thread at ??:0
    @     0x7f37e6c9b61f  clone at ??:0
I20260927 01:54:27.498098  7296 debug-util-test.cc:419]     @           0x2a54c0  __tsan::CallUserSignalHandler()
    @           0x2a7aa8  rtl_sigaction() at /home/jenkins-slave/workspace/build_and_test/thirdparty/src/llvm-11.0.0.src/projects/compiler-rt/lib/tsan/../sanitizer_common/sanitizer_atomic_clang_x86.h:81
    @     0x7f37e7195980  (unknown) at ??:0
    @     0x7f37e7194d50  __GI___nanosleep at ??:0
    @           0x2ca2a4  __interceptor_nanosleep at /home/jenkins-slave/workspace/build_and_test/thirdparty/src/llvm-11.0.0.src/projects/compiler-rt/lib/tsan/rtl/tsan_interceptors_posix.cpp:340
    @     0x7f37ea8daf0b  base::SleepForNanoseconds() at ??:0
    @     0x7f37ea5b73b7  kudu::SleepFor() at ??:0
    @           0x354a31  kudu::BlockSignalsThread() at /home/jenkins-slave/workspace/build_and_test_flaky@2/src/kudu/util/debug-util-test.cc:406
    @           0x37d677  _ZNSt3__18__invokeIRPFvvEJEEEDTclclsr3std3__1E7forwardIT_Efp_Espclsr3std3__1E7forwardIT0_Efp0_EEEOS4_DpOS5_ at /home/jenkins-slave/workspace/build_and_test_flaky@2/thirdparty/installed/tsan/include/c++/v1/type_traits:3905
    @           0x37d602  std::__1::__invoke_void_return_wrapper<>::__call<>() at /home/jenkins-slave/workspace/build_and_test_flaky@2/thirdparty/installed/tsan/include/c++/v1/__functional_base:349
    @           0x37d5c2  std::__1::__function::__alloc_func<>::operator()() at /home/jenkins-slave/workspace/build_and_test_flaky@2/thirdparty/installed/tsan/include/c++/v1/functional:1557
    @           0x37c25e  std::__1::__function::__func<>::operator()() at /home/jenkins-slave/workspace/build_and_test_flaky@2/thirdparty/installed/tsan/include/c++/v1/functional:1731
    @           0x3807f5  std::__1::__function::__value_func<>::operator()() at /home/jenkins-slave/workspace/build_and_test_flaky@2/thirdparty/installed/tsan/include/c++/v1/functional:1884
    @           0x38075a  std::__1::function<>::operator()() at /home/jenkins-slave/workspace/build_and_test_flaky@2/thirdparty/installed/tsan/include/c++/v1/functional:2556
    @     0x7f37ea62181b  kudu::Thread::SuperviseThread() at ??:0
    @           0x2a5380  __tsan_thread_start_func at /home/jenkins-slave/workspace/build_and_test/thirdparty/src/llvm-11.0.0.src/projects/compiler-rt/lib/tsan/rtl/tsan_interceptors_posix.cpp:959
I20260927 01:54:27.520560  7296 debug-util-test.cc:419]     @           0x2a54c0  __tsan::CallUserSignalHandler()
    @           0x2a7aa8  rtl_sigaction() at /home/jenkins-slave/workspace/build_and_test/thirdparty/src/llvm-11.0.0.src/projects/compiler-rt/lib/tsan/../sanitizer_common/sanitizer_atomic_clang_x86.h:81
    @     0x7f37e7195980  (unknown) at ??:0
    @     0x7f37e7194d50  __GI___nanosleep at ??:0
    @           0x2ca2a4  __interceptor_nanosleep at /home/jenkins-slave/workspace/build_and_test/thirdparty/src/llvm-11.0.0.src/projects/compiler-rt/lib/tsan/rtl/tsan_interceptors_posix.cpp:340
    @     0x7f37ea8daf0b  base::SleepForNanoseconds() at ??:0
    @     0x7f37ea5b73b7  kudu::SleepFor() at ??:0
    @           0x354a31  kudu::BlockSignalsThread() at /home/jenkins-slave/workspace/build_and_test_flaky@2/src/kudu/util/debug-util-test.cc:406
    @           0x37d677  _ZNSt3__18__invokeIRPFvvEJEEEDTclclsr3std3__1E7forwardIT_Efp_Espclsr3std3__1E7forwardIT0_Efp0_EEEOS4_DpOS5_ at /home/jenkins-slave/workspace/build_and_test_flaky@2/thirdparty/installed/tsan/include/c++/v1/type_traits:3905
    @           0x37d602  std::__1::__invoke_void_return_wrapper<>::__call<>() at /home/jenkins-slave/workspace/build_and_test_flaky@2/thirdparty/installed/tsan/include/c++/v1/__functional_base:349
    @           0x37d5c2  std::__1::__function::__alloc_func<>::operator()() at /home/jenkins-slave/workspace/build_and_test_flaky@2/thirdparty/installed/tsan/include/c++/v1/functional:1557
    @           0x37c25e  std::__1::__function::__func<>::operator()() at /home/jenkins-slave/workspace/build_and_test_flaky@2/thirdparty/installed/tsan/include/c++/v1/functional:1731
    @           0x3807f5  std::__1::__function::__value_func<>::operator()() at /home/jenkins-slave/workspace/build_and_test_flaky@2/thirdparty/installed/tsan/include/c++/v1/functional:1884
    @           0x38075a  std::__1::function<>::operator()() at /home/jenkins-slave/workspace/build_and_test_flaky@2/thirdparty/installed/tsan/include/c++/v1/functional:2556
    @     0x7f37ea62181b  kudu::Thread::SuperviseThread() at ??:0
    @           0x2a5380  __tsan_thread_start_func at /home/jenkins-slave/workspace/build_and_test/thirdparty/src/llvm-11.0.0.src/projects/compiler-rt/lib/tsan/rtl/tsan_interceptors_posix.cpp:959
I20260927 01:54:27.540978  7296 debug-util-test.cc:419]     @           0x2a54c0  __tsan::CallUserSignalHandler()
    @           0x2a7aa8  rtl_sigaction() at /home/jenkins-slave/workspace/build_and_test/thirdparty/src/llvm-11.0.0.src/projects/compiler-rt/lib/tsan/../sanitizer_common/sanitizer_atomic_clang_x86.h:81
    @     0x7f37e7195980  (unknown) at ??:0
    @     0x7f37e7194d50  __GI___nanosleep at ??:0
    @           0x2ca2a4  __interceptor_nanosleep at /home/jenkins-slave/workspace/build_and_test/thirdparty/src/llvm-11.0.0.src/projects/compiler-rt/lib/tsan/rtl/tsan_interceptors_posix.cpp:340
    @     0x7f37ea8daf0b  base::SleepForNanoseconds() at ??:0
    @     0x7f37ea5b73b7  kudu::SleepFor() at ??:0
    @           0x354a31  kudu::BlockSignalsThread() at /home/jenkins-slave/workspace/build_and_test_flaky@2/src/kudu/util/debug-util-test.cc:406
    @           0x37d677  _ZNSt3__18__invokeIRPFvvEJEEEDTclclsr3std3__1E7forwardIT_Efp_Espclsr3std3__1E7forwardIT0_Efp0_EEEOS4_DpOS5_ at /home/jenkins-slave/workspace/build_and_test_flaky@2/thirdparty/installed/tsan/include/c++/v1/type_traits:3905
    @           0x37d602  std::__1::__invoke_void_return_wrapper<>::__call<>() at /home/jenkins-slave/workspace/build_and_test_flaky@2/thirdparty/installed/tsan/include/c++/v1/__functional_base:349
    @           0x37d5c2  std::__1::__function::__alloc_func<>::operator()() at /home/jenkins-slave/workspace/build_and_test_flaky@2/thirdparty/installed/tsan/include/c++/v1/functional:1557
    @           0x37c25e  std::__1::__function::__func<>::operator()() at /home/jenkins-slave/workspace/build_and_test_flaky@2/thirdparty/installed/tsan/include/c++/v1/functional:1731
    @           0x3807f5  std::__1::__function::__value_func<>::operator()() at /home/jenkins-slave/workspace/build_and_test_flaky@2/thirdparty/installed/tsan/include/c++/v1/functional:1884
    @           0x38075a  std::__1::function<>::operator()() at /home/jenkins-slave/workspace/build_and_test_flaky@2/thirdparty/installed/tsan/include/c++/v1/functional:2556
    @     0x7f37ea62181b  kudu::Thread::SuperviseThread() at ??:0
    @           0x2a5380  __tsan_thread_start_func at /home/jenkins-slave/workspace/build_and_test/thirdparty/src/llvm-11.0.0.src/projects/compiler-rt/lib/tsan/rtl/tsan_interceptors_posix.cpp:959
I20260927 01:54:27.568522  7296 debug-util-test.cc:419]     @           0x2a54c0  __tsan::CallUserSignalHandler()
    @           0x2a7aa8  rtl_sigaction() at /home/jenkins-slave/workspace/build_and_test/thirdparty/src/llvm-11.0.0.src/projects/compiler-rt/lib/tsan/../sanitizer_common/sanitizer_atomic_clang_x86.h:81
    @     0x7f37e7195980  (unknown) at ??:0
    @     0x7f37e7194d50  __GI___nanosleep at ??:0
    @           0x2ca2a4  __interceptor_nanosleep at /home/jenkins-slave/workspace/build_and_test/thirdparty/src/llvm-11.0.0.src/projects/compiler-rt/lib/tsan/rtl/tsan_interceptors_posix.cpp:340
    @     0x7f37ea8daf0b  base::SleepForNanoseconds() at ??:0
    @     0x7f37ea5b73b7  kudu::SleepFor() at ??:0
    @           0x354a31  kudu::BlockSignalsThread() at /home/jenkins-slave/workspace/build_and_test_flaky@2/src/kudu/util/debug-util-test.cc:406
    @           0x37d677  _ZNSt3__18__invokeIRPFvvEJEEEDTclclsr3std3__1E7forwardIT_Efp_Espclsr3std3__1E7forwardIT0_Efp0_EEEOS4_DpOS5_ at /home/jenkins-slave/workspace/build_and_test_flaky@2/thirdparty/installed/tsan/include/c++/v1/type_traits:3905
    @           0x37d602  std::__1::__invoke_void_return_wrapper<>::__call<>() at /home/jenkins-slave/workspace/build_and_test_flaky@2/thirdparty/installed/tsan/include/c++/v1/__functional_base:349
    @           0x37d5c2  std::__1::__function::__alloc_func<>::operator()() at /home/jenkins-slave/workspace/build_and_test_flaky@2/thirdparty/installed/tsan/include/c++/v1/functional:1557
    @           0x37c25e  std::__1::__function::__func<>::operator()() at /home/jenkins-slave/workspace/build_and_test_flaky@2/thirdparty/installed/tsan/include/c++/v1/functional:1731
    @           0x3807f5  std::__1::__function::__value_func<>::operator()() at /home/jenkins-slave/workspace/build_and_test_flaky@2/thirdparty/installed/tsan/include/c++/v1/functional:1884
    @           0x38075a  std::__1::function<>::operator()() at /home/jenkins-slave/workspace/build_and_test_flaky@2/thirdparty/installed/tsan/include/c++/v1/functional:2556
    @     0x7f37ea62181b  kudu::Thread::SuperviseThread() at ??:0
    @           0x2a5380  __tsan_thread_start_func at /home/jenkins-slave/workspace/build_and_test/thirdparty/src/llvm-11.0.0.src/projects/compiler-rt/lib/tsan/rtl/tsan_interceptors_posix.cpp:959
I20260927 01:54:27.589756  7296 debug-util-test.cc:419]     @           0x2a54c0  __tsan::CallUserSignalHandler()
    @           0x2a7aa8  rtl_sigaction() at /home/jenkins-slave/workspace/build_and_test/thirdparty/src/llvm-11.0.0.src/projects/compiler-rt/lib/tsan/../sanitizer_common/sanitizer_atomic_clang_x86.h:81
    @     0x7f37e7195980  (unknown) at ??:0
    @     0x7f37e7194d50  __GI___nanosleep at ??:0
    @           0x2ca2a4  __interceptor_nanosleep at /home/jenkins-slave/workspace/build_and_test/thirdparty/src/llvm-11.0.0.src/projects/compiler-rt/lib/tsan/rtl/tsan_interceptors_posix.cpp:340
    @     0x7f37ea8daf0b  base::SleepForNanoseconds() at ??:0
    @     0x7f37ea5b73b7  kudu::SleepFor() at ??:0
    @           0x354a31  kudu::BlockSignalsThread() at /home/jenkins-slave/workspace/build_and_test_flaky@2/src/kudu/util/debug-util-test.cc:406
    @           0x37d677  _ZNSt3__18__invokeIRPFvvEJEEEDTclclsr3std3__1E7forwardIT_Efp_Espclsr3std3__1E7forwardIT0_Efp0_EEEOS4_DpOS5_ at /home/jenkins-slave/workspace/build_and_test_flaky@2/thirdparty/installed/tsan/include/c++/v1/type_traits:3905
    @           0x37d602  std::__1::__invoke_void_return_wrapper<>::__call<>() at /home/jenkins-slave/workspace/build_and_test_flaky@2/thirdparty/installed/tsan/include/c++/v1/__functional_base:349
    @           0x37d5c2  std::__1::__function::__alloc_func<>::operator()() at /home/jenkins-slave/workspace/build_and_test_flaky@2/thirdparty/installed/tsan/include/c++/v1/functional:1557
    @           0x37c25e  std::__1::__function::__func<>::operator()() at /home/jenkins-slave/workspace/build_and_test_flaky@2/thirdparty/installed/tsan/include/c++/v1/functional:1731
    @           0x3807f5  std::__1::__function::__value_func<>::operator()() at /home/jenkins-slave/workspace/build_and_test_flaky@2/thirdparty/installed/tsan/include/c++/v1/functional:1884
    @           0x38075a  std::__1::function<>::operator()() at /home/jenkins-slave/workspace/build_and_test_flaky@2/thirdparty/installed/tsan/include/c++/v1/functional:2556
    @     0x7f37ea62181b  kudu::Thread::SuperviseThread() at ??:0
    @           0x2a5380  __tsan_thread_start_func at /home/jenkins-slave/workspace/build_and_test/thirdparty/src/llvm-11.0.0.src/projects/compiler-rt/lib/tsan/rtl/tsan_interceptors_posix.cpp:959
I20260927 01:54:27.610718  7296 debug-util-test.cc:419]     @           0x2a54c0  __tsan::CallUserSignalHandler()
    @           0x2a7aa8  rtl_sigaction() at /home/jenkins-slave/workspace/build_and_test/thirdparty/src/llvm-11.0.0.src/projects/compiler-rt/lib/tsan/../sanitizer_common/sanitizer_atomic_clang_x86.h:81
    @     0x7f37e7195980  (unknown) at ??:0
    @     0x7f37e7194d50  __GI___nanosleep at ??:0
    @           0x2ca2a4  __interceptor_nanosleep at /home/jenkins-slave/workspace/build_and_test/thirdparty/src/llvm-11.0.0.src/projects/compiler-rt/lib/tsan/rtl/tsan_interceptors_posix.cpp:340
    @     0x7f37ea8daf0b  base::SleepForNanoseconds() at ??:0
    @     0x7f37ea5b73b7  kudu::SleepFor() at ??:0
    @           0x354a31  kudu::BlockSignalsThread() at /home/jenkins-slave/workspace/build_and_test_flaky@2/src/kudu/util/debug-util-test.cc:406
    @           0x37d677  _ZNSt3__18__invokeIRPFvvEJEEEDTclclsr3std3__1E7forwardIT_Efp_Espclsr3std3__1E7forwardIT0_Efp0_EEEOS4_DpOS5_ at /home/jenkins-slave/workspace/build_and_test_flaky@2/thirdparty/installed/tsan/include/c++/v1/type_traits:3905
    @           0x37d602  std::__1::__invoke_void_return_wrapper<>::__call<>() at /home/jenkins-slave/workspace/build_and_test_flaky@2/thirdparty/installed/tsan/include/c++/v1/__functional_base:349
    @           0x37d5c2  std::__1::__function::__alloc_func<>::operator()() at /home/jenkins-slave/workspace/build_and_test_flaky@2/thirdparty/installed/tsan/include/c++/v1/functional:1557
    @           0x37c25e  std::__1::__function::__func<>::operator()() at /home/jenkins-slave/workspace/build_and_test_flaky@2/thirdparty/installed/tsan/include/c++/v1/functional:1731
    @           0x3807f5  std::__1::__function::__value_func<>::operator()() at /home/jenkins-slave/workspace/build_and_test_flaky@2/thirdparty/installed/tsan/include/c++/v1/functional:1884
    @           0x38075a  std::__1::function<>::operator()() at /home/jenkins-slave/workspace/build_and_test_flaky@2/thirdparty/installed/tsan/include/c++/v1/functional:2556
    @     0x7f37ea62181b  kudu::Thread::SuperviseThread() at ??:0
    @           0x2a5380  __tsan_thread_start_func at /home/jenkins-slave/workspace/build_and_test/thirdparty/src/llvm-11.0.0.src/projects/compiler-rt/lib/tsan/rtl/tsan_interceptors_posix.cpp:959
I20260927 01:54:27.631222  7296 debug-util-test.cc:419]     @           0x2a54c0  __tsan::CallUserSignalHandler()
    @           0x2a7aa8  rtl_sigaction() at /home/jenkins-slave/workspace/build_and_test/thirdparty/src/llvm-11.0.0.src/projects/compiler-rt/lib/tsan/../sanitizer_common/sanitizer_atomic_clang_x86.h:81
    @     0x7f37e7195980  (unknown) at ??:0
    @     0x7f37e7194d50  __GI___nanosleep at ??:0
    @           0x2ca2a4  __interceptor_nanosleep at /home/jenkins-slave/workspace/build_and_test/thirdparty/src/llvm-11.0.0.src/projects/compiler-rt/lib/tsan/rtl/tsan_interceptors_posix.cpp:340
    @     0x7f37ea8daf0b  base::SleepForNanoseconds() at ??:0
    @     0x7f37ea5b73b7  kudu::SleepFor() at ??:0
    @           0x354a31  kudu::BlockSignalsThread() at /home/jenkins-slave/workspace/build_and_test_flaky@2/src/kudu/util/debug-util-test.cc:406
    @           0x37d677  _ZNSt3__18__invokeIRPFvvEJEEEDTclclsr3std3__1E7forwardIT_Efp_Espclsr3std3__1E7forwardIT0_Efp0_EEEOS4_DpOS5_ at /home/jenkins-slave/workspace/build_and_test_flaky@2/thirdparty/installed/tsan/include/c++/v1/type_traits:3905
    @           0x37d602  std::__1::__invoke_void_return_wrapper<>::__call<>() at /home/jenkins-slave/workspace/build_and_test_flaky@2/thirdparty/installed/tsan/include/c++/v1/__functional_base:349
    @           0x37d5c2  std::__1::__function::__alloc_func<>::operator()() at /home/jenkins-slave/workspace/build_and_test_flaky@2/thirdparty/installed/tsan/include/c++/v1/functional:1557
    @           0x37c25e  std::__1::__function::__func<>::operator()() at /home/jenkins-slave/workspace/build_and_test_flaky@2/thirdparty/installed/tsan/include/c++/v1/functional:1731
    @           0x3807f5  std::__1::__function::__value_func<>::operator()() at /home/jenkins-slave/workspace/build_and_test_flaky@2/thirdparty/installed/tsan/include/c++/v1/functional:1884
    @           0x38075a  std::__1::function<>::operator()() at /home/jenkins-slave/workspace/build_and_test_flaky@2/thirdparty/installed/tsan/include/c++/v1/functional:2556
    @     0x7f37ea62181b  kudu::Thread::SuperviseThread() at ??:0
    @           0x2a5380  __tsan_thread_start_func at /home/jenkins-slave/workspace/build_and_test/thirdparty/src/llvm-11.0.0.src/projects/compiler-rt/lib/tsan/rtl/tsan_interceptors_posix.cpp:959
I20260927 01:54:27.651945  7296 debug-util-test.cc:419]     @           0x2a54c0  __tsan::CallUserSignalHandler()
    @           0x2a7aa8  rtl_sigaction() at /home/jenkins-slave/workspace/build_and_test/thirdparty/src/llvm-11.0.0.src/projects/compiler-rt/lib/tsan/../sanitizer_common/sanitizer_atomic_clang_x86.h:81
    @     0x7f37e7195980  (unknown) at ??:0
    @     0x7f37e7194d50  __GI___nanosleep at ??:0
    @           0x2ca2a4  __interceptor_nanosleep at /home/jenkins-slave/workspace/build_and_test/thirdparty/src/llvm-11.0.0.src/projects/compiler-rt/lib/tsan/rtl/tsan_interceptors_posix.cpp:340
    @     0x7f37ea8daf0b  base::SleepForNanoseconds() at ??:0
    @     0x7f37ea5b73b7  kudu::SleepFor() at ??:0
    @           0x354a31  kudu::BlockSignalsThread() at /home/jenkins-slave/workspace/build_and_test_flaky@2/src/kudu/util/debug-util-test.cc:406
    @           0x37d677  _ZNSt3__18__invokeIRPFvvEJEEEDTclclsr3std3__1E7forwardIT_Efp_Espclsr3std3__1E7forwardIT0_Efp0_EEEOS4_DpOS5_ at /home/jenkins-slave/workspace/build_and_test_flaky@2/thirdparty/installed/tsan/include/c++/v1/type_traits:3905
    @           0x37d602  std::__1::__invoke_void_return_wrapper<>::__call<>() at /home/jenkins-slave/workspace/build_and_test_flaky@2/thirdparty/installed/tsan/include/c++/v1/__functional_base:349
    @           0x37d5c2  std::__1::__function::__alloc_func<>::operator()() at /home/jenkins-slave/workspace/build_and_test_flaky@2/thirdparty/installed/tsan/include/c++/v1/functional:1557
    @           0x37c25e  std::__1::__function::__func<>::operator()() at /home/jenkins-slave/workspace/build_and_test_flaky@2/thirdparty/installed/tsan/include/c++/v1/functional:1731
    @           0x3807f5  std::__1::__function::__value_func<>::operator()() at /home/jenkins-slave/workspace/build_and_test_flaky@2/thirdparty/installed/tsan/include/c++/v1/functional:1884
    @           0x38075a  std::__1::function<>::operator()() at /home/jenkins-slave/workspace/build_and_test_flaky@2/thirdparty/installed/tsan/include/c++/v1/functional:2556
    @     0x7f37ea62181b  kudu::Thread::SuperviseThread() at ??:0
    @           0x2a5380  __tsan_thread_start_func at /home/jenkins-slave/workspace/build_and_test/thirdparty/src/llvm-11.0.0.src/projects/compiler-rt/lib/tsan/rtl/tsan_interceptors_posix.cpp:959
I20260927 01:54:27.672358  7296 debug-util-test.cc:419]     @           0x2a54c0  __tsan::CallUserSignalHandler()
    @           0x2a7aa8  rtl_sigaction() at /home/jenkins-slave/workspace/build_and_test/thirdparty/src/llvm-11.0.0.src/projects/compiler-rt/lib/tsan/../sanitizer_common/sanitizer_atomic_clang_x86.h:81
    @     0x7f37e7195980  (unknown) at ??:0
    @     0x7f37e7194d50  __GI___nanosleep at ??:0
    @           0x2ca2a4  __interceptor_nanosleep at /home/jenkins-slave/workspace/build_and_test/thirdparty/src/llvm-11.0.0.src/projects/compiler-rt/lib/tsan/rtl/tsan_interceptors_posix.cpp:340
    @     0x7f37ea8daf0b  base::SleepForNanoseconds() at ??:0
    @     0x7f37ea5b73b7  kudu::SleepFor() at ??:0
    @           0x354a31  kudu::BlockSignalsThread() at /home/jenkins-slave/workspace/build_and_test_flaky@2/src/kudu/util/debug-util-test.cc:406
    @           0x37d677  _ZNSt3__18__invokeIRPFvvEJEEEDTclclsr3std3__1E7forwardIT_Efp_Espclsr3std3__1E7forwardIT0_Efp0_EEEOS4_DpOS5_ at /home/jenkins-slave/workspace/build_and_test_flaky@2/thirdparty/installed/tsan/include/c++/v1/type_traits:3905
    @           0x37d602  std::__1::__invoke_void_return_wrapper<>::__call<>() at /home/jenkins-slave/workspace/build_and_test_flaky@2/thirdparty/installed/tsan/include/c++/v1/__functional_base:349
    @           0x37d5c2  std::__1::__function::__alloc_func<>::operator()() at /home/jenkins-slave/workspace/build_and_test_flaky@2/thirdparty/installed/tsan/include/c++/v1/functional:1557
    @           0x37c25e  std::__1::__function::__func<>::operator()() at /home/jenkins-slave/workspace/build_and_test_flaky@2/thirdparty/installed/tsan/include/c++/v1/functional:1731
    @           0x3807f5  std::__1::__function::__value_func<>::operator()() at /home/jenkins-slave/workspace/build_and_test_flaky@2/thirdparty/installed/tsan/include/c++/v1/functional:1884
    @           0x38075a  std::__1::function<>::operator()() at /home/jenkins-slave/workspace/build_and_test_flaky@2/thirdparty/installed/tsan/include/c++/v1/functional:2556
    @     0x7f37ea62181b  kudu::Thread::SuperviseThread() at ??:0
    @           0x2a5380  __tsan_thread_start_func at /home/jenkins-slave/workspace/build_and_test/thirdparty/src/llvm-11.0.0.src/projects/compiler-rt/lib/tsan/rtl/tsan_interceptors_posix.cpp:959
I20260927 01:54:27.693411  7296 debug-util-test.cc:419]     @           0x2a54c0  __tsan::CallUserSignalHandler()
    @           0x2a7aa8  rtl_sigaction() at /home/jenkins-slave/workspace/build_and_test/thirdparty/src/llvm-11.0.0.src/projects/compiler-rt/lib/tsan/../sanitizer_common/sanitizer_atomic_clang_x86.h:81
    @     0x7f37e7195980  (unknown) at ??:0
    @     0x7f37e7194d50  __GI___nanosleep at ??:0
    @           0x2ca2a4  __interceptor_nanosleep at /home/jenkins-slave/workspace/build_and_test/thirdparty/src/llvm-11.0.0.src/projects/compiler-rt/lib/tsan/rtl/tsan_interceptors_posix.cpp:340
    @     0x7f37ea8daf0b  base::SleepForNanoseconds() at ??:0
    @     0x7f37ea5b73b7  kudu::SleepFor() at ??:0
    @           0x354a31  kudu::BlockSignalsThread() at /home/jenkins-slave/workspace/build_and_test_flaky@2/src/kudu/util/debug-util-test.cc:406
    @           0x37d677  _ZNSt3__18__invokeIRPFvvEJEEEDTclclsr3std3__1E7forwardIT_Efp_Espclsr3std3__1E7forwardIT0_Efp0_EEEOS4_DpOS5_ at /home/jenkins-slave/workspace/build_and_test_flaky@2/thirdparty/installed/tsan/include/c++/v1/type_traits:3905
    @           0x37d602  std::__1::__invoke_void_return_wrapper<>::__call<>() at /home/jenkins-slave/workspace/build_and_test_flaky@2/thirdparty/installed/tsan/include/c++/v1/__functional_base:349
    @           0x37d5c2  std::__1::__function::__alloc_func<>::operator()() at /home/jenkins-slave/workspace/build_and_test_flaky@2/thirdparty/installed/tsan/include/c++/v1/functional:1557
    @           0x37c25e  std::__1::__function::__func<>::operator()() at /home/jenkins-slave/workspace/build_and_test_flaky@2/thirdparty/installed/tsan/include/c++/v1/functional:1731
    @           0x3807f5  std::__1::__function::__value_func<>::operator()() at /home/jenkins-slave/workspace/build_and_test_flaky@2/thirdparty/installed/tsan/include/c++/v1/functional:1884
    @           0x38075a  std::__1::function<>::operator()() at /home/jenkins-slave/workspace/build_and_test_flaky@2/thirdparty/installed/tsan/include/c++/v1/functional:2556
    @     0x7f37ea62181b  kudu::Thread::SuperviseThread() at ??:0
    @           0x2a5380  __tsan_thread_start_func at /home/jenkins-slave/workspace/build_and_test/thirdparty/src/llvm-11.0.0.src/projects/compiler-rt/lib/tsan/rtl/tsan_interceptors_posix.cpp:959
I20260927 01:54:27.713999  7296 debug-util-test.cc:419]     @           0x2a54c0  __tsan::CallUserSignalHandler()
    @           0x2a7aa8  rtl_sigaction() at /home/jenkins-slave/workspace/build_and_test/thirdparty/src/llvm-11.0.0.src/projects/compiler-rt/lib/tsan/../sanitizer_common/sanitizer_atomic_clang_x86.h:81
    @     0x7f37e7195980  (unknown) at ??:0
    @     0x7f37e7194d50  __GI___nanosleep at ??:0
    @           0x2ca2a4  __interceptor_nanosleep at /home/jenkins-slave/workspace/build_and_test/thirdparty/src/llvm-11.0.0.src/projects/compiler-rt/lib/tsan/rtl/tsan_interceptors_posix.cpp:340
    @     0x7f37ea8daf0b  base::SleepForNanoseconds() at ??:0
    @     0x7f37ea5b73b7  kudu::SleepFor() at ??:0
    @           0x354a31  kudu::BlockSignalsThread() at /home/jenkins-slave/workspace/build_and_test_flaky@2/src/kudu/util/debug-util-test.cc:406
    @           0x37d677  _ZNSt3__18__invokeIRPFvvEJEEEDTclclsr3std3__1E7forwardIT_Efp_Espclsr3std3__1E7forwardIT0_Efp0_EEEOS4_DpOS5_ at /home/jenkins-slave/workspace/build_and_test_flaky@2/thirdparty/installed/tsan/include/c++/v1/type_traits:3905
    @           0x37d602  std::__1::__invoke_void_return_wrapper<>::__call<>() at /home/jenkins-slave/workspace/build_and_test_flaky@2/thirdparty/installed/tsan/include/c++/v1/__functional_base:349
    @           0x37d5c2  std::__1::__function::__alloc_func<>::operator()() at /home/jenkins-slave/workspace/build_and_test_flaky@2/thirdparty/installed/tsan/include/c++/v1/functional:1557
    @           0x37c25e  std::__1::__function::__func<>::operator()() at /home/jenkins-slave/workspace/build_and_test_flaky@2/thirdparty/installed/tsan/include/c++/v1/functional:1731
    @           0x3807f5  std::__1::__function::__value_func<>::operator()() at /home/jenkins-slave/workspace/build_and_test_flaky@2/thirdparty/installed/tsan/include/c++/v1/functional:1884
    @           0x38075a  std::__1::function<>::operator()() at /home/jenkins-slave/workspace/build_and_test_flaky@2/thirdparty/installed/tsan/include/c++/v1/functional:2556
    @     0x7f37ea62181b  kudu::Thread::SuperviseThread() at ??:0
    @           0x2a5380  __tsan_thread_start_func at /home/jenkins-slave/workspace/build_and_test/thirdparty/src/llvm-11.0.0.src/projects/compiler-rt/lib/tsan/rtl/tsan_interceptors_posix.cpp:959
I20260927 01:54:27.735301  7296 debug-util-test.cc:419]     @           0x2a54c0  __tsan::CallUserSignalHandler()
    @           0x2a7aa8  rtl_sigaction() at /home/jenkins-slave/workspace/build_and_test/thirdparty/src/llvm-11.0.0.src/projects/compiler-rt/lib/tsan/../sanitizer_common/sanitizer_atomic_clang_x86.h:81
    @     0x7f37e7195980  (unknown) at ??:0
    @     0x7f37e7194d50  __GI___nanosleep at ??:0
    @           0x2ca2a4  __interceptor_nanosleep at /home/jenkins-slave/workspace/build_and_test/thirdparty/src/llvm-11.0.0.src/projects/compiler-rt/lib/tsan/rtl/tsan_interceptors_posix.cpp:340
    @     0x7f37ea8daf0b  base::SleepForNanoseconds() at ??:0
    @     0x7f37ea5b73b7  kudu::SleepFor() at ??:0
    @           0x354a31  kudu::BlockSignalsThread() at /home/jenkins-slave/workspace/build_and_test_flaky@2/src/kudu/util/debug-util-test.cc:406
    @           0x37d677  _ZNSt3__18__invokeIRPFvvEJEEEDTclclsr3std3__1E7forwardIT_Efp_Espclsr3std3__1E7forwardIT0_Efp0_EEEOS4_DpOS5_ at /home/jenkins-slave/workspace/build_and_test_flaky@2/thirdparty/installed/tsan/include/c++/v1/type_traits:3905
    @           0x37d602  std::__1::__invoke_void_return_wrapper<>::__call<>() at /home/jenkins-slave/workspace/build_and_test_flaky@2/thirdparty/installed/tsan/include/c++/v1/__functional_base:349
    @           0x37d5c2  std::__1::__function::__alloc_func<>::operator()() at /home/jenkins-slave/workspace/build_and_test_flaky@2/thirdparty/installed/tsan/include/c++/v1/functional:1557
    @           0x37c25e  std::__1::__function::__func<>::operator()() at /home/jenkins-slave/workspace/build_and_test_flaky@2/thirdparty/installed/tsan/include/c++/v1/functional:1731
    @           0x3807f5  std::__1::__function::__value_func<>::operator()() at /home/jenkins-slave/workspace/build_and_test_flaky@2/thirdparty/installed/tsan/include/c++/v1/functional:1884
    @           0x38075a  std::__1::function<>::operator()() at /home/jenkins-slave/workspace/build_and_test_flaky@2/thirdparty/installed/tsan/include/c++/v1/functional:2556
    @     0x7f37ea62181b  kudu::Thread::SuperviseThread() at ??:0
    @           0x2a5380  __tsan_thread_start_func at /home/jenkins-slave/workspace/build_and_test/thirdparty/src/llvm-11.0.0.src/projects/compiler-rt/lib/tsan/rtl/tsan_interceptors_posix.cpp:959
I20260927 01:54:27.756966  7296 debug-util-test.cc:419]     @           0x2a54c0  __tsan::CallUserSignalHandler()
    @           0x2a7aa8  rtl_sigaction() at /home/jenkins-slave/workspace/build_and_test/thirdparty/src/llvm-11.0.0.src/projects/compiler-rt/lib/tsan/../sanitizer_common/sanitizer_atomic_clang_x86.h:81
    @     0x7f37e7195980  (unknown) at ??:0
    @     0x7f37e7194d50  __GI___nanosleep at ??:0
    @           0x2ca2a4  __interceptor_nanosleep at /home/jenkins-slave/workspace/build_and_test/thirdparty/src/llvm-11.0.0.src/projects/compiler-rt/lib/tsan/rtl/tsan_interceptors_posix.cpp:340
    @     0x7f37ea8daf0b  base::SleepForNanoseconds() at ??:0
    @     0x7f37ea5b73b7  kudu::SleepFor() at ??:0
    @           0x354a31  kudu::BlockSignalsThread() at /home/jenkins-slave/workspace/build_and_test_flaky@2/src/kudu/util/debug-util-test.cc:406
    @           0x37d677  _ZNSt3__18__invokeIRPFvvEJEEEDTclclsr3std3__1E7forwardIT_Efp_Espclsr3std3__1E7forwardIT0_Efp0_EEEOS4_DpOS5_ at /home/jenkins-slave/workspace/build_and_test_flaky@2/thirdparty/installed/tsan/include/c++/v1/type_traits:3905
    @           0x37d602  std::__1::__invoke_void_return_wrapper<>::__call<>() at /home/jenkins-slave/workspace/build_and_test_flaky@2/thirdparty/installed/tsan/include/c++/v1/__functional_base:349
    @           0x37d5c2  std::__1::__function::__alloc_func<>::operator()() at /home/jenkins-slave/workspace/build_and_test_flaky@2/thirdparty/installed/tsan/include/c++/v1/functional:1557
    @           0x37c25e  std::__1::__function::__func<>::operator()() at /home/jenkins-slave/workspace/build_and_test_flaky@2/thirdparty/installed/tsan/include/c++/v1/functional:1731
    @           0x3807f5  std::__1::__function::__value_func<>::operator()() at /home/jenkins-slave/workspace/build_and_test_flaky@2/thirdparty/installed/tsan/include/c++/v1/functional:1884
    @           0x38075a  std::__1::function<>::operator()() at /home/jenkins-slave/workspace/build_and_test_flaky@2/thirdparty/installed/tsan/include/c++/v1/functional:2556
    @     0x7f37ea62181b  kudu::Thread::SuperviseThread() at ??:0
    @           0x2a5380  __tsan_thread_start_func at /home/jenkins-slave/workspace/build_and_test/thirdparty/src/llvm-11.0.0.src/projects/compiler-rt/lib/tsan/rtl/tsan_interceptors_posix.cpp:959
I20260927 01:54:27.780076  7296 debug-util-test.cc:419]     @           0x2a54c0  __tsan::CallUserSignalHandler()
    @           0x2a7aa8  rtl_sigaction() at /home/jenkins-slave/workspace/build_and_test/thirdparty/src/llvm-11.0.0.src/projects/compiler-rt/lib/tsan/../sanitizer_common/sanitizer_atomic_clang_x86.h:81
    @     0x7f37e7195980  (unknown) at ??:0
    @     0x7f37e7194d50  __GI___nanosleep at ??:0
    @           0x2ca2a4  __interceptor_nanosleep at /home/jenkins-slave/workspace/build_and_test/thirdparty/src/llvm-11.0.0.src/projects/compiler-rt/lib/tsan/rtl/tsan_interceptors_posix.cpp:340
    @     0x7f37ea8daf0b  base::SleepForNanoseconds() at ??:0
    @     0x7f37ea5b73b7  kudu::SleepFor() at ??:0
    @           0x354a31  kudu::BlockSignalsThread() at /home/jenkins-slave/workspace/build_and_test_flaky@2/src/kudu/util/debug-util-test.cc:406
    @           0x37d677  _ZNSt3__18__invokeIRPFvvEJEEEDTclclsr3std3__1E7forwardIT_Efp_Espclsr3std3__1E7forwardIT0_Efp0_EEEOS4_DpOS5_ at /home/jenkins-slave/workspace/build_and_test_flaky@2/thirdparty/installed/tsan/include/c++/v1/type_traits:3905
    @           0x37d602  std::__1::__invoke_void_return_wrapper<>::__call<>() at /home/jenkins-slave/workspace/build_and_test_flaky@2/thirdparty/installed/tsan/include/c++/v1/__functional_base:349
    @           0x37d5c2  std::__1::__function::__alloc_func<>::operator()() at /home/jenkins-slave/workspace/build_and_test_flaky@2/thirdparty/installed/tsan/include/c++/v1/functional:1557
    @           0x37c25e  std::__1::__function::__func<>::operator()() at /home/jenkins-slave/workspace/build_and_test_flaky@2/thirdparty/installed/tsan/include/c++/v1/functional:1731
    @           0x3807f5  std::__1::__function::__value_func<>::operator()() at /home/jenkins-slave/workspace/build_and_test_flaky@2/thirdparty/installed/tsan/include/c++/v1/functional:1884
    @           0x38075a  std::__1::function<>::operator()() at /home/jenkins-slave/workspace/build_and_test_flaky@2/thirdparty/installed/tsan/include/c++/v1/functional:2556
    @     0x7f37ea62181b  kudu::Thread::SuperviseThread() at ??:0
    @           0x2a5380  __tsan_thread_start_func at /home/jenkins-slave/workspace/build_and_test/thirdparty/src/llvm-11.0.0.src/projects/compiler-rt/lib/tsan/rtl/tsan_interceptors_posix.cpp:959
I20260927 01:54:27.800953  7296 debug-util-test.cc:419]     @           0x2a54c0  __tsan::CallUserSignalHandler()
    @           0x2a7aa8  rtl_sigaction() at /home/jenkins-slave/workspace/build_and_test/thirdparty/src/llvm-11.0.0.src/projects/compiler-rt/lib/tsan/../sanitizer_common/sanitizer_atomic_clang_x86.h:81
    @     0x7f37e7195980  (unknown) at ??:0
    @     0x7f37e7194d50  __GI___nanosleep at ??:0
    @           0x2ca2a4  __interceptor_nanosleep at /home/jenkins-slave/workspace/build_and_test/thirdparty/src/llvm-11.0.0.src/projects/compiler-rt/lib/tsan/rtl/tsan_interceptors_posix.cpp:340
    @     0x7f37ea8daf0b  base::SleepForNanoseconds() at ??:0
    @     0x7f37ea5b73b7  kudu::SleepFor() at ??:0
    @           0x354a31  kudu::BlockSignalsThread() at /home/jenkins-slave/workspace/build_and_test_flaky@2/src/kudu/util/debug-util-test.cc:406
    @           0x37d677  _ZNSt3__18__invokeIRPFvvEJEEEDTclclsr3std3__1E7forwardIT_Efp_Espclsr3std3__1E7forwardIT0_Efp0_EEEOS4_DpOS5_ at /home/jenkins-slave/workspace/build_and_test_flaky@2/thirdparty/installed/tsan/include/c++/v1/type_traits:3905
    @           0x37d602  std::__1::__invoke_void_return_wrapper<>::__call<>() at /home/jenkins-slave/workspace/build_and_test_flaky@2/thirdparty/installed/tsan/include/c++/v1/__functional_base:349
    @           0x37d5c2  std::__1::__function::__alloc_func<>::operator()() at /home/jenkins-slave/workspace/build_and_test_flaky@2/thirdparty/installed/tsan/include/c++/v1/functional:1557
    @           0x37c25e  std::__1::__function::__func<>::operator()() at /home/jenkins-slave/workspace/build_and_test_flaky@2/thirdparty/installed/tsan/include/c++/v1/functional:1731
    @           0x3807f5  std::__1::__function::__value_func<>::operator()() at /home/jenkins-slave/workspace/build_and_test_flaky@2/thirdparty/installed/tsan/include/c++/v1/functional:1884
    @           0x38075a  std::__1::function<>::operator()() at /home/jenkins-slave/workspace/build_and_test_flaky@2/thirdparty/installed/tsan/include/c++/v1/functional:2556
    @     0x7f37ea62181b  kudu::Thread::SuperviseThread() at ??:0
    @           0x2a5380  __tsan_thread_start_func at /home/jenkins-slave/workspace/build_and_test/thirdparty/src/llvm-11.0.0.src/projects/compiler-rt/lib/tsan/rtl/tsan_interceptors_posix.cpp:959
I20260927 01:54:27.822835  7296 debug-util-test.cc:419]     @           0x2a54c0  __tsan::CallUserSignalHandler()
    @           0x2a7aa8  rtl_sigaction() at /home/jenkins-slave/workspace/build_and_test/thirdparty/src/llvm-11.0.0.src/projects/compiler-rt/lib/tsan/../sanitizer_common/sanitizer_atomic_clang_x86.h:81
    @     0x7f37e7195980  (unknown) at ??:0
    @     0x7f37e7194d50  __GI___nanosleep at ??:0
    @           0x2ca2a4  __interceptor_nanosleep at /home/jenkins-slave/workspace/build_and_test/thirdparty/src/llvm-11.0.0.src/projects/compiler-rt/lib/tsan/rtl/tsan_interceptors_posix.cpp:340
    @     0x7f37ea8daf0b  base::SleepForNanoseconds() at ??:0
    @     0x7f37ea5b73b7  kudu::SleepFor() at ??:0
    @           0x354a31  kudu::BlockSignalsThread() at /home/jenkins-slave/workspace/build_and_test_flaky@2/src/kudu/util/debug-util-test.cc:406
    @           0x37d677  _ZNSt3__18__invokeIRPFvvEJEEEDTclclsr3std3__1E7forwardIT_Efp_Espclsr3std3__1E7forwardIT0_Efp0_EEEOS4_DpOS5_ at /home/jenkins-slave/workspace/build_and_test_flaky@2/thirdparty/installed/tsan/include/c++/v1/type_traits:3905
    @           0x37d602  std::__1::__invoke_void_return_wrapper<>::__call<>() at /home/jenkins-slave/workspace/build_and_test_flaky@2/thirdparty/installed/tsan/include/c++/v1/__functional_base:349
    @           0x37d5c2  std::__1::__function::__alloc_func<>::operator()() at /home/jenkins-slave/workspace/build_and_test_flaky@2/thirdparty/installed/tsan/include/c++/v1/functional:1557
    @           0x37c25e  std::__1::__function::__func<>::operator()() at /home/jenkins-slave/workspace/build_and_test_flaky@2/thirdparty/installed/tsan/include/c++/v1/functional:1731
    @           0x3807f5  std::__1::__function::__value_func<>::operator()() at /home/jenkins-slave/workspace/build_and_test_flaky@2/thirdparty/installed/tsan/include/c++/v1/functional:1884
    @           0x38075a  std::__1::function<>::operator()() at /home/jenkins-slave/workspace/build_and_test_flaky@2/thirdparty/installed/tsan/include/c++/v1/functional:2556
    @     0x7f37ea62181b  kudu::Thread::SuperviseThread() at ??:0
    @           0x2a5380  __tsan_thread_start_func at /home/jenkins-slave/workspace/build_and_test/thirdparty/src/llvm-11.0.0.src/projects/compiler-rt/lib/tsan/rtl/tsan_interceptors_posix.cpp:959
I20260927 01:54:27.844619  7296 debug-util-test.cc:419]     @           0x2a54c0  __tsan::CallUserSignalHandler()
    @           0x2a7aa8  rtl_sigaction() at /home/jenkins-slave/workspace/build_and_test/thirdparty/src/llvm-11.0.0.src/projects/compiler-rt/lib/tsan/../sanitizer_common/sanitizer_atomic_clang_x86.h:81
    @     0x7f37e7195980  (unknown) at ??:0
    @     0x7f37e7194d50  __GI___nanosleep at ??:0
    @           0x2ca2a4  __interceptor_nanosleep at /home/jenkins-slave/workspace/build_and_test/thirdparty/src/llvm-11.0.0.src/projects/compiler-rt/lib/tsan/rtl/tsan_interceptors_posix.cpp:340
    @     0x7f37ea8daf0b  base::SleepForNanoseconds() at ??:0
    @     0x7f37ea5b73b7  kudu::SleepFor() at ??:0
    @           0x354a31  kudu::BlockSignalsThread() at /home/jenkins-slave/workspace/build_and_test_flaky@2/src/kudu/util/debug-util-test.cc:406
    @           0x37d677  _ZNSt3__18__invokeIRPFvvEJEEEDTclclsr3std3__1E7forwardIT_Efp_Espclsr3std3__1E7forwardIT0_Efp0_EEEOS4_DpOS5_ at /home/jenkins-slave/workspace/build_and_test_flaky@2/thirdparty/installed/tsan/include/c++/v1/type_traits:3905
    @           0x37d602  std::__1::__invoke_void_return_wrapper<>::__call<>() at /home/jenkins-slave/workspace/build_and_test_flaky@2/thirdparty/installed/tsan/include/c++/v1/__functional_base:349
    @           0x37d5c2  std::__1::__function::__alloc_func<>::operator()() at /home/jenkins-slave/workspace/build_and_test_flaky@2/thirdparty/installed/tsan/include/c++/v1/functional:1557
    @           0x37c25e  std::__1::__function::__func<>::operator()() at /home/jenkins-slave/workspace/build_and_test_flaky@2/thirdparty/installed/tsan/include/c++/v1/functional:1731
    @           0x3807f5  std::__1::__function::__value_func<>::operator()() at /home/jenkins-slave/workspace/build_and_test_flaky@2/thirdparty/installed/tsan/include/c++/v1/functional:1884
    @           0x38075a  std::__1::function<>::operator()() at /home/jenkins-slave/workspace/build_and_test_flaky@2/thirdparty/installed/tsan/include/c++/v1/functional:2556
    @     0x7f37ea62181b  kudu::Thread::SuperviseThread() at ??:0
    @           0x2a5380  __tsan_thread_start_func at /home/jenkins-slave/workspace/build_and_test/thirdparty/src/llvm-11.0.0.src/projects/compiler-rt/lib/tsan/rtl/tsan_interceptors_posix.cpp:959
I20260927 01:54:27.865010  7296 debug-util-test.cc:419]     @           0x2a54c0  __tsan::CallUserSignalHandler()
    @           0x2a7aa8  rtl_sigaction() at /home/jenkins-slave/workspace/build_and_test/thirdparty/src/llvm-11.0.0.src/projects/compiler-rt/lib/tsan/../sanitizer_common/sanitizer_atomic_clang_x86.h:81
    @     0x7f37e7195980  (unknown) at ??:0
    @     0x7f37e7194d50  __GI___nanosleep at ??:0
    @           0x2ca2a4  __interceptor_nanosleep at /home/jenkins-slave/workspace/build_and_test/thirdparty/src/llvm-11.0.0.src/projects/compiler-rt/lib/tsan/rtl/tsan_interceptors_posix.cpp:340
    @     0x7f37ea8daf0b  base::SleepForNanoseconds() at ??:0
    @     0x7f37ea5b73b7  kudu::SleepFor() at ??:0
    @           0x354a31  kudu::BlockSignalsThread() at /home/jenkins-slave/workspace/build_and_test_flaky@2/src/kudu/util/debug-util-test.cc:406
    @           0x37d677  _ZNSt3__18__invokeIRPFvvEJEEEDTclclsr3std3__1E7forwardIT_Efp_Espclsr3std3__1E7forwardIT0_Efp0_EEEOS4_DpOS5_ at /home/jenkins-slave/workspace/build_and_test_flaky@2/thirdparty/installed/tsan/include/c++/v1/type_traits:3905
    @           0x37d602  std::__1::__invoke_void_return_wrapper<>::__call<>() at /home/jenkins-slave/workspace/build_and_test_flaky@2/thirdparty/installed/tsan/include/c++/v1/__functional_base:349
    @           0x37d5c2  std::__1::__function::__alloc_func<>::operator()() at /home/jenkins-slave/workspace/build_and_test_flaky@2/thirdparty/installed/tsan/include/c++/v1/functional:1557
    @           0x37c25e  std::__1::__function::__func<>::operator()() at /home/jenkins-slave/workspace/build_and_test_flaky@2/thirdparty/installed/tsan/include/c++/v1/functional:1731
    @           0x3807f5  std::__1::__function::__value_func<>::operator()() at /home/jenkins-slave/workspace/build_and_test_flaky@2/thirdparty/installed/tsan/include/c++/v1/functional:1884
    @           0x38075a  std::__1::function<>::operator()() at /home/jenkins-slave/workspace/build_and_test_flaky@2/thirdparty/installed/tsan/include/c++/v1/functional:2556
    @     0x7f37ea62181b  kudu::Thread::SuperviseThread() at ??:0
    @           0x2a5380  __tsan_thread_start_func at /home/jenkins-slave/workspace/build_and_test/thirdparty/src/llvm-11.0.0.src/projects/compiler-rt/lib/tsan/rtl/tsan_interceptors_posix.cpp:959
I20260927 01:54:27.885414  7296 debug-util-test.cc:419]     @           0x2a54c0  __tsan::CallUserSignalHandler()
    @           0x2a7aa8  rtl_sigaction() at /home/jenkins-slave/workspace/build_and_test/thirdparty/src/llvm-11.0.0.src/projects/compiler-rt/lib/tsan/../sanitizer_common/sanitizer_atomic_clang_x86.h:81
    @     0x7f37e7195980  (unknown) at ??:0
    @     0x7f37e7194d50  __GI___nanosleep at ??:0
    @           0x2ca2a4  __interceptor_nanosleep at /home/jenkins-slave/workspace/build_and_test/thirdparty/src/llvm-11.0.0.src/projects/compiler-rt/lib/tsan/rtl/tsan_interceptors_posix.cpp:340
    @     0x7f37ea8daf0b  base::SleepForNanoseconds() at ??:0
    @     0x7f37ea5b73b7  kudu::SleepFor() at ??:0
    @           0x354a31  kudu::BlockSignalsThread() at /home/jenkins-slave/workspace/build_and_test_flaky@2/src/kudu/util/debug-util-test.cc:406
    @           0x37d677  _ZNSt3__18__invokeIRPFvvEJEEEDTclclsr3std3__1E7forwardIT_Efp_Espclsr3std3__1E7forwardIT0_Efp0_EEEOS4_DpOS5_ at /home/jenkins-slave/workspace/build_and_test_flaky@2/thirdparty/installed/tsan/include/c++/v1/type_traits:3905
    @           0x37d602  std::__1::__invoke_void_return_wrapper<>::__call<>() at /home/jenkins-slave/workspace/build_and_test_flaky@2/thirdparty/installed/tsan/include/c++/v1/__functional_base:349
    @           0x37d5c2  std::__1::__function::__alloc_func<>::operator()() at /home/jenkins-slave/workspace/build_and_test_flaky@2/thirdparty/installed/tsan/include/c++/v1/functional:1557
    @           0x37c25e  std::__1::__function::__func<>::operator()() at /home/jenkins-slave/workspace/build_and_test_flaky@2/thirdparty/installed/tsan/include/c++/v1/functional:1731
    @           0x3807f5  std::__1::__function::__value_func<>::operator()() at /home/jenkins-slave/workspace/build_and_test_flaky@2/thirdparty/installed/tsan/include/c++/v1/functional:1884
    @           0x38075a  std::__1::function<>::operator()() at /home/jenkins-slave/workspace/build_and_test_flaky@2/thirdparty/installed/tsan/include/c++/v1/functional:2556
    @     0x7f37ea62181b  kudu::Thread::SuperviseThread() at ??:0
    @           0x2a5380  __tsan_thread_start_func at /home/jenkins-slave/workspace/build_and_test/thirdparty/src/llvm-11.0.0.src/projects/compiler-rt/lib/tsan/rtl/tsan_interceptors_posix.cpp:959
I20260927 01:54:27.907807  7296 debug-util-test.cc:419]     @           0x2a54c0  __tsan::CallUserSignalHandler()
    @           0x2a7aa8  rtl_sigaction() at /home/jenkins-slave/workspace/build_and_test/thirdparty/src/llvm-11.0.0.src/projects/compiler-rt/lib/tsan/../sanitizer_common/sanitizer_atomic_clang_x86.h:81
    @     0x7f37e7195980  (unknown) at ??:0
    @     0x7f37e7194d50  __GI___nanosleep at ??:0
    @           0x2ca2a4  __interceptor_nanosleep at /home/jenkins-slave/workspace/build_and_test/thirdparty/src/llvm-11.0.0.src/projects/compiler-rt/lib/tsan/rtl/tsan_interceptors_posix.cpp:340
    @     0x7f37ea8daf0b  base::SleepForNanoseconds() at ??:0
    @     0x7f37ea5b73b7  kudu::SleepFor() at ??:0
    @           0x354a31  kudu::BlockSignalsThread() at /home/jenkins-slave/workspace/build_and_test_flaky@2/src/kudu/util/debug-util-test.cc:406
    @           0x37d677  _ZNSt3__18__invokeIRPFvvEJEEEDTclclsr3std3__1E7forwardIT_Efp_Espclsr3std3__1E7forwardIT0_Efp0_EEEOS4_DpOS5_ at /home/jenkins-slave/workspace/build_and_test_flaky@2/thirdparty/installed/tsan/include/c++/v1/type_traits:3905
    @           0x37d602  std::__1::__invoke_void_return_wrapper<>::__call<>() at /home/jenkins-slave/workspace/build_and_test_flaky@2/thirdparty/installed/tsan/include/c++/v1/__functional_base:349
    @           0x37d5c2  std::__1::__function::__alloc_func<>::operator()() at /home/jenkins-slave/workspace/build_and_test_flaky@2/thirdparty/installed/tsan/include/c++/v1/functional:1557
    @           0x37c25e  std::__1::__function::__func<>::operator()() at /home/jenkins-slave/workspace/build_and_test_flaky@2/thirdparty/installed/tsan/include/c++/v1/functional:1731
    @           0x3807f5  std::__1::__function::__value_func<>::operator()() at /home/jenkins-slave/workspace/build_and_test_flaky@2/thirdparty/installed/tsan/include/c++/v1/functional:1884
    @           0x38075a  std::__1::function<>::operator()() at /home/jenkins-slave/workspace/build_and_test_flaky@2/thirdparty/installed/tsan/include/c++/v1/functional:2556
    @     0x7f37ea62181b  kudu::Thread::SuperviseThread() at ??:0
    @           0x2a5380  __tsan_thread_start_func at /home/jenkins-slave/workspace/build_and_test/thirdparty/src/llvm-11.0.0.src/projects/compiler-rt/lib/tsan/rtl/tsan_interceptors_posix.cpp:959
I20260927 01:54:27.928136  7296 debug-util-test.cc:419]     @           0x2a54c0  __tsan::CallUserSignalHandler()
    @           0x2a7aa8  rtl_sigaction() at /home/jenkins-slave/workspace/build_and_test/thirdparty/src/llvm-11.0.0.src/projects/compiler-rt/lib/tsan/../sanitizer_common/sanitizer_atomic_clang_x86.h:81
    @     0x7f37e7195980  (unknown) at ??:0
    @     0x7f37e7194d50  __GI___nanosleep at ??:0
    @           0x2ca2a4  __interceptor_nanosleep at /home/jenkins-slave/workspace/build_and_test/thirdparty/src/llvm-11.0.0.src/projects/compiler-rt/lib/tsan/rtl/tsan_interceptors_posix.cpp:340
    @     0x7f37ea8daf0b  base::SleepForNanoseconds() at ??:0
    @     0x7f37ea5b73b7  kudu::SleepFor() at ??:0
    @           0x354a31  kudu::BlockSignalsThread() at /home/jenkins-slave/workspace/build_and_test_flaky@2/src/kudu/util/debug-util-test.cc:406
    @           0x37d677  _ZNSt3__18__invokeIRPFvvEJEEEDTclclsr3std3__1E7forwardIT_Efp_Espclsr3std3__1E7forwardIT0_Efp0_EEEOS4_DpOS5_ at /home/jenkins-slave/workspace/build_and_test_flaky@2/thirdparty/installed/tsan/include/c++/v1/type_traits:3905
    @           0x37d602  std::__1::__invoke_void_return_wrapper<>::__call<>() at /home/jenkins-slave/workspace/build_and_test_flaky@2/thirdparty/installed/tsan/include/c++/v1/__functional_base:349
    @           0x37d5c2  std::__1::__function::__alloc_func<>::operator()() at /home/jenkins-slave/workspace/build_and_test_flaky@2/thirdparty/installed/tsan/include/c++/v1/functional:1557
    @           0x37c25e  std::__1::__function::__func<>::operator()() at /home/jenkins-slave/workspace/build_and_test_flaky@2/thirdparty/installed/tsan/include/c++/v1/functional:1731
    @           0x3807f5  std::__1::__function::__value_func<>::operator()() at /home/jenkins-slave/workspace/build_and_test_flaky@2/thirdparty/installed/tsan/include/c++/v1/functional:1884
    @           0x38075a  std::__1::function<>::operator()() at /home/jenkins-slave/workspace/build_and_test_flaky@2/thirdparty/installed/tsan/include/c++/v1/functional:2556
    @     0x7f37ea62181b  kudu::Thread::SuperviseThread() at ??:0
    @           0x2a5380  __tsan_thread_start_func at /home/jenkins-slave/workspace/build_and_test/thirdparty/src/llvm-11.0.0.src/projects/compiler-rt/lib/tsan/rtl/tsan_interceptors_posix.cpp:959
I20260927 01:54:27.948182  7296 debug-util-test.cc:419]     @           0x2a54c0  __tsan::CallUserSignalHandler()
    @           0x2a7aa8  rtl_sigaction() at /home/jenkins-slave/workspace/build_and_test/thirdparty/src/llvm-11.0.0.src/projects/compiler-rt/lib/tsan/../sanitizer_common/sanitizer_atomic_clang_x86.h:81
    @     0x7f37e7195980  (unknown) at ??:0
    @     0x7f37e7194d50  __GI___nanosleep at ??:0
    @           0x2ca2a4  __interceptor_nanosleep at /home/jenkins-slave/workspace/build_and_test/thirdparty/src/llvm-11.0.0.src/projects/compiler-rt/lib/tsan/rtl/tsan_interceptors_posix.cpp:340
    @     0x7f37ea8daf0b  base::SleepForNanoseconds() at ??:0
    @     0x7f37ea5b73b7  kudu::SleepFor() at ??:0
    @           0x354a31  kudu::BlockSignalsThread() at /home/jenkins-slave/workspace/build_and_test_flaky@2/src/kudu/util/debug-util-test.cc:406
    @           0x37d677  _ZNSt3__18__invokeIRPFvvEJEEEDTclclsr3std3__1E7forwardIT_Efp_Espclsr3std3__1E7forwardIT0_Efp0_EEEOS4_DpOS5_ at /home/jenkins-slave/workspace/build_and_test_flaky@2/thirdparty/installed/tsan/include/c++/v1/type_traits:3905
    @           0x37d602  std::__1::__invoke_void_return_wrapper<>::__call<>() at /home/jenkins-slave/workspace/build_and_test_flaky@2/thirdparty/installed/tsan/include/c++/v1/__functional_base:349
    @           0x37d5c2  std::__1::__function::__alloc_func<>::operator()() at /home/jenkins-slave/workspace/build_and_test_flaky@2/thirdparty/installed/tsan/include/c++/v1/functional:1557
    @           0x37c25e  std::__1::__function::__func<>::operator()() at /home/jenkins-slave/workspace/build_and_test_flaky@2/thirdparty/installed/tsan/include/c++/v1/functional:1731
    @           0x3807f5  std::__1::__function::__value_func<>::operator()() at /home/jenkins-slave/workspace/build_and_test_flaky@2/thirdparty/installed/tsan/include/c++/v1/functional:1884
    @           0x38075a  std::__1::function<>::operator()() at /home/jenkins-slave/workspace/build_and_test_flaky@2/thirdparty/installed/tsan/include/c++/v1/functional:2556
    @     0x7f37ea62181b  kudu::Thread::SuperviseThread() at ??:0
    @           0x2a5380  __tsan_thread_start_func at /home/jenkins-slave/workspace/build_and_test/thirdparty/src/llvm-11.0.0.src/projects/compiler-rt/lib/tsan/rtl/tsan_interceptors_posix.cpp:959
I20260927 01:54:27.968860  7296 debug-util-test.cc:419]     @           0x2a54c0  __tsan::CallUserSignalHandler()
    @           0x2a7aa8  rtl_sigaction() at /home/jenkins-slave/workspace/build_and_test/thirdparty/src/llvm-11.0.0.src/projects/compiler-rt/lib/tsan/../sanitizer_common/sanitizer_atomic_clang_x86.h:81
    @     0x7f37e7195980  (unknown) at ??:0
    @     0x7f37e7194d50  __GI___nanosleep at ??:0
    @           0x2ca2a4  __interceptor_nanosleep at /home/jenkins-slave/workspace/build_and_test/thirdparty/src/llvm-11.0.0.src/projects/compiler-rt/lib/tsan/rtl/tsan_interceptors_posix.cpp:340
    @     0x7f37ea8daf0b  base::SleepForNanoseconds() at ??:0
    @     0x7f37ea5b73b7  kudu::SleepFor() at ??:0
    @           0x354a31  kudu::BlockSignalsThread() at /home/jenkins-slave/workspace/build_and_test_flaky@2/src/kudu/util/debug-util-test.cc:406
    @           0x37d677  _ZNSt3__18__invokeIRPFvvEJEEEDTclclsr3std3__1E7forwardIT_Efp_Espclsr3std3__1E7forwardIT0_Efp0_EEEOS4_DpOS5_ at /home/jenkins-slave/workspace/build_and_test_flaky@2/thirdparty/installed/tsan/include/c++/v1/type_traits:3905
    @           0x37d602  std::__1::__invoke_void_return_wrapper<>::__call<>() at /home/jenkins-slave/workspace/build_and_test_flaky@2/thirdparty/installed/tsan/include/c++/v1/__functional_base:349
    @           0x37d5c2  std::__1::__function::__alloc_func<>::operator()() at /home/jenkins-slave/workspace/build_and_test_flaky@2/thirdparty/installed/tsan/include/c++/v1/functional:1557
    @           0x37c25e  std::__1::__function::__func<>::operator()() at /home/jenkins-slave/workspace/build_and_test_flaky@2/thirdparty/installed/tsan/include/c++/v1/functional:1731
    @           0x3807f5  std::__1::__function::__value_func<>::operator()() at /home/jenkins-slave/workspace/build_and_test_flaky@2/thirdparty/installed/tsan/include/c++/v1/functional:1884
    @           0x38075a  std::__1::function<>::operator()() at /home/jenkins-slave/workspace/build_and_test_flaky@2/thirdparty/installed/tsan/include/c++/v1/functional:2556
    @     0x7f37ea62181b  kudu::Thread::SuperviseThread() at ??:0
    @           0x2a5380  __tsan_thread_start_func at /home/jenkins-slave/workspace/build_and_test/thirdparty/src/llvm-11.0.0.src/projects/compiler-rt/lib/tsan/rtl/tsan_interceptors_posix.cpp:959
I20260927 01:54:27.989271  7296 debug-util-test.cc:419]     @           0x2a54c0  __tsan::CallUserSignalHandler()
    @           0x2a7aa8  rtl_sigaction() at /home/jenkins-slave/workspace/build_and_test/thirdparty/src/llvm-11.0.0.src/projects/compiler-rt/lib/tsan/../sanitizer_common/sanitizer_atomic_clang_x86.h:81
    @     0x7f37e7195980  (unknown) at ??:0
    @     0x7f37e7194d50  __GI___nanosleep at ??:0
    @           0x2ca2a4  __interceptor_nanosleep at /home/jenkins-slave/workspace/build_and_test/thirdparty/src/llvm-11.0.0.src/projects/compiler-rt/lib/tsan/rtl/tsan_interceptors_posix.cpp:340
    @     0x7f37ea8daf0b  base::SleepForNanoseconds() at ??:0
    @     0x7f37ea5b73b7  kudu::SleepFor() at ??:0
    @           0x354a31  kudu::BlockSignalsThread() at /home/jenkins-slave/workspace/build_and_test_flaky@2/src/kudu/util/debug-util-test.cc:406
    @           0x37d677  _ZNSt3__18__invokeIRPFvvEJEEEDTclclsr3std3__1E7forwardIT_Efp_Espclsr3std3__1E7forwardIT0_Efp0_EEEOS4_DpOS5_ at /home/jenkins-slave/workspace/build_and_test_flaky@2/thirdparty/installed/tsan/include/c++/v1/type_traits:3905
    @           0x37d602  std::__1::__invoke_void_return_wrapper<>::__call<>() at /home/jenkins-slave/workspace/build_and_test_flaky@2/thirdparty/installed/tsan/include/c++/v1/__functional_base:349
    @           0x37d5c2  std::__1::__function::__alloc_func<>::operator()() at /home/jenkins-slave/workspace/build_and_test_flaky@2/thirdparty/installed/tsan/include/c++/v1/functional:1557
    @           0x37c25e  std::__1::__function::__func<>::operator()() at /home/jenkins-slave/workspace/build_and_test_flaky@2/thirdparty/installed/tsan/include/c++/v1/functional:1731
    @           0x3807f5  std::__1::__function::__value_func<>::operator()() at /home/jenkins-slave/workspace/build_and_test_flaky@2/thirdparty/installed/tsan/include/c++/v1/functional:1884
    @           0x38075a  std::__1::function<>::operator()() at /home/jenkins-slave/workspace/build_and_test_flaky@2/thirdparty/installed/tsan/include/c++/v1/functional:2556
    @     0x7f37ea62181b  kudu::Thread::SuperviseThread() at ??:0
    @           0x2a5380  __tsan_thread_start_func at /home/jenkins-slave/workspace/build_and_test/thirdparty/src/llvm-11.0.0.src/projects/compiler-rt/lib/tsan/rtl/tsan_interceptors_posix.cpp:959
I20260927 01:54:28.010174  7296 debug-util-test.cc:419]     @           0x2a54c0  __tsan::CallUserSignalHandler()
    @           0x2a7aa8  rtl_sigaction() at /home/jenkins-slave/workspace/build_and_test/thirdparty/src/llvm-11.0.0.src/projects/compiler-rt/lib/tsan/../sanitizer_common/sanitizer_atomic_clang_x86.h:81
    @     0x7f37e7195980  (unknown) at ??:0
    @     0x7f37e7194d50  __GI___nanosleep at ??:0
    @           0x2ca2a4  __interceptor_nanosleep at /home/jenkins-slave/workspace/build_and_test/thirdparty/src/llvm-11.0.0.src/projects/compiler-rt/lib/tsan/rtl/tsan_interceptors_posix.cpp:340
    @     0x7f37ea8daf0b  base::SleepForNanoseconds() at ??:0
    @     0x7f37ea5b73b7  kudu::SleepFor() at ??:0
    @           0x354a31  kudu::BlockSignalsThread() at /home/jenkins-slave/workspace/build_and_test_flaky@2/src/kudu/util/debug-util-test.cc:406
    @           0x37d677  _ZNSt3__18__invokeIRPFvvEJEEEDTclclsr3std3__1E7forwardIT_Efp_Espclsr3std3__1E7forwardIT0_Efp0_EEEOS4_DpOS5_ at /home/jenkins-slave/workspace/build_and_test_flaky@2/thirdparty/installed/tsan/include/c++/v1/type_traits:3905
    @           0x37d602  std::__1::__invoke_void_return_wrapper<>::__call<>() at /home/jenkins-slave/workspace/build_and_test_flaky@2/thirdparty/installed/tsan/include/c++/v1/__functional_base:349
    @           0x37d5c2  std::__1::__function::__alloc_func<>::operator()() at /home/jenkins-slave/workspace/build_and_test_flaky@2/thirdparty/installed/tsan/include/c++/v1/functional:1557
    @           0x37c25e  std::__1::__function::__func<>::operator()() at /home/jenkins-slave/workspace/build_and_test_flaky@2/thirdparty/installed/tsan/include/c++/v1/functional:1731
    @           0x3807f5  std::__1::__function::__value_func<>::operator()() at /home/jenkins-slave/workspace/build_and_test_flaky@2/thirdparty/installed/tsan/include/c++/v1/functional:1884
    @           0x38075a  std::__1::function<>::operator()() at /home/jenkins-slave/workspace/build_and_test_flaky@2/thirdparty/installed/tsan/include/c++/v1/functional:2556
    @     0x7f37ea62181b  kudu::Thread::SuperviseThread() at ??:0
    @           0x2a5380  __tsan_thread_start_func at /home/jenkins-slave/workspace/build_and_test/thirdparty/src/llvm-11.0.0.src/projects/compiler-rt/lib/tsan/rtl/tsan_interceptors_posix.cpp:959
I20260927 01:54:28.030536  7296 debug-util-test.cc:419]     @           0x2a54c0  __tsan::CallUserSignalHandler()
    @           0x2a7aa8  rtl_sigaction() at /home/jenkins-slave/workspace/build_and_test/thirdparty/src/llvm-11.0.0.src/projects/compiler-rt/lib/tsan/../sanitizer_common/sanitizer_atomic_clang_x86.h:81
    @     0x7f37e7195980  (unknown) at ??:0
    @     0x7f37e7194d50  __GI___nanosleep at ??:0
    @           0x2ca2a4  __interceptor_nanosleep at /home/jenkins-slave/workspace/build_and_test/thirdparty/src/llvm-11.0.0.src/projects/compiler-rt/lib/tsan/rtl/tsan_interceptors_posix.cpp:340
    @     0x7f37ea8daf0b  base::SleepForNanoseconds() at ??:0
    @     0x7f37ea5b73b7  kudu::SleepFor() at ??:0
    @           0x354a31  kudu::BlockSignalsThread() at /home/jenkins-slave/workspace/build_and_test_flaky@2/src/kudu/util/debug-util-test.cc:406
    @           0x37d677  _ZNSt3__18__invokeIRPFvvEJEEEDTclclsr3std3__1E7forwardIT_Efp_Espclsr3std3__1E7forwardIT0_Efp0_EEEOS4_DpOS5_ at /home/jenkins-slave/workspace/build_and_test_flaky@2/thirdparty/installed/tsan/include/c++/v1/type_traits:3905
    @           0x37d602  std::__1::__invoke_void_return_wrapper<>::__call<>() at /home/jenkins-slave/workspace/build_and_test_flaky@2/thirdparty/installed/tsan/include/c++/v1/__functional_base:349
    @           0x37d5c2  std::__1::__function::__alloc_func<>::operator()() at /home/jenkins-slave/workspace/build_and_test_flaky@2/thirdparty/installed/tsan/include/c++/v1/functional:1557
    @           0x37c25e  std::__1::__function::__func<>::operator()() at /home/jenkins-slave/workspace/build_and_test_flaky@2/thirdparty/installed/tsan/include/c++/v1/functional:1731
    @           0x3807f5  std::__1::__function::__value_func<>::operator()() at /home/jenkins-slave/workspace/build_and_test_flaky@2/thirdparty/installed/tsan/include/c++/v1/functional:1884
    @           0x38075a  std::__1::function<>::operator()() at /home/jenkins-slave/workspace/build_and_test_flaky@2/thirdparty/installed/tsan/include/c++/v1/functional:2556
    @     0x7f37ea62181b  kudu::Thread::SuperviseThread() at ??:0
    @           0x2a5380  __tsan_thread_start_func at /home/jenkins-slave/workspace/build_and_test/thirdparty/src/llvm-11.0.0.src/projects/compiler-rt/lib/tsan/rtl/tsan_interceptors_posix.cpp:959
I20260927 01:54:28.050663  7296 debug-util-test.cc:419]     @           0x2a54c0  __tsan::CallUserSignalHandler()
    @           0x2a7aa8  rtl_sigaction() at /home/jenkins-slave/workspace/build_and_test/thirdparty/src/llvm-11.0.0.src/projects/compiler-rt/lib/tsan/../sanitizer_common/sanitizer_atomic_clang_x86.h:81
    @     0x7f37e7195980  (unknown) at ??:0
    @     0x7f37e7194d50  __GI___nanosleep at ??:0
    @           0x2ca2a4  __interceptor_nanosleep at /home/jenkins-slave/workspace/build_and_test/thirdparty/src/llvm-11.0.0.src/projects/compiler-rt/lib/tsan/rtl/tsan_interceptors_posix.cpp:340
    @     0x7f37ea8daf0b  base::SleepForNanoseconds() at ??:0
    @     0x7f37ea5b73b7  kudu::SleepFor() at ??:0
    @           0x354a31  kudu::BlockSignalsThread() at /home/jenkins-slave/workspace/build_and_test_flaky@2/src/kudu/util/debug-util-test.cc:406
    @           0x37d677  _ZNSt3__18__invokeIRPFvvEJEEEDTclclsr3std3__1E7forwardIT_Efp_Espclsr3std3__1E7forwardIT0_Efp0_EEEOS4_DpOS5_ at /home/jenkins-slave/workspace/build_and_test_flaky@2/thirdparty/installed/tsan/include/c++/v1/type_traits:3905
    @           0x37d602  std::__1::__invoke_void_return_wrapper<>::__call<>() at /home/jenkins-slave/workspace/build_and_test_flaky@2/thirdparty/installed/tsan/include/c++/v1/__functional_base:349
    @           0x37d5c2  std::__1::__function::__alloc_func<>::operator()() at /home/jenkins-slave/workspace/build_and_test_flaky@2/thirdparty/installed/tsan/include/c++/v1/functional:1557
    @           0x37c25e  std::__1::__function::__func<>::operator()() at /home/jenkins-slave/workspace/build_and_test_flaky@2/thirdparty/installed/tsan/include/c++/v1/functional:1731
    @           0x3807f5  std::__1::__function::__value_func<>::operator()() at /home/jenkins-slave/workspace/build_and_test_flaky@2/thirdparty/installed/tsan/include/c++/v1/functional:1884
    @           0x38075a  std::__1::function<>::operator()() at /home/jenkins-slave/workspace/build_and_test_flaky@2/thirdparty/installed/tsan/include/c++/v1/functional:2556
    @     0x7f37ea62181b  kudu::Thread::SuperviseThread() at ??:0
    @           0x2a5380  __tsan_thread_start_func at /home/jenkins-slave/workspace/build_and_test/thirdparty/src/llvm-11.0.0.src/projects/compiler-rt/lib/tsan/rtl/tsan_interceptors_posix.cpp:959
I20260927 01:54:28.071216  7296 debug-util-test.cc:419]     @           0x2a54c0  __tsan::CallUserSignalHandler()
    @           0x2a7aa8  rtl_sigaction() at /home/jenkins-slave/workspace/build_and_test/thirdparty/src/llvm-11.0.0.src/projects/compiler-rt/lib/tsan/../sanitizer_common/sanitizer_atomic_clang_x86.h:81
    @     0x7f37e7195980  (unknown) at ??:0
    @     0x7f37e7194d50  __GI___nanosleep at ??:0
    @           0x2ca2a4  __interceptor_nanosleep at /home/jenkins-slave/workspace/build_and_test/thirdparty/src/llvm-11.0.0.src/projects/compiler-rt/lib/tsan/rtl/tsan_interceptors_posix.cpp:340
    @     0x7f37ea8daf0b  base::SleepForNanoseconds() at ??:0
    @     0x7f37ea5b73b7  kudu::SleepFor() at ??:0
    @           0x354a31  kudu::BlockSignalsThread() at /home/jenkins-slave/workspace/build_and_test_flaky@2/src/kudu/util/debug-util-test.cc:406
    @           0x37d677  _ZNSt3__18__invokeIRPFvvEJEEEDTclclsr3std3__1E7forwardIT_Efp_Espclsr3std3__1E7forwardIT0_Efp0_EEEOS4_DpOS5_ at /home/jenkins-slave/workspace/build_and_test_flaky@2/thirdparty/installed/tsan/include/c++/v1/type_traits:3905
    @           0x37d602  std::__1::__invoke_void_return_wrapper<>::__call<>() at /home/jenkins-slave/workspace/build_and_test_flaky@2/thirdparty/installed/tsan/include/c++/v1/__functional_base:349
    @           0x37d5c2  std::__1::__function::__alloc_func<>::operator()() at /home/jenkins-slave/workspace/build_and_test_flaky@2/thirdparty/installed/tsan/include/c++/v1/functional:1557
    @           0x37c25e  std::__1::__function::__func<>::operator()() at /home/jenkins-slave/workspace/build_and_test_flaky@2/thirdparty/installed/tsan/include/c++/v1/functional:1731
    @           0x3807f5  std::__1::__function::__value_func<>::operator()() at /home/jenkins-slave/workspace/build_and_test_flaky@2/thirdparty/installed/tsan/include/c++/v1/functional:1884
    @           0x38075a  std::__1::function<>::operator()() at /home/jenkins-slave/workspace/build_and_test_flaky@2/thirdparty/installed/tsan/include/c++/v1/functional:2556
    @     0x7f37ea62181b  kudu::Thread::SuperviseThread() at ??:0
    @           0x2a5380  __tsan_thread_start_func at /home/jenkins-slave/workspace/build_and_test/thirdparty/src/llvm-11.0.0.src/projects/compiler-rt/lib/tsan/rtl/tsan_interceptors_posix.cpp:959
I20260927 01:54:28.091773  7296 debug-util-test.cc:419]     @           0x2a54c0  __tsan::CallUserSignalHandler()
    @           0x2a7aa8  rtl_sigaction() at /home/jenkins-slave/workspace/build_and_test/thirdparty/src/llvm-11.0.0.src/projects/compiler-rt/lib/tsan/../sanitizer_common/sanitizer_atomic_clang_x86.h:81
    @     0x7f37e7195980  (unknown) at ??:0
    @     0x7f37e7194d50  __GI___nanosleep at ??:0
    @           0x2ca2a4  __interceptor_nanosleep at /home/jenkins-slave/workspace/build_and_test/thirdparty/src/llvm-11.0.0.src/projects/compiler-rt/lib/tsan/rtl/tsan_interceptors_posix.cpp:340
    @     0x7f37ea8daf0b  base::SleepForNanoseconds() at ??:0
    @     0x7f37ea5b73b7  kudu::SleepFor() at ??:0
    @           0x354a31  kudu::BlockSignalsThread() at /home/jenkins-slave/workspace/build_and_test_flaky@2/src/kudu/util/debug-util-test.cc:406
    @           0x37d677  _ZNSt3__18__invokeIRPFvvEJEEEDTclclsr3std3__1E7forwardIT_Efp_Espclsr3std3__1E7forwardIT0_Efp0_EEEOS4_DpOS5_ at /home/jenkins-slave/workspace/build_and_test_flaky@2/thirdparty/installed/tsan/include/c++/v1/type_traits:3905
    @           0x37d602  std::__1::__invoke_void_return_wrapper<>::__call<>() at /home/jenkins-slave/workspace/build_and_test_flaky@2/thirdparty/installed/tsan/include/c++/v1/__functional_base:349
    @           0x37d5c2  std::__1::__function::__alloc_func<>::operator()() at /home/jenkins-slave/workspace/build_and_test_flaky@2/thirdparty/installed/tsan/include/c++/v1/functional:1557
    @           0x37c25e  std::__1::__function::__func<>::operator()() at /home/jenkins-slave/workspace/build_and_test_flaky@2/thirdparty/installed/tsan/include/c++/v1/functional:1731
    @           0x3807f5  std::__1::__function::__value_func<>::operator()() at /home/jenkins-slave/workspace/build_and_test_flaky@2/thirdparty/installed/tsan/include/c++/v1/functional:1884
    @           0x38075a  std::__1::function<>::operator()() at /home/jenkins-slave/workspace/build_and_test_flaky@2/thirdparty/installed/tsan/include/c++/v1/functional:2556
    @     0x7f37ea62181b  kudu::Thread::SuperviseThread() at ??:0
    @           0x2a5380  __tsan_thread_start_func at /home/jenkins-slave/workspace/build_and_test/thirdparty/src/llvm-11.0.0.src/projects/compiler-rt/lib/tsan/rtl/tsan_interceptors_posix.cpp:959
I20260927 01:54:28.112263  7296 debug-util-test.cc:419]     @           0x2a54c0  __tsan::CallUserSignalHandler()
    @           0x2a7aa8  rtl_sigaction() at /home/jenkins-slave/workspace/build_and_test/thirdparty/src/llvm-11.0.0.src/projects/compiler-rt/lib/tsan/../sanitizer_common/sanitizer_atomic_clang_x86.h:81
    @     0x7f37e7195980  (unknown) at ??:0
    @     0x7f37e7194d50  __GI___nanosleep at ??:0
    @           0x2ca2a4  __interceptor_nanosleep at /home/jenkins-slave/workspace/build_and_test/thirdparty/src/llvm-11.0.0.src/projects/compiler-rt/lib/tsan/rtl/tsan_interceptors_posix.cpp:340
    @     0x7f37ea8daf0b  base::SleepForNanoseconds() at ??:0
    @     0x7f37ea5b73b7  kudu::SleepFor() at ??:0
    @           0x354a31  kudu::BlockSignalsThread() at /home/jenkins-slave/workspace/build_and_test_flaky@2/src/kudu/util/debug-util-test.cc:406
    @           0x37d677  _ZNSt3__18__invokeIRPFvvEJEEEDTclclsr3std3__1E7forwardIT_Efp_Espclsr3std3__1E7forwardIT0_Efp0_EEEOS4_DpOS5_ at /home/jenkins-slave/workspace/build_and_test_flaky@2/thirdparty/installed/tsan/include/c++/v1/type_traits:3905
    @           0x37d602  std::__1::__invoke_void_return_wrapper<>::__call<>() at /home/jenkins-slave/workspace/build_and_test_flaky@2/thirdparty/installed/tsan/include/c++/v1/__functional_base:349
    @           0x37d5c2  std::__1::__function::__alloc_func<>::operator()() at /home/jenkins-slave/workspace/build_and_test_flaky@2/thirdparty/installed/tsan/include/c++/v1/functional:1557
    @           0x37c25e  std::__1::__function::__func<>::operator()() at /home/jenkins-slave/workspace/build_and_test_flaky@2/thirdparty/installed/tsan/include/c++/v1/functional:1731
    @           0x3807f5  std::__1::__function::__value_func<>::operator()() at /home/jenkins-slave/workspace/build_and_test_flaky@2/thirdparty/installed/tsan/include/c++/v1/functional:1884
    @           0x38075a  std::__1::function<>::operator()() at /home/jenkins-slave/workspace/build_and_test_flaky@2/thirdparty/installed/tsan/include/c++/v1/functional:2556
    @     0x7f37ea62181b  kudu::Thread::SuperviseThread() at ??:0
    @           0x2a5380  __tsan_thread_start_func at /home/jenkins-slave/workspace/build_and_test/thirdparty/src/llvm-11.0.0.src/projects/compiler-rt/lib/tsan/rtl/tsan_interceptors_posix.cpp:959
I20260927 01:54:28.132766  7296 debug-util-test.cc:419]     @           0x2a54c0  __tsan::CallUserSignalHandler()
    @           0x2a7aa8  rtl_sigaction() at /home/jenkins-slave/workspace/build_and_test/thirdparty/src/llvm-11.0.0.src/projects/compiler-rt/lib/tsan/../sanitizer_common/sanitizer_atomic_clang_x86.h:81
    @     0x7f37e7195980  (unknown) at ??:0
    @     0x7f37e7194d50  __GI___nanosleep at ??:0
    @           0x2ca2a4  __interceptor_nanosleep at /home/jenkins-slave/workspace/build_and_test/thirdparty/src/llvm-11.0.0.src/projects/compiler-rt/lib/tsan/rtl/tsan_interceptors_posix.cpp:340
    @     0x7f37ea8daf0b  base::SleepForNanoseconds() at ??:0
    @     0x7f37ea5b73b7  kudu::SleepFor() at ??:0
    @           0x354a31  kudu::BlockSignalsThread() at /home/jenkins-slave/workspace/build_and_test_flaky@2/src/kudu/util/debug-util-test.cc:406
    @           0x37d677  _ZNSt3__18__invokeIRPFvvEJEEEDTclclsr3std3__1E7forwardIT_Efp_Espclsr3std3__1E7forwardIT0_Efp0_EEEOS4_DpOS5_ at /home/jenkins-slave/workspace/build_and_test_flaky@2/thirdparty/installed/tsan/include/c++/v1/type_traits:3905
    @           0x37d602  std::__1::__invoke_void_return_wrapper<>::__call<>() at /home/jenkins-slave/workspace/build_and_test_flaky@2/thirdparty/installed/tsan/include/c++/v1/__functional_base:349
    @           0x37d5c2  std::__1::__function::__alloc_func<>::operator()() at /home/jenkins-slave/workspace/build_and_test_flaky@2/thirdparty/installed/tsan/include/c++/v1/functional:1557
    @           0x37c25e  std::__1::__function::__func<>::operator()() at /home/jenkins-slave/workspace/build_and_test_flaky@2/thirdparty/installed/tsan/include/c++/v1/functional:1731
    @           0x3807f5  std::__1::__function::__value_func<>::operator()() at /home/jenkins-slave/workspace/build_and_test_flaky@2/thirdparty/installed/tsan/include/c++/v1/functional:1884
    @           0x38075a  std::__1::function<>::operator()() at /home/jenkins-slave/workspace/build_and_test_flaky@2/thirdparty/installed/tsan/include/c++/v1/functional:2556
    @     0x7f37ea62181b  kudu::Thread::SuperviseThread() at ??:0
    @           0x2a5380  __tsan_thread_start_func at /home/jenkins-slave/workspace/build_and_test/thirdparty/src/llvm-11.0.0.src/projects/compiler-rt/lib/tsan/rtl/tsan_interceptors_posix.cpp:959
I20260927 01:54:28.153201  7296 debug-util-test.cc:419]     @           0x2a54c0  __tsan::CallUserSignalHandler()
    @           0x2a7aa8  rtl_sigaction() at /home/jenkins-slave/workspace/build_and_test/thirdparty/src/llvm-11.0.0.src/projects/compiler-rt/lib/tsan/../sanitizer_common/sanitizer_atomic_clang_x86.h:81
    @     0x7f37e7195980  (unknown) at ??:0
    @     0x7f37e7194d50  __GI___nanosleep at ??:0
    @           0x2ca2a4  __interceptor_nanosleep at /home/jenkins-slave/workspace/build_and_test/thirdparty/src/llvm-11.0.0.src/projects/compiler-rt/lib/tsan/rtl/tsan_interceptors_posix.cpp:340
    @     0x7f37ea8daf0b  base::SleepForNanoseconds() at ??:0
    @     0x7f37ea5b73b7  kudu::SleepFor() at ??:0
    @           0x354a31  kudu::BlockSignalsThread() at /home/jenkins-slave/workspace/build_and_test_flaky@2/src/kudu/util/debug-util-test.cc:406
    @           0x37d677  _ZNSt3__18__invokeIRPFvvEJEEEDTclclsr3std3__1E7forwardIT_Efp_Espclsr3std3__1E7forwardIT0_Efp0_EEEOS4_DpOS5_ at /home/jenkins-slave/workspace/build_and_test_flaky@2/thirdparty/installed/tsan/include/c++/v1/type_traits:3905
    @           0x37d602  std::__1::__invoke_void_return_wrapper<>::__call<>() at /home/jenkins-slave/workspace/build_and_test_flaky@2/thirdparty/installed/tsan/include/c++/v1/__functional_base:349
    @           0x37d5c2  std::__1::__function::__alloc_func<>::operator()() at /home/jenkins-slave/workspace/build_and_test_flaky@2/thirdparty/installed/tsan/include/c++/v1/functional:1557
    @           0x37c25e  std::__1::__function::__func<>::operator()() at /home/jenkins-slave/workspace/build_and_test_flaky@2/thirdparty/installed/tsan/include/c++/v1/functional:1731
    @           0x3807f5  std::__1::__function::__value_func<>::operator()() at /home/jenkins-slave/workspace/build_and_test_flaky@2/thirdparty/installed/tsan/include/c++/v1/functional:1884
    @           0x38075a  std::__1::function<>::operator()() at /home/jenkins-slave/workspace/build_and_test_flaky@2/thirdparty/installed/tsan/include/c++/v1/functional:2556
    @     0x7f37ea62181b  kudu::Thread::SuperviseThread() at ??:0
    @           0x2a5380  __tsan_thread_start_func at /home/jenkins-slave/workspace/build_and_test/thirdparty/src/llvm-11.0.0.src/projects/compiler-rt/lib/tsan/rtl/tsan_interceptors_posix.cpp:959
I20260927 01:54:28.174613  7296 debug-util-test.cc:419]     @           0x2a54c0  __tsan::CallUserSignalHandler()
    @           0x2a7aa8  rtl_sigaction() at /home/jenkins-slave/workspace/build_and_test/thirdparty/src/llvm-11.0.0.src/projects/compiler-rt/lib/tsan/../sanitizer_common/sanitizer_atomic_clang_x86.h:81
    @     0x7f37e7195980  (unknown) at ??:0
    @     0x7f37e7194d50  __GI___nanosleep at ??:0
    @           0x2ca2a4  __interceptor_nanosleep at /home/jenkins-slave/workspace/build_and_test/thirdparty/src/llvm-11.0.0.src/projects/compiler-rt/lib/tsan/rtl/tsan_interceptors_posix.cpp:340
    @     0x7f37ea8daf0b  base::SleepForNanoseconds() at ??:0
    @     0x7f37ea5b73b7  kudu::SleepFor() at ??:0
    @           0x354a31  kudu::BlockSignalsThread() at /home/jenkins-slave/workspace/build_and_test_flaky@2/src/kudu/util/debug-util-test.cc:406
    @           0x37d677  _ZNSt3__18__invokeIRPFvvEJEEEDTclclsr3std3__1E7forwardIT_Efp_Espclsr3std3__1E7forwardIT0_Efp0_EEEOS4_DpOS5_ at /home/jenkins-slave/workspace/build_and_test_flaky@2/thirdparty/installed/tsan/include/c++/v1/type_traits:3905
    @           0x37d602  std::__1::__invoke_void_return_wrapper<>::__call<>() at /home/jenkins-slave/workspace/build_and_test_flaky@2/thirdparty/installed/tsan/include/c++/v1/__functional_base:349
    @           0x37d5c2  std::__1::__function::__alloc_func<>::operator()() at /home/jenkins-slave/workspace/build_and_test_flaky@2/thirdparty/installed/tsan/include/c++/v1/functional:1557
    @           0x37c25e  std::__1::__function::__func<>::operator()() at /home/jenkins-slave/workspace/build_and_test_flaky@2/thirdparty/installed/tsan/include/c++/v1/functional:1731
    @           0x3807f5  std::__1::__function::__value_func<>::operator()() at /home/jenkins-slave/workspace/build_and_test_flaky@2/thirdparty/installed/tsan/include/c++/v1/functional:1884
    @           0x38075a  std::__1::function<>::operator()() at /home/jenkins-slave/workspace/build_and_test_flaky@2/thirdparty/installed/tsan/include/c++/v1/functional:2556
    @     0x7f37ea62181b  kudu::Thread::SuperviseThread() at ??:0
    @           0x2a5380  __tsan_thread_start_func at /home/jenkins-slave/workspace/build_and_test/thirdparty/src/llvm-11.0.0.src/projects/compiler-rt/lib/tsan/rtl/tsan_interceptors_posix.cpp:959
I20260927 01:54:28.195219  7296 debug-util-test.cc:419]     @           0x2a54c0  __tsan::CallUserSignalHandler()
    @           0x2a7aa8  rtl_sigaction() at /home/jenkins-slave/workspace/build_and_test/thirdparty/src/llvm-11.0.0.src/projects/compiler-rt/lib/tsan/../sanitizer_common/sanitizer_atomic_clang_x86.h:81
    @     0x7f37e7195980  (unknown) at ??:0
    @     0x7f37e7194d50  __GI___nanosleep at ??:0
    @           0x2ca2a4  __interceptor_nanosleep at /home/jenkins-slave/workspace/build_and_test/thirdparty/src/llvm-11.0.0.src/projects/compiler-rt/lib/tsan/rtl/tsan_interceptors_posix.cpp:340
    @     0x7f37ea8daf0b  base::SleepForNanoseconds() at ??:0
    @     0x7f37ea5b73b7  kudu::SleepFor() at ??:0
    @           0x354a31  kudu::BlockSignalsThread() at /home/jenkins-slave/workspace/build_and_test_flaky@2/src/kudu/util/debug-util-test.cc:406
    @           0x37d677  _ZNSt3__18__invokeIRPFvvEJEEEDTclclsr3std3__1E7forwardIT_Efp_Espclsr3std3__1E7forwardIT0_Efp0_EEEOS4_DpOS5_ at /home/jenkins-slave/workspace/build_and_test_flaky@2/thirdparty/installed/tsan/include/c++/v1/type_traits:3905
    @           0x37d602  std::__1::__invoke_void_return_wrapper<>::__call<>() at /home/jenkins-slave/workspace/build_and_test_flaky@2/thirdparty/installed/tsan/include/c++/v1/__functional_base:349
    @           0x37d5c2  std::__1::__function::__alloc_func<>::operator()() at /home/jenkins-slave/workspace/build_and_test_flaky@2/thirdparty/installed/tsan/include/c++/v1/functional:1557
    @           0x37c25e  std::__1::__function::__func<>::operator()() at /home/jenkins-slave/workspace/build_and_test_flaky@2/thirdparty/installed/tsan/include/c++/v1/functional:1731
    @           0x3807f5  std::__1::__function::__value_func<>::operator()() at /home/jenkins-slave/workspace/build_and_test_flaky@2/thirdparty/installed/tsan/include/c++/v1/functional:1884
    @           0x38075a  std::__1::function<>::operator()() at /home/jenkins-slave/workspace/build_and_test_flaky@2/thirdparty/installed/tsan/include/c++/v1/functional:2556
    @     0x7f37ea62181b  kudu::Thread::SuperviseThread() at ??:0
    @           0x2a5380  __tsan_thread_start_func at /home/jenkins-slave/workspace/build_and_test/thirdparty/src/llvm-11.0.0.src/projects/compiler-rt/lib/tsan/rtl/tsan_interceptors_posix.cpp:959
I20260927 01:54:28.215560  7296 debug-util-test.cc:419]     @           0x2a54c0  __tsan::CallUserSignalHandler()
    @           0x2a7aa8  rtl_sigaction() at /home/jenkins-slave/workspace/build_and_test/thirdparty/src/llvm-11.0.0.src/projects/compiler-rt/lib/tsan/../sanitizer_common/sanitizer_atomic_clang_x86.h:81
    @     0x7f37e7195980  (unknown) at ??:0
    @     0x7f37e7194d50  __GI___nanosleep at ??:0
    @           0x2ca2a4  __interceptor_nanosleep at /home/jenkins-slave/workspace/build_and_test/thirdparty/src/llvm-11.0.0.src/projects/compiler-rt/lib/tsan/rtl/tsan_interceptors_posix.cpp:340
    @     0x7f37ea8daf0b  base::SleepForNanoseconds() at ??:0
    @     0x7f37ea5b73b7  kudu::SleepFor() at ??:0
    @           0x354a31  kudu::BlockSignalsThread() at /home/jenkins-slave/workspace/build_and_test_flaky@2/src/kudu/util/debug-util-test.cc:406
    @           0x37d677  _ZNSt3__18__invokeIRPFvvEJEEEDTclclsr3std3__1E7forwardIT_Efp_Espclsr3std3__1E7forwardIT0_Efp0_EEEOS4_DpOS5_ at /home/jenkins-slave/workspace/build_and_test_flaky@2/thirdparty/installed/tsan/include/c++/v1/type_traits:3905
    @           0x37d602  std::__1::__invoke_void_return_wrapper<>::__call<>() at /home/jenkins-slave/workspace/build_and_test_flaky@2/thirdparty/installed/tsan/include/c++/v1/__functional_base:349
    @           0x37d5c2  std::__1::__function::__alloc_func<>::operator()() at /home/jenkins-slave/workspace/build_and_test_flaky@2/thirdparty/installed/tsan/include/c++/v1/functional:1557
    @           0x37c25e  std::__1::__function::__func<>::operator()() at /home/jenkins-slave/workspace/build_and_test_flaky@2/thirdparty/installed/tsan/include/c++/v1/functional:1731
    @           0x3807f5  std::__1::__function::__value_func<>::operator()() at /home/jenkins-slave/workspace/build_and_test_flaky@2/thirdparty/installed/tsan/include/c++/v1/functional:1884
    @           0x38075a  std::__1::function<>::operator()() at /home/jenkins-slave/workspace/build_and_test_flaky@2/thirdparty/installed/tsan/include/c++/v1/functional:2556
    @     0x7f37ea62181b  kudu::Thread::SuperviseThread() at ??:0
    @           0x2a5380  __tsan_thread_start_func at /home/jenkins-slave/workspace/build_and_test/thirdparty/src/llvm-11.0.0.src/projects/compiler-rt/lib/tsan/rtl/tsan_interceptors_posix.cpp:959
I20260927 01:54:28.236050  7296 debug-util-test.cc:419]     @           0x2a54c0  __tsan::CallUserSignalHandler()
    @           0x2a7aa8  rtl_sigaction() at /home/jenkins-slave/workspace/build_and_test/thirdparty/src/llvm-11.0.0.src/projects/compiler-rt/lib/tsan/../sanitizer_common/sanitizer_atomic_clang_x86.h:81
    @     0x7f37e7195980  (unknown) at ??:0
    @     0x7f37e7194d50  __GI___nanosleep at ??:0
    @           0x2ca2a4  __interceptor_nanosleep at /home/jenkins-slave/workspace/build_and_test/thirdparty/src/llvm-11.0.0.src/projects/compiler-rt/lib/tsan/rtl/tsan_interceptors_posix.cpp:340
    @     0x7f37ea8daf0b  base::SleepForNanoseconds() at ??:0
    @     0x7f37ea5b73b7  kudu::SleepFor() at ??:0
    @           0x354a31  kudu::BlockSignalsThread() at /home/jenkins-slave/workspace/build_and_test_flaky@2/src/kudu/util/debug-util-test.cc:406
    @           0x37d677  _ZNSt3__18__invokeIRPFvvEJEEEDTclclsr3std3__1E7forwardIT_Efp_Espclsr3std3__1E7forwardIT0_Efp0_EEEOS4_DpOS5_ at /home/jenkins-slave/workspace/build_and_test_flaky@2/thirdparty/installed/tsan/include/c++/v1/type_traits:3905
    @           0x37d602  std::__1::__invoke_void_return_wrapper<>::__call<>() at /home/jenkins-slave/workspace/build_and_test_flaky@2/thirdparty/installed/tsan/include/c++/v1/__functional_base:349
    @           0x37d5c2  std::__1::__function::__alloc_func<>::operator()() at /home/jenkins-slave/workspace/build_and_test_flaky@2/thirdparty/installed/tsan/include/c++/v1/functional:1557
    @           0x37c25e  std::__1::__function::__func<>::operator()() at /home/jenkins-slave/workspace/build_and_test_flaky@2/thirdparty/installed/tsan/include/c++/v1/functional:1731
    @           0x3807f5  std::__1::__function::__value_func<>::operator()() at /home/jenkins-slave/workspace/build_and_test_flaky@2/thirdparty/installed/tsan/include/c++/v1/functional:1884
    @           0x38075a  std::__1::function<>::operator()() at /home/jenkins-slave/workspace/build_and_test_flaky@2/thirdparty/installed/tsan/include/c++/v1/functional:2556
    @     0x7f37ea62181b  kudu::Thread::SuperviseThread() at ??:0
    @           0x2a5380  __tsan_thread_start_func at /home/jenkins-slave/workspace/build_and_test/thirdparty/src/llvm-11.0.0.src/projects/compiler-rt/lib/tsan/rtl/tsan_interceptors_posix.cpp:959
I20260927 01:54:28.256283  7296 debug-util-test.cc:419]     @           0x2a54c0  __tsan::CallUserSignalHandler()
    @           0x2a7aa8  rtl_sigaction() at /home/jenkins-slave/workspace/build_and_test/thirdparty/src/llvm-11.0.0.src/projects/compiler-rt/lib/tsan/../sanitizer_common/sanitizer_atomic_clang_x86.h:81
    @     0x7f37e7195980  (unknown) at ??:0
    @     0x7f37e7194d50  __GI___nanosleep at ??:0
    @           0x2ca2a4  __interceptor_nanosleep at /home/jenkins-slave/workspace/build_and_test/thirdparty/src/llvm-11.0.0.src/projects/compiler-rt/lib/tsan/rtl/tsan_interceptors_posix.cpp:340
    @     0x7f37ea8daf0b  base::SleepForNanoseconds() at ??:0
    @     0x7f37ea5b73b7  kudu::SleepFor() at ??:0
    @           0x354a31  kudu::BlockSignalsThread() at /home/jenkins-slave/workspace/build_and_test_flaky@2/src/kudu/util/debug-util-test.cc:406
    @           0x37d677  _ZNSt3__18__invokeIRPFvvEJEEEDTclclsr3std3__1E7forwardIT_Efp_Espclsr3std3__1E7forwardIT0_Efp0_EEEOS4_DpOS5_ at /home/jenkins-slave/workspace/build_and_test_flaky@2/thirdparty/installed/tsan/include/c++/v1/type_traits:3905
    @           0x37d602  std::__1::__invoke_void_return_wrapper<>::__call<>() at /home/jenkins-slave/workspace/build_and_test_flaky@2/thirdparty/installed/tsan/include/c++/v1/__functional_base:349
    @           0x37d5c2  std::__1::__function::__alloc_func<>::operator()() at /home/jenkins-slave/workspace/build_and_test_flaky@2/thirdparty/installed/tsan/include/c++/v1/functional:1557
    @           0x37c25e  std::__1::__function::__func<>::operator()() at /home/jenkins-slave/workspace/build_and_test_flaky@2/thirdparty/installed/tsan/include/c++/v1/functional:1731
    @           0x3807f5  std::__1::__function::__value_func<>::operator()() at /home/jenkins-slave/workspace/build_and_test_flaky@2/thirdparty/installed/tsan/include/c++/v1/functional:1884
    @           0x38075a  std::__1::function<>::operator()() at /home/jenkins-slave/workspace/build_and_test_flaky@2/thirdparty/installed/tsan/include/c++/v1/functional:2556
    @     0x7f37ea62181b  kudu::Thread::SuperviseThread() at ??:0
    @           0x2a5380  __tsan_thread_start_func at /home/jenkins-slave/workspace/build_and_test/thirdparty/src/llvm-11.0.0.src/projects/compiler-rt/lib/tsan/rtl/tsan_interceptors_posix.cpp:959
I20260927 01:54:28.276648  7296 debug-util-test.cc:419]     @           0x2a54c0  __tsan::CallUserSignalHandler()
    @           0x2a7aa8  rtl_sigaction() at /home/jenkins-slave/workspace/build_and_test/thirdparty/src/llvm-11.0.0.src/projects/compiler-rt/lib/tsan/../sanitizer_common/sanitizer_atomic_clang_x86.h:81
    @     0x7f37e7195980  (unknown) at ??:0
    @     0x7f37e7194d50  __GI___nanosleep at ??:0
    @           0x2ca2a4  __interceptor_nanosleep at /home/jenkins-slave/workspace/build_and_test/thirdparty/src/llvm-11.0.0.src/projects/compiler-rt/lib/tsan/rtl/tsan_interceptors_posix.cpp:340
    @     0x7f37ea8daf0b  base::SleepForNanoseconds() at ??:0
    @     0x7f37ea5b73b7  kudu::SleepFor() at ??:0
    @           0x354a31  kudu::BlockSignalsThread() at /home/jenkins-slave/workspace/build_and_test_flaky@2/src/kudu/util/debug-util-test.cc:406
    @           0x37d677  _ZNSt3__18__invokeIRPFvvEJEEEDTclclsr3std3__1E7forwardIT_Efp_Espclsr3std3__1E7forwardIT0_Efp0_EEEOS4_DpOS5_ at /home/jenkins-slave/workspace/build_and_test_flaky@2/thirdparty/installed/tsan/include/c++/v1/type_traits:3905
    @           0x37d602  std::__1::__invoke_void_return_wrapper<>::__call<>() at /home/jenkins-slave/workspace/build_and_test_flaky@2/thirdparty/installed/tsan/include/c++/v1/__functional_base:349
    @           0x37d5c2  std::__1::__function::__alloc_func<>::operator()() at /home/jenkins-slave/workspace/build_and_test_flaky@2/thirdparty/installed/tsan/include/c++/v1/functional:1557
    @           0x37c25e  std::__1::__function::__func<>::operator()() at /home/jenkins-slave/workspace/build_and_test_flaky@2/thirdparty/installed/tsan/include/c++/v1/functional:1731
    @           0x3807f5  std::__1::__function::__value_func<>::operator()() at /home/jenkins-slave/workspace/build_and_test_flaky@2/thirdparty/installed/tsan/include/c++/v1/functional:1884
    @           0x38075a  std::__1::function<>::operator()() at /home/jenkins-slave/workspace/build_and_test_flaky@2/thirdparty/installed/tsan/include/c++/v1/functional:2556
    @     0x7f37ea62181b  kudu::Thread::SuperviseThread() at ??:0
    @           0x2a5380  __tsan_thread_start_func at /home/jenkins-slave/workspace/build_and_test/thirdparty/src/llvm-11.0.0.src/projects/compiler-rt/lib/tsan/rtl/tsan_interceptors_posix.cpp:959
I20260927 01:54:28.296977  7296 debug-util-test.cc:419]     @           0x2a54c0  __tsan::CallUserSignalHandler()
    @           0x2a7aa8  rtl_sigaction() at /home/jenkins-slave/workspace/build_and_test/thirdparty/src/llvm-11.0.0.src/projects/compiler-rt/lib/tsan/../sanitizer_common/sanitizer_atomic_clang_x86.h:81
    @     0x7f37e7195980  (unknown) at ??:0
    @     0x7f37e7194d50  __GI___nanosleep at ??:0
    @           0x2ca2a4  __interceptor_nanosleep at /home/jenkins-slave/workspace/build_and_test/thirdparty/src/llvm-11.0.0.src/projects/compiler-rt/lib/tsan/rtl/tsan_interceptors_posix.cpp:340
    @     0x7f37ea8daf0b  base::SleepForNanoseconds() at ??:0
    @     0x7f37ea5b73b7  kudu::SleepFor() at ??:0
    @           0x354a31  kudu::BlockSignalsThread() at /home/jenkins-slave/workspace/build_and_test_flaky@2/src/kudu/util/debug-util-test.cc:406
    @           0x37d677  _ZNSt3__18__invokeIRPFvvEJEEEDTclclsr3std3__1E7forwardIT_Efp_Espclsr3std3__1E7forwardIT0_Efp0_EEEOS4_DpOS5_ at /home/jenkins-slave/workspace/build_and_test_flaky@2/thirdparty/installed/tsan/include/c++/v1/type_traits:3905
    @           0x37d602  std::__1::__invoke_void_return_wrapper<>::__call<>() at /home/jenkins-slave/workspace/build_and_test_flaky@2/thirdparty/installed/tsan/include/c++/v1/__functional_base:349
    @           0x37d5c2  std::__1::__function::__alloc_func<>::operator()() at /home/jenkins-slave/workspace/build_and_test_flaky@2/thirdparty/installed/tsan/include/c++/v1/functional:1557
    @           0x37c25e  std::__1::__function::__func<>::operator()() at /home/jenkins-slave/workspace/build_and_test_flaky@2/thirdparty/installed/tsan/include/c++/v1/functional:1731
    @           0x3807f5  std::__1::__function::__value_func<>::operator()() at /home/jenkins-slave/workspace/build_and_test_flaky@2/thirdparty/installed/tsan/include/c++/v1/functional:1884
    @           0x38075a  std::__1::function<>::operator()() at /home/jenkins-slave/workspace/build_and_test_flaky@2/thirdparty/installed/tsan/include/c++/v1/functional:2556
    @     0x7f37ea62181b  kudu::Thread::SuperviseThread() at ??:0
    @           0x2a5380  __tsan_thread_start_func at /home/jenkins-slave/workspace/build_and_test/thirdparty/src/llvm-11.0.0.src/projects/compiler-rt/lib/tsan/rtl/tsan_interceptors_posix.cpp:959
I20260927 01:54:28.317566  7296 debug-util-test.cc:419]     @           0x2a54c0  __tsan::CallUserSignalHandler()
    @           0x2a7aa8  rtl_sigaction() at /home/jenkins-slave/workspace/build_and_test/thirdparty/src/llvm-11.0.0.src/projects/compiler-rt/lib/tsan/../sanitizer_common/sanitizer_atomic_clang_x86.h:81
    @     0x7f37e7195980  (unknown) at ??:0
    @     0x7f37e7194d50  __GI___nanosleep at ??:0
    @           0x2ca2a4  __interceptor_nanosleep at /home/jenkins-slave/workspace/build_and_test/thirdparty/src/llvm-11.0.0.src/projects/compiler-rt/lib/tsan/rtl/tsan_interceptors_posix.cpp:340
    @     0x7f37ea8daf0b  base::SleepForNanoseconds() at ??:0
    @     0x7f37ea5b73b7  kudu::SleepFor() at ??:0
    @           0x354a31  kudu::BlockSignalsThread() at /home/jenkins-slave/workspace/build_and_test_flaky@2/src/kudu/util/debug-util-test.cc:406
    @           0x37d677  _ZNSt3__18__invokeIRPFvvEJEEEDTclclsr3std3__1E7forwardIT_Efp_Espclsr3std3__1E7forwardIT0_Efp0_EEEOS4_DpOS5_ at /home/jenkins-slave/workspace/build_and_test_flaky@2/thirdparty/installed/tsan/include/c++/v1/type_traits:3905
    @           0x37d602  std::__1::__invoke_void_return_wrapper<>::__call<>() at /home/jenkins-slave/workspace/build_and_test_flaky@2/thirdparty/installed/tsan/include/c++/v1/__functional_base:349
    @           0x37d5c2  std::__1::__function::__alloc_func<>::operator()() at /home/jenkins-slave/workspace/build_and_test_flaky@2/thirdparty/installed/tsan/include/c++/v1/functional:1557
    @           0x37c25e  std::__1::__function::__func<>::operator()() at /home/jenkins-slave/workspace/build_and_test_flaky@2/thirdparty/installed/tsan/include/c++/v1/functional:1731
    @           0x3807f5  std::__1::__function::__value_func<>::operator()() at /home/jenkins-slave/workspace/build_and_test_flaky@2/thirdparty/installed/tsan/include/c++/v1/functional:1884
    @           0x38075a  std::__1::function<>::operator()() at /home/jenkins-slave/workspace/build_and_test_flaky@2/thirdparty/installed/tsan/include/c++/v1/functional:2556
    @     0x7f37ea62181b  kudu::Thread::SuperviseThread() at ??:0
    @           0x2a5380  __tsan_thread_start_func at /home/jenkins-slave/workspace/build_and_test/thirdparty/src/llvm-11.0.0.src/projects/compiler-rt/lib/tsan/rtl/tsan_interceptors_posix.cpp:959
I20260927 01:54:28.337795  7296 debug-util-test.cc:419]     @           0x2a54c0  __tsan::CallUserSignalHandler()
    @           0x2a7aa8  rtl_sigaction() at /home/jenkins-slave/workspace/build_and_test/thirdparty/src/llvm-11.0.0.src/projects/compiler-rt/lib/tsan/../sanitizer_common/sanitizer_atomic_clang_x86.h:81
    @     0x7f37e7195980  (unknown) at ??:0
    @     0x7f37e7194d50  __GI___nanosleep at ??:0
    @           0x2ca2a4  __interceptor_nanosleep at /home/jenkins-slave/workspace/build_and_test/thirdparty/src/llvm-11.0.0.src/projects/compiler-rt/lib/tsan/rtl/tsan_interceptors_posix.cpp:340
    @     0x7f37ea8daf0b  base::SleepForNanoseconds() at ??:0
    @     0x7f37ea5b73b7  kudu::SleepFor() at ??:0
    @           0x354a31  kudu::BlockSignalsThread() at /home/jenkins-slave/workspace/build_and_test_flaky@2/src/kudu/util/debug-util-test.cc:406
    @           0x37d677  _ZNSt3__18__invokeIRPFvvEJEEEDTclclsr3std3__1E7forwardIT_Efp_Espclsr3std3__1E7forwardIT0_Efp0_EEEOS4_DpOS5_ at /home/jenkins-slave/workspace/build_and_test_flaky@2/thirdparty/installed/tsan/include/c++/v1/type_traits:3905
    @           0x37d602  std::__1::__invoke_void_return_wrapper<>::__call<>() at /home/jenkins-slave/workspace/build_and_test_flaky@2/thirdparty/installed/tsan/include/c++/v1/__functional_base:349
    @           0x37d5c2  std::__1::__function::__alloc_func<>::operator()() at /home/jenkins-slave/workspace/build_and_test_flaky@2/thirdparty/installed/tsan/include/c++/v1/functional:1557
    @           0x37c25e  std::__1::__function::__func<>::operator()() at /home/jenkins-slave/workspace/build_and_test_flaky@2/thirdparty/installed/tsan/include/c++/v1/functional:1731
    @           0x3807f5  std::__1::__function::__value_func<>::operator()() at /home/jenkins-slave/workspace/build_and_test_flaky@2/thirdparty/installed/tsan/include/c++/v1/functional:1884
    @           0x38075a  std::__1::function<>::operator()() at /home/jenkins-slave/workspace/build_and_test_flaky@2/thirdparty/installed/tsan/include/c++/v1/functional:2556
    @     0x7f37ea62181b  kudu::Thread::SuperviseThread() at ??:0
    @           0x2a5380  __tsan_thread_start_func at /home/jenkins-slave/workspace/build_and_test/thirdparty/src/llvm-11.0.0.src/projects/compiler-rt/lib/tsan/rtl/tsan_interceptors_posix.cpp:959
I20260927 01:54:28.358366  7296 debug-util-test.cc:419]     @           0x2a54c0  __tsan::CallUserSignalHandler()
    @           0x2a7aa8  rtl_sigaction() at /home/jenkins-slave/workspace/build_and_test/thirdparty/src/llvm-11.0.0.src/projects/compiler-rt/lib/tsan/../sanitizer_common/sanitizer_atomic_clang_x86.h:81
    @     0x7f37e7195980  (unknown) at ??:0
    @     0x7f37e7194d50  __GI___nanosleep at ??:0
    @           0x2ca2a4  __interceptor_nanosleep at /home/jenkins-slave/workspace/build_and_test/thirdparty/src/llvm-11.0.0.src/projects/compiler-rt/lib/tsan/rtl/tsan_interceptors_posix.cpp:340
    @     0x7f37ea8daf0b  base::SleepForNanoseconds() at ??:0
    @     0x7f37ea5b73b7  kudu::SleepFor() at ??:0
    @           0x354a31  kudu::BlockSignalsThread() at /home/jenkins-slave/workspace/build_and_test_flaky@2/src/kudu/util/debug-util-test.cc:406
    @           0x37d677  _ZNSt3__18__invokeIRPFvvEJEEEDTclclsr3std3__1E7forwardIT_Efp_Espclsr3std3__1E7forwardIT0_Efp0_EEEOS4_DpOS5_ at /home/jenkins-slave/workspace/build_and_test_flaky@2/thirdparty/installed/tsan/include/c++/v1/type_traits:3905
    @           0x37d602  std::__1::__invoke_void_return_wrapper<>::__call<>() at /home/jenkins-slave/workspace/build_and_test_flaky@2/thirdparty/installed/tsan/include/c++/v1/__functional_base:349
    @           0x37d5c2  std::__1::__function::__alloc_func<>::operator()() at /home/jenkins-slave/workspace/build_and_test_flaky@2/thirdparty/installed/tsan/include/c++/v1/functional:1557
    @           0x37c25e  std::__1::__function::__func<>::operator()() at /home/jenkins-slave/workspace/build_and_test_flaky@2/thirdparty/installed/tsan/include/c++/v1/functional:1731
    @           0x3807f5  std::__1::__function::__value_func<>::operator()() at /home/jenkins-slave/workspace/build_and_test_flaky@2/thirdparty/installed/tsan/include/c++/v1/functional:1884
    @           0x38075a  std::__1::function<>::operator()() at /home/jenkins-slave/workspace/build_and_test_flaky@2/thirdparty/installed/tsan/include/c++/v1/functional:2556
    @     0x7f37ea62181b  kudu::Thread::SuperviseThread() at ??:0
    @           0x2a5380  __tsan_thread_start_func at /home/jenkins-slave/workspace/build_and_test/thirdparty/src/llvm-11.0.0.src/projects/compiler-rt/lib/tsan/rtl/tsan_interceptors_posix.cpp:959
I20260927 01:54:28.379248  7296 debug-util-test.cc:419]     @           0x2a54c0  __tsan::CallUserSignalHandler()
    @           0x2a7aa8  rtl_sigaction() at /home/jenkins-slave/workspace/build_and_test/thirdparty/src/llvm-11.0.0.src/projects/compiler-rt/lib/tsan/../sanitizer_common/sanitizer_atomic_clang_x86.h:81
    @     0x7f37e7195980  (unknown) at ??:0
    @     0x7f37e7194d50  __GI___nanosleep at ??:0
    @           0x2ca2a4  __interceptor_nanosleep at /home/jenkins-slave/workspace/build_and_test/thirdparty/src/llvm-11.0.0.src/projects/compiler-rt/lib/tsan/rtl/tsan_interceptors_posix.cpp:340
    @     0x7f37ea8daf0b  base::SleepForNanoseconds() at ??:0
    @     0x7f37ea5b73b7  kudu::SleepFor() at ??:0
    @           0x354a31  kudu::BlockSignalsThread() at /home/jenkins-slave/workspace/build_and_test_flaky@2/src/kudu/util/debug-util-test.cc:406
    @           0x37d677  _ZNSt3__18__invokeIRPFvvEJEEEDTclclsr3std3__1E7forwardIT_Efp_Espclsr3std3__1E7forwardIT0_Efp0_EEEOS4_DpOS5_ at /home/jenkins-slave/workspace/build_and_test_flaky@2/thirdparty/installed/tsan/include/c++/v1/type_traits:3905
    @           0x37d602  std::__1::__invoke_void_return_wrapper<>::__call<>() at /home/jenkins-slave/workspace/build_and_test_flaky@2/thirdparty/installed/tsan/include/c++/v1/__functional_base:349
    @           0x37d5c2  std::__1::__function::__alloc_func<>::operator()() at /home/jenkins-slave/workspace/build_and_test_flaky@2/thirdparty/installed/tsan/include/c++/v1/functional:1557
    @           0x37c25e  std::__1::__function::__func<>::operator()() at /home/jenkins-slave/workspace/build_and_test_flaky@2/thirdparty/installed/tsan/include/c++/v1/functional:1731
    @           0x3807f5  std::__1::__function::__value_func<>::operator()() at /home/jenkins-slave/workspace/build_and_test_flaky@2/thirdparty/installed/tsan/include/c++/v1/functional:1884
    @           0x38075a  std::__1::function<>::operator()() at /home/jenkins-slave/workspace/build_and_test_flaky@2/thirdparty/installed/tsan/include/c++/v1/functional:2556
    @     0x7f37ea62181b  kudu::Thread::SuperviseThread() at ??:0
    @           0x2a5380  __tsan_thread_start_func at /home/jenkins-slave/workspace/build_and_test/thirdparty/src/llvm-11.0.0.src/projects/compiler-rt/lib/tsan/rtl/tsan_interceptors_posix.cpp:959
I20260927 01:54:28.399442  7296 debug-util-test.cc:419]     @           0x2a54c0  __tsan::CallUserSignalHandler()
    @           0x2a7aa8  rtl_sigaction() at /home/jenkins-slave/workspace/build_and_test/thirdparty/src/llvm-11.0.0.src/projects/compiler-rt/lib/tsan/../sanitizer_common/sanitizer_atomic_clang_x86.h:81
    @     0x7f37e7195980  (unknown) at ??:0
    @     0x7f37e7194d50  __GI___nanosleep at ??:0
    @           0x2ca2a4  __interceptor_nanosleep at /home/jenkins-slave/workspace/build_and_test/thirdparty/src/llvm-11.0.0.src/projects/compiler-rt/lib/tsan/rtl/tsan_interceptors_posix.cpp:340
    @     0x7f37ea8daf0b  base::SleepForNanoseconds() at ??:0
    @     0x7f37ea5b73b7  kudu::SleepFor() at ??:0
    @           0x354a31  kudu::BlockSignalsThread() at /home/jenkins-slave/workspace/build_and_test_flaky@2/src/kudu/util/debug-util-test.cc:406
    @           0x37d677  _ZNSt3__18__invokeIRPFvvEJEEEDTclclsr3std3__1E7forwardIT_Efp_Espclsr3std3__1E7forwardIT0_Efp0_EEEOS4_DpOS5_ at /home/jenkins-slave/workspace/build_and_test_flaky@2/thirdparty/installed/tsan/include/c++/v1/type_traits:3905
    @           0x37d602  std::__1::__invoke_void_return_wrapper<>::__call<>() at /home/jenkins-slave/workspace/build_and_test_flaky@2/thirdparty/installed/tsan/include/c++/v1/__functional_base:349
    @           0x37d5c2  std::__1::__function::__alloc_func<>::operator()() at /home/jenkins-slave/workspace/build_and_test_flaky@2/thirdparty/installed/tsan/include/c++/v1/functional:1557
    @           0x37c25e  std::__1::__function::__func<>::operator()() at /home/jenkins-slave/workspace/build_and_test_flaky@2/thirdparty/installed/tsan/include/c++/v1/functional:1731
    @           0x3807f5  std::__1::__function::__value_func<>::operator()() at /home/jenkins-slave/workspace/build_and_test_flaky@2/thirdparty/installed/tsan/include/c++/v1/functional:1884
    @           0x38075a  std::__1::function<>::operator()() at /home/jenkins-slave/workspace/build_and_test_flaky@2/thirdparty/installed/tsan/include/c++/v1/functional:2556
    @     0x7f37ea62181b  kudu::Thread::SuperviseThread() at ??:0
    @           0x2a5380  __tsan_thread_start_func at /home/jenkins-slave/workspace/build_and_test/thirdparty/src/llvm-11.0.0.src/projects/compiler-rt/lib/tsan/rtl/tsan_interceptors_posix.cpp:959
I20260927 01:54:28.419786  7296 debug-util-test.cc:419]     @           0x2a54c0  __tsan::CallUserSignalHandler()
    @           0x2a7aa8  rtl_sigaction() at /home/jenkins-slave/workspace/build_and_test/thirdparty/src/llvm-11.0.0.src/projects/compiler-rt/lib/tsan/../sanitizer_common/sanitizer_atomic_clang_x86.h:81
    @     0x7f37e7195980  (unknown) at ??:0
    @     0x7f37e7194d50  __GI___nanosleep at ??:0
    @           0x2ca2a4  __interceptor_nanosleep at /home/jenkins-slave/workspace/build_and_test/thirdparty/src/llvm-11.0.0.src/projects/compiler-rt/lib/tsan/rtl/tsan_interceptors_posix.cpp:340
    @     0x7f37ea8daf0b  base::SleepForNanoseconds() at ??:0
    @     0x7f37ea5b73b7  kudu::SleepFor() at ??:0
    @           0x354a31  kudu::BlockSignalsThread() at /home/jenkins-slave/workspace/build_and_test_flaky@2/src/kudu/util/debug-util-test.cc:406
    @           0x37d677  _ZNSt3__18__invokeIRPFvvEJEEEDTclclsr3std3__1E7forwardIT_Efp_Espclsr3std3__1E7forwardIT0_Efp0_EEEOS4_DpOS5_ at /home/jenkins-slave/workspace/build_and_test_flaky@2/thirdparty/installed/tsan/include/c++/v1/type_traits:3905
    @           0x37d602  std::__1::__invoke_void_return_wrapper<>::__call<>() at /home/jenkins-slave/workspace/build_and_test_flaky@2/thirdparty/installed/tsan/include/c++/v1/__functional_base:349
    @           0x37d5c2  std::__1::__function::__alloc_func<>::operator()() at /home/jenkins-slave/workspace/build_and_test_flaky@2/thirdparty/installed/tsan/include/c++/v1/functional:1557
    @           0x37c25e  std::__1::__function::__func<>::operator()() at /home/jenkins-slave/workspace/build_and_test_flaky@2/thirdparty/installed/tsan/include/c++/v1/functional:1731
    @           0x3807f5  std::__1::__function::__value_func<>::operator()() at /home/jenkins-slave/workspace/build_and_test_flaky@2/thirdparty/installed/tsan/include/c++/v1/functional:1884
    @           0x38075a  std::__1::function<>::operator()() at /home/jenkins-slave/workspace/build_and_test_flaky@2/thirdparty/installed/tsan/include/c++/v1/functional:2556
    @     0x7f37ea62181b  kudu::Thread::SuperviseThread() at ??:0
    @           0x2a5380  __tsan_thread_start_func at /home/jenkins-slave/workspace/build_and_test/thirdparty/src/llvm-11.0.0.src/projects/compiler-rt/lib/tsan/rtl/tsan_interceptors_posix.cpp:959
I20260927 01:54:28.440197  7296 debug-util-test.cc:419]     @           0x2a54c0  __tsan::CallUserSignalHandler()
    @           0x2a7aa8  rtl_sigaction() at /home/jenkins-slave/workspace/build_and_test/thirdparty/src/llvm-11.0.0.src/projects/compiler-rt/lib/tsan/../sanitizer_common/sanitizer_atomic_clang_x86.h:81
    @     0x7f37e7195980  (unknown) at ??:0
    @     0x7f37e7194d50  __GI___nanosleep at ??:0
    @           0x2ca2a4  __interceptor_nanosleep at /home/jenkins-slave/workspace/build_and_test/thirdparty/src/llvm-11.0.0.src/projects/compiler-rt/lib/tsan/rtl/tsan_interceptors_posix.cpp:340
    @     0x7f37ea8daf0b  base::SleepForNanoseconds() at ??:0
    @     0x7f37ea5b73b7  kudu::SleepFor() at ??:0
    @           0x354a31  kudu::BlockSignalsThread() at /home/jenkins-slave/workspace/build_and_test_flaky@2/src/kudu/util/debug-util-test.cc:406
    @           0x37d677  _ZNSt3__18__invokeIRPFvvEJEEEDTclclsr3std3__1E7forwardIT_Efp_Espclsr3std3__1E7forwardIT0_Efp0_EEEOS4_DpOS5_ at /home/jenkins-slave/workspace/build_and_test_flaky@2/thirdparty/installed/tsan/include/c++/v1/type_traits:3905
    @           0x37d602  std::__1::__invoke_void_return_wrapper<>::__call<>() at /home/jenkins-slave/workspace/build_and_test_flaky@2/thirdparty/installed/tsan/include/c++/v1/__functional_base:349
    @           0x37d5c2  std::__1::__function::__alloc_func<>::operator()() at /home/jenkins-slave/workspace/build_and_test_flaky@2/thirdparty/installed/tsan/include/c++/v1/functional:1557
    @           0x37c25e  std::__1::__function::__func<>::operator()() at /home/jenkins-slave/workspace/build_and_test_flaky@2/thirdparty/installed/tsan/include/c++/v1/functional:1731
    @           0x3807f5  std::__1::__function::__value_func<>::operator()() at /home/jenkins-slave/workspace/build_and_test_flaky@2/thirdparty/installed/tsan/include/c++/v1/functional:1884
    @           0x38075a  std::__1::function<>::operator()() at /home/jenkins-slave/workspace/build_and_test_flaky@2/thirdparty/installed/tsan/include/c++/v1/functional:2556
    @     0x7f37ea62181b  kudu::Thread::SuperviseThread() at ??:0
    @           0x2a5380  __tsan_thread_start_func at /home/jenkins-slave/workspace/build_and_test/thirdparty/src/llvm-11.0.0.src/projects/compiler-rt/lib/tsan/rtl/tsan_interceptors_posix.cpp:959
I20260927 01:54:28.460970  7296 debug-util-test.cc:419]     @           0x2a54c0  __tsan::CallUserSignalHandler()
    @           0x2a7aa8  rtl_sigaction() at /home/jenkins-slave/workspace/build_and_test/thirdparty/src/llvm-11.0.0.src/projects/compiler-rt/lib/tsan/../sanitizer_common/sanitizer_atomic_clang_x86.h:81
    @     0x7f37e7195980  (unknown) at ??:0
    @     0x7f37e7194d50  __GI___nanosleep at ??:0
    @           0x2ca2a4  __interceptor_nanosleep at /home/jenkins-slave/workspace/build_and_test/thirdparty/src/llvm-11.0.0.src/projects/compiler-rt/lib/tsan/rtl/tsan_interceptors_posix.cpp:340
    @     0x7f37ea8daf0b  base::SleepForNanoseconds() at ??:0
    @     0x7f37ea5b73b7  kudu::SleepFor() at ??:0
    @           0x354a31  kudu::BlockSignalsThread() at /home/jenkins-slave/workspace/build_and_test_flaky@2/src/kudu/util/debug-util-test.cc:406
    @           0x37d677  _ZNSt3__18__invokeIRPFvvEJEEEDTclclsr3std3__1E7forwardIT_Efp_Espclsr3std3__1E7forwardIT0_Efp0_EEEOS4_DpOS5_ at /home/jenkins-slave/workspace/build_and_test_flaky@2/thirdparty/installed/tsan/include/c++/v1/type_traits:3905
    @           0x37d602  std::__1::__invoke_void_return_wrapper<>::__call<>() at /home/jenkins-slave/workspace/build_and_test_flaky@2/thirdparty/installed/tsan/include/c++/v1/__functional_base:349
    @           0x37d5c2  std::__1::__function::__alloc_func<>::operator()() at /home/jenkins-slave/workspace/build_and_test_flaky@2/thirdparty/installed/tsan/include/c++/v1/functional:1557
    @           0x37c25e  std::__1::__function::__func<>::operator()() at /home/jenkins-slave/workspace/build_and_test_flaky@2/thirdparty/installed/tsan/include/c++/v1/functional:1731
    @           0x3807f5  std::__1::__function::__value_func<>::operator()() at /home/jenkins-slave/workspace/build_and_test_flaky@2/thirdparty/installed/tsan/include/c++/v1/functional:1884
    @           0x38075a  std::__1::function<>::operator()() at /home/jenkins-slave/workspace/build_and_test_flaky@2/thirdparty/installed/tsan/include/c++/v1/functional:2556
    @     0x7f37ea62181b  kudu::Thread::SuperviseThread() at ??:0
    @           0x2a5380  __tsan_thread_start_func at /home/jenkins-slave/workspace/build_and_test/thirdparty/src/llvm-11.0.0.src/projects/compiler-rt/lib/tsan/rtl/tsan_interceptors_posix.cpp:959
I20260927 01:54:28.481600  7296 debug-util-test.cc:419]     @           0x2a54c0  __tsan::CallUserSignalHandler()
    @           0x2a7aa8  rtl_sigaction() at /home/jenkins-slave/workspace/build_and_test/thirdparty/src/llvm-11.0.0.src/projects/compiler-rt/lib/tsan/../sanitizer_common/sanitizer_atomic_clang_x86.h:81
    @     0x7f37e7195980  (unknown) at ??:0
    @     0x7f37e7194d50  __GI___nanosleep at ??:0
    @           0x2ca2a4  __interceptor_nanosleep at /home/jenkins-slave/workspace/build_and_test/thirdparty/src/llvm-11.0.0.src/projects/compiler-rt/lib/tsan/rtl/tsan_interceptors_posix.cpp:340
    @     0x7f37ea8daf0b  base::SleepForNanoseconds() at ??:0
    @     0x7f37ea5b73b7  kudu::SleepFor() at ??:0
    @           0x354a31  kudu::BlockSignalsThread() at /home/jenkins-slave/workspace/build_and_test_flaky@2/src/kudu/util/debug-util-test.cc:406
    @           0x37d677  _ZNSt3__18__invokeIRPFvvEJEEEDTclclsr3std3__1E7forwardIT_Efp_Espclsr3std3__1E7forwardIT0_Efp0_EEEOS4_DpOS5_ at /home/jenkins-slave/workspace/build_and_test_flaky@2/thirdparty/installed/tsan/include/c++/v1/type_traits:3905
    @           0x37d602  std::__1::__invoke_void_return_wrapper<>::__call<>() at /home/jenkins-slave/workspace/build_and_test_flaky@2/thirdparty/installed/tsan/include/c++/v1/__functional_base:349
    @           0x37d5c2  std::__1::__function::__alloc_func<>::operator()() at /home/jenkins-slave/workspace/build_and_test_flaky@2/thirdparty/installed/tsan/include/c++/v1/functional:1557
    @           0x37c25e  std::__1::__function::__func<>::operator()() at /home/jenkins-slave/workspace/build_and_test_flaky@2/thirdparty/installed/tsan/include/c++/v1/functional:1731
    @           0x3807f5  std::__1::__function::__value_func<>::operator()() at /home/jenkins-slave/workspace/build_and_test_flaky@2/thirdparty/installed/tsan/include/c++/v1/functional:1884
    @           0x38075a  std::__1::function<>::operator()() at /home/jenkins-slave/workspace/build_and_test_flaky@2/thirdparty/installed/tsan/include/c++/v1/functional:2556
    @     0x7f37ea62181b  kudu::Thread::SuperviseThread() at ??:0
    @           0x2a5380  __tsan_thread_start_func at /home/jenkins-slave/workspace/build_and_test/thirdparty/src/llvm-11.0.0.src/projects/compiler-rt/lib/tsan/rtl/tsan_interceptors_posix.cpp:959
W20260927 01:54:29.481994  7296 debug-util.cc:398] Leaking SignalData structure 0x7b0800002a40 after lost signal to thread 7334
I20260927 01:54:29.482259  7296 debug-util-test.cc:419] <Timed out: thread did not respond: maybe it is blocking signals>
I20260927 01:54:29.482522  7296 debug-util-test.cc:419] <Not found: unable to deliver signal: process may have exited>
[       OK ] DebugUtilTest.TestThreadBlockingSignals (3036 ms)
[ RUN      ] DebugUtilTest.TestTimeouts
I20260927 01:54:29.493530  7296 debug-util-test.cc:451] Median duration: 333us
W20260927 01:54:29.688414  7296 debug-util.cc:398] Leaking SignalData structure 0x7b0800002a20 after lost signal to thread 7364
W20260927 01:54:29.688762  7296 debug-util.cc:398] Leaking SignalData structure 0x7b0800002a00 after lost signal to thread 7364
W20260927 01:54:29.776445  7296 debug-util.cc:398] Leaking SignalData structure 0x7b08000029e0 after lost signal to thread 7364
W20260927 01:54:29.776774  7296 debug-util.cc:398] Leaking SignalData structure 0x7b08000029c0 after lost signal to thread 7364
W20260927 01:54:29.837378  7296 debug-util.cc:398] Leaking SignalData structure 0x7b08000029a0 after lost signal to thread 7364
W20260927 01:54:29.929188  7296 debug-util.cc:398] Leaking SignalData structure 0x7b0800002980 after lost signal to thread 7364
W20260927 01:54:29.990319  7296 debug-util.cc:398] Leaking SignalData structure 0x7b0800002960 after lost signal to thread 7364
W20260927 01:54:29.993373  7296 debug-util.cc:398] Leaking SignalData structure 0x7b0800002940 after lost signal to thread 7364
W20260927 01:54:29.998348  7296 debug-util.cc:398] Leaking SignalData structure 0x7b0800002920 after lost signal to thread 7364
W20260927 01:54:30.012918  7296 debug-util.cc:398] Leaking SignalData structure 0x7b0800002900 after lost signal to thread 7364
W20260927 01:54:30.021461  7296 debug-util.cc:398] Leaking SignalData structure 0x7b08000028e0 after lost signal to thread 7364
W20260927 01:54:30.021747  7296 debug-util.cc:398] Leaking SignalData structure 0x7b08000028c0 after lost signal to thread 7364
W20260927 01:54:30.221192  7296 debug-util.cc:398] Leaking SignalData structure 0x7b0800000d60 after lost signal to thread 7364
W20260927 01:54:30.252358  7296 debug-util.cc:398] Leaking SignalData structure 0x7b0800002880 after lost signal to thread 7364
W20260927 01:54:30.253396  7296 debug-util.cc:398] Leaking SignalData structure 0x7b0800000b00 after lost signal to thread 7364
I20260927 01:54:30.493865  7296 debug-util-test.cc:481] Timed out 15 times
I20260927 01:54:30.494066  7296 debug-util-test.cc:482] Succeeded 4041 times
[       OK ] DebugUtilTest.TestTimeouts (1010 ms)
[----------] 9 tests from DebugUtilTest (7227 ms total)

[----------] 4 tests from DifferentRaces/RaceTest
[ RUN      ] DifferentRaces/RaceTest.TestStackTraceRaces/0
[       OK ] DifferentRaces/RaceTest.TestStackTraceRaces/0 (1003 ms)
[ RUN      ] DifferentRaces/RaceTest.TestStackTraceRaces/1
W20260927 01:54:36.501768  7296 debug-util.cc:398] Leaking SignalData structure 0x7b0800000ac0 after lost signal to thread 7366
/home/jenkins-slave/workspace/build_and_test_flaky@2/src/kudu/util/debug-util-test.cc:398: Failure
Failed
Bad status: Timed out: thread did not respond: maybe it is blocking signals
I20260927 01:54:36.504820  7296 test_util.cc:182] -----------------------------------------------
I20260927 01:54:36.504966  7296 test_util.cc:183] Had failures, leaving test files at /tmp/dist-test-taskidlsNV/test-tmp/debug-util-test.0.DifferentRaces_RaceTest.TestStackTraceRaces_1.1790474063253907-7296-0
[  FAILED  ] DifferentRaces/RaceTest.TestStackTraceRaces/1, where GetParam() = 1 (5005 ms)
[ RUN      ] DifferentRaces/RaceTest.TestStackTraceRaces/2
[       OK ] DifferentRaces/RaceTest.TestStackTraceRaces/2 (1013 ms)
[ RUN      ] DifferentRaces/RaceTest.TestStackTraceRaces/3
[       OK ] DifferentRaces/RaceTest.TestStackTraceRaces/3 (1002 ms)
[----------] 4 tests from DifferentRaces/RaceTest (8026 ms total)

[----------] Global test environment tear-down
[==========] 13 tests from 2 test suites ran. (15253 ms total)
[  PASSED  ] 12 tests.
[  FAILED  ] 1 test, listed below:
[  FAILED  ] DifferentRaces/RaceTest.TestStackTraceRaces/1, where GetParam() = 1

 1 FAILED TEST