Diagnosed failure
Parameters/TestRpc.TestCallWithChainCertAndChainCA/SSL_UnixSocket: /data0/somelongdirectorytoavoidrpathissues/src/kudu/src/kudu/rpc/rpc-test.cc:270: Failure
Failed
Bad status: Runtime error: could not verify certificate chain (error with cert: subject=CN = localhost, ST = sadfjas, C = AS, emailAddress = sdflkdsajf, O = lskdfjlsad, OU = sldfkja, issuer=C = AS, ST = ASDfkjdhf, L = lskdjf, O = saldfja, OU = skdjf, CN = localhost, emailAddress = sadjflkadsj): : certificate has expired
Google Test trace:
/data0/somelongdirectorytoavoidrpathissues/src/kudu/src/kudu/rpc/rpc-test.cc:267: Connecting to unix:/tmp/dist-test-taskM7TgU_/test-tmp/rpc-test-a41437bec7134f0cb091cef912a276ed.sock
I20260924 23:04:46.235108 6970 test_util.cc:175] -----------------------------------------------
I20260924 23:04:46.235167 6970 test_util.cc:176] Had fatal failures, leaving test files at /tmp/dist-test-taskM7TgU_/test-tmp/rpc-test.6.Parameters_TestRpc.TestCallWithChainCertAndChainCA_SSL_UnixSocket.1790291086167288-6970-0
Full log
Note: This is test shard 7 of 8.
[==========] Running 21 tests from 2 test suites.
[----------] Global test environment set-up.
[----------] 20 tests from Parameters/TestRpc
[ RUN ] Parameters/TestRpc.TestMessengerCreateDestroy/SSL_UnixSocket
WARNING: Logging before InitGoogleLogging() is written to STDERR
I20260924 23:04:46.190764 6970 rpc-test.cc:169] started messenger TestCreateDestroy
[ OK ] Parameters/TestRpc.TestMessengerCreateDestroy/SSL_UnixSocket (22 ms)
[ RUN ] Parameters/TestRpc.TestNegotiationDeadlock/SSL_UnixSocket
I20260924 23:04:46.208609 6990 acceptor_pool.cc:254] collecting diagnostics on the listening RPC socket unix:/tmp/dist-test-taskM7TgU_/test-tmp/rpc-test-fbf56948fd7d4f2e88f3381e8186f4ed.sock every 8 connection(s)
I20260924 23:04:46.208609 6991 acceptor_pool.cc:254] collecting diagnostics on the listening RPC socket unix:/tmp/dist-test-taskM7TgU_/test-tmp/rpc-test-fbf56948fd7d4f2e88f3381e8186f4ed.sock every 8 connection(s)
[ OK ] Parameters/TestRpc.TestNegotiationDeadlock/SSL_UnixSocket (24 ms)
[ RUN ] Parameters/TestRpc.TestCallWithChainCertAndChainCA/SSL_UnixSocket
I20260924 23:04:46.230665 7006 acceptor_pool.cc:254] collecting diagnostics on the listening RPC socket unix:/tmp/dist-test-taskM7TgU_/test-tmp/rpc-test-a41437bec7134f0cb091cef912a276ed.sock every 8 connection(s)
I20260924 23:04:46.230669 7007 acceptor_pool.cc:254] collecting diagnostics on the listening RPC socket unix:/tmp/dist-test-taskM7TgU_/test-tmp/rpc-test-a41437bec7134f0cb091cef912a276ed.sock every 8 connection(s)
/data0/somelongdirectorytoavoidrpathissues/src/kudu/src/kudu/rpc/rpc-test.cc:270: Failure
Failed
Bad status: Runtime error: could not verify certificate chain (error with cert: subject=CN = localhost, ST = sadfjas, C = AS, emailAddress = sdflkdsajf, O = lskdfjlsad, OU = sldfkja, issuer=C = AS, ST = ASDfkjdhf, L = lskdjf, O = saldfja, OU = skdjf, CN = localhost, emailAddress = sadjflkadsj): : certificate has expired
Google Test trace:
/data0/somelongdirectorytoavoidrpathissues/src/kudu/src/kudu/rpc/rpc-test.cc:267: Connecting to unix:/tmp/dist-test-taskM7TgU_/test-tmp/rpc-test-a41437bec7134f0cb091cef912a276ed.sock
I20260924 23:04:46.235108 6970 test_util.cc:175] -----------------------------------------------
I20260924 23:04:46.235167 6970 test_util.cc:176] Had fatal failures, leaving test files at /tmp/dist-test-taskM7TgU_/test-tmp/rpc-test.6.Parameters_TestRpc.TestCallWithChainCertAndChainCA_SSL_UnixSocket.1790291086167288-6970-0
[ FAILED ] Parameters/TestRpc.TestCallWithChainCertAndChainCA/SSL_UnixSocket, where GetParam() = (true, true) (18 ms)
[ RUN ] Parameters/TestRpc.TestCallWithPasswordProtectedKey/SSL_UnixSocket
I20260924 23:04:46.248559 7031 acceptor_pool.cc:254] collecting diagnostics on the listening RPC socket unix:/tmp/dist-test-taskM7TgU_/test-tmp/rpc-test-e6620416b7ff450290f86b1efdca2b1b.sock every 8 connection(s)
I20260924 23:04:46.248638 7032 acceptor_pool.cc:254] collecting diagnostics on the listening RPC socket unix:/tmp/dist-test-taskM7TgU_/test-tmp/rpc-test-e6620416b7ff450290f86b1efdca2b1b.sock every 8 connection(s)
W20260924 23:04:46.259830 7028 connection.cc:196] Error closing socket: Network error: TlsSocket::Close: Broken pipe
[ OK ] Parameters/TestRpc.TestCallWithPasswordProtectedKey/SSL_UnixSocket (25 ms)
[ RUN ] Parameters/TestRpc.TestCallToBadServer/SSL_UnixSocket
I20260924 23:04:46.278194 6970 rpc-test.cc:394] Status: Network error: Client connection negotiation failed: client connection to 0.0.0.0:0: connect: Connection refused (error 111)
I20260924 23:04:46.278637 6970 rpc-test.cc:394] Status: Network error: Client connection negotiation failed: client connection to 0.0.0.0:0: connect: Connection refused (error 111)
I20260924 23:04:46.278937 6970 rpc-test.cc:394] Status: Network error: Client connection negotiation failed: client connection to 0.0.0.0:0: connect: Connection refused (error 111)
I20260924 23:04:46.279218 6970 rpc-test.cc:394] Status: Network error: Client connection negotiation failed: client connection to 0.0.0.0:0: connect: Connection refused (error 111)
I20260924 23:04:46.279491 6970 rpc-test.cc:394] Status: Network error: Client connection negotiation failed: client connection to 0.0.0.0:0: connect: Connection refused (error 111)
[ OK ] Parameters/TestRpc.TestCallToBadServer/SSL_UnixSocket (19 ms)
[ RUN ] Parameters/TestRpc.TestWrongService/SSL_UnixSocket
I20260924 23:04:46.289685 7067 acceptor_pool.cc:254] collecting diagnostics on the listening RPC socket unix:/tmp/dist-test-taskM7TgU_/test-tmp/rpc-test-63623c22a2304746884f7c9cca99d4f5.sock every 8 connection(s)
I20260924 23:04:46.289664 7066 acceptor_pool.cc:254] collecting diagnostics on the listening RPC socket unix:/tmp/dist-test-taskM7TgU_/test-tmp/rpc-test-63623c22a2304746884f7c9cca99d4f5.sock every 8 connection(s)
I20260924 23:04:46.313270 7063 messenger.cc:345] service WrongServiceName not registered on TestServer
W20260924 23:04:46.313979 7063 connection.cc:196] Error closing socket: Network error: TlsSocket::Close: Broken pipe
[ OK ] Parameters/TestRpc.TestWrongService/SSL_UnixSocket (34 ms)
[ RUN ] Parameters/TestRpc.TestConnectionKeepalive/SSL_UnixSocket
I20260924 23:04:46.329283 7089 acceptor_pool.cc:254] collecting diagnostics on the listening RPC socket unix:/tmp/dist-test-taskM7TgU_/test-tmp/rpc-test-09d58b2cf3df4325a7ad4866b743c2af.sock every 8 connection(s)
I20260924 23:04:46.329305 7090 acceptor_pool.cc:254] collecting diagnostics on the listening RPC socket unix:/tmp/dist-test-taskM7TgU_/test-tmp/rpc-test-09d58b2cf3df4325a7ad4866b743c2af.sock every 8 connection(s)
I20260924 23:04:46.329428 6970 rpc-test.cc:488] Connecting to unix:/tmp/dist-test-taskM7TgU_/test-tmp/rpc-test-09d58b2cf3df4325a7ad4866b743c2af.sock
W20260924 23:04:46.816452 7102 connection.cc:196] Error closing socket: Network error: TlsSocket::Close: Broken pipe
[ OK ] Parameters/TestRpc.TestConnectionKeepalive/SSL_UnixSocket (1031 ms)
[ RUN ] Parameters/TestRpc.TestClientConnectionMetrics/SSL_UnixSocket
I20260924 23:04:47.372315 7114 acceptor_pool.cc:254] collecting diagnostics on the listening RPC socket unix:/tmp/dist-test-taskM7TgU_/test-tmp/rpc-test-1b66c6e518c14806a90d68821b7f04c0.sock every 8 connection(s)
I20260924 23:04:47.372462 6970 rpc-test.cc:569] Connecting to unix:/tmp/dist-test-taskM7TgU_/test-tmp/rpc-test-1b66c6e518c14806a90d68821b7f04c0.sock
I20260924 23:04:47.372326 7115 acceptor_pool.cc:254] collecting diagnostics on the listening RPC socket unix:/tmp/dist-test-taskM7TgU_/test-tmp/rpc-test-1b66c6e518c14806a90d68821b7f04c0.sock every 8 connection(s)
W20260924 23:04:55.643268 7111 connection.cc:196] Error closing socket: Network error: TlsSocket::Close: Broken pipe
[ OK ] Parameters/TestRpc.TestClientConnectionMetrics/SSL_UnixSocket (8298 ms)
[ RUN ] Parameters/TestRpc.TestCredentialsPolicy/SSL_UnixSocket
I20260924 23:04:55.671568 7137 acceptor_pool.cc:254] collecting diagnostics on the listening RPC socket unix:/tmp/dist-test-taskM7TgU_/test-tmp/rpc-test-65f9a888c1124879bc28062c99018d37.sock every 8 connection(s)
I20260924 23:04:55.671590 7138 acceptor_pool.cc:254] collecting diagnostics on the listening RPC socket unix:/tmp/dist-test-taskM7TgU_/test-tmp/rpc-test-65f9a888c1124879bc28062c99018d37.sock every 8 connection(s)
I20260924 23:04:55.671711 6970 rpc-test.cc:700] Connecting to unix:/tmp/dist-test-taskM7TgU_/test-tmp/rpc-test-65f9a888c1124879bc28062c99018d37.sock
W20260924 23:04:55.685007 7136 connection.cc:196] Error closing socket: Network error: TlsSocket::Close: Broken pipe
[ OK ] Parameters/TestRpc.TestCredentialsPolicy/SSL_UnixSocket (45 ms)
[ RUN ] Parameters/TestRpc.TestCallLongerThanKeepalive/SSL_UnixSocket
I20260924 23:04:55.728588 7162 acceptor_pool.cc:254] collecting diagnostics on the listening RPC socket unix:/tmp/dist-test-taskM7TgU_/test-tmp/rpc-test-cd09179fae714293bf065ea1fef0a8e6.sock every 8 connection(s)
I20260924 23:04:55.728611 7163 acceptor_pool.cc:254] collecting diagnostics on the listening RPC socket unix:/tmp/dist-test-taskM7TgU_/test-tmp/rpc-test-cd09179fae714293bf065ea1fef0a8e6.sock every 8 connection(s)
I20260924 23:04:55.743990 7165 rpc-test-base.h:222] got call: sleep_micros: 3000000 deferred: true
I20260924 23:04:58.744747 7165 rpcz_store.cc:275] Call kudu.rpc.GenericCalculatorService.Sleep from unix:<unnamed> (request call id 0) took 3000 ms. Trace:
I20260924 23:04:58.744853 7165 rpcz_store.cc:276] 0924 23:04:55.743898 (+ 0us) service_pool.cc:170] Inserting onto call queue
0924 23:04:55.743956 (+ 58us) service_pool.cc:227] Handling call
0924 23:04:58.744729 (+3000773us) inbound_call.cc:173] Queueing success response
Metrics: {}
[ OK ] Parameters/TestRpc.TestCallLongerThanKeepalive/SSL_UnixSocket (3057 ms)
[ RUN ] Parameters/TestRpc.TestRpcSidecar/SSL_UnixSocket
I20260924 23:04:58.758631 7187 acceptor_pool.cc:254] collecting diagnostics on the listening RPC socket unix:/tmp/dist-test-taskM7TgU_/test-tmp/rpc-test-795e471f579041ddb9b802515fb2231c.sock every 8 connection(s)
I20260924 23:04:58.758672 7188 acceptor_pool.cc:254] collecting diagnostics on the listening RPC socket unix:/tmp/dist-test-taskM7TgU_/test-tmp/rpc-test-795e471f579041ddb9b802515fb2231c.sock every 8 connection(s)
W20260924 23:04:58.790411 7184 connection.cc:196] Error closing socket: Network error: TlsSocket::Close: Broken pipe
[ OK ] Parameters/TestRpc.TestRpcSidecar/SSL_UnixSocket (44 ms)
[ RUN ] Parameters/TestRpc.TestRpcSidecarLimits/SSL_UnixSocket
I20260924 23:05:00.544509 7212 acceptor_pool.cc:254] collecting diagnostics on the listening RPC socket unix:/tmp/dist-test-taskM7TgU_/test-tmp/rpc-test-ae7acadc32de49658097e3af8e289400.sock every 8 connection(s)
I20260924 23:05:00.544518 7213 acceptor_pool.cc:254] collecting diagnostics on the listening RPC socket unix:/tmp/dist-test-taskM7TgU_/test-tmp/rpc-test-ae7acadc32de49658097e3af8e289400.sock every 8 connection(s)
W20260924 23:05:00.556038 6970 serialization.cc:72] Serialized kudu.rpc_test.PushStringsRequestPB (2147483654 bytes) is larger than the maximum configured RPC message size (52428800 bytes). Sending anyway, but peer may reject the data.
W20260924 23:05:00.559607 7209 connection.cc:535] server connection from unix:<unnamed> recv error: Network error: RPC frame had a length of 2147483714, but we only support messages up to 52428800 bytes long.
W20260924 23:05:00.559669 7209 connection.cc:158] shutting down server connection from unix:<unnamed> with pending inbound data: 4/2147483714 bytes received; last active 0 ns ago: status Network error: RPC frame had a length of 2147483714, but we only support messages up to 52428800 bytes long.
W20260924 23:05:00.559816 7225 connection.cc:698] client connection to unix:/tmp/dist-test-taskM7TgU_/test-tmp/rpc-test-ae7acadc32de49658097e3af8e289400.sock send error: Network error: failed to write to TLS socket: Broken pipe
W20260924 23:05:00.559942 7225 connection.cc:196] Error closing socket: Network error: TlsSocket::Close: Success
I20260924 23:05:00.570806 7238 acceptor_pool.cc:254] collecting diagnostics on the listening RPC socket unix:/tmp/dist-test-taskM7TgU_/test-tmp/rpc-test-ae7acadc32de49658097e3af8e289400.sock every 8 connection(s)
I20260924 23:05:00.570806 7237 acceptor_pool.cc:254] collecting diagnostics on the listening RPC socket unix:/tmp/dist-test-taskM7TgU_/test-tmp/rpc-test-ae7acadc32de49658097e3af8e289400.sock every 8 connection(s)
W20260924 23:05:05.157404 7234 connection.cc:577] server connection from unix:<unnamed>: received bad data: 'Corruption: Invalid packet: message had a length of 2147483710, but we only support messages up to 2147483647 bytes
'
W20260924 23:05:05.157784 7250 connection.cc:196] Error closing socket: Network error: TlsSocket::Close: Broken pipe
[ OK ] Parameters/TestRpc.TestRpcSidecarLimits/SSL_UnixSocket (6368 ms)
[ RUN ] Parameters/TestRpc.TestCallTimeoutDoesntAffectNegotiation/SSL_UnixSocket
I20260924 23:05:05.180691 7262 acceptor_pool.cc:254] collecting diagnostics on the listening RPC socket unix:/tmp/dist-test-taskM7TgU_/test-tmp/rpc-test-36963ac852574f3f91b186323b501644.sock every 8 connection(s)
I20260924 23:05:05.180714 7263 acceptor_pool.cc:254] collecting diagnostics on the listening RPC socket unix:/tmp/dist-test-taskM7TgU_/test-tmp/rpc-test-36963ac852574f3f91b186323b501644.sock every 8 connection(s)
W20260924 23:05:05.192327 7258 negotiation.cc:266] Injecting 500ms delay in negotiation
I20260924 23:05:05.242652 6970 rpc-test-base.h:595] status: Timed out: connection negotiation to unix:/tmp/dist-test-taskM7TgU_/test-tmp/rpc-test-36963ac852574f3f91b186323b501644.sock for RPC Sleep timed out after 0.050s (ON_OUTBOUND_QUEUE), seconds elapsed: 0.0506315
W20260924 23:05:05.696341 7259 connection.cc:196] Error closing socket: Network error: TlsSocket::Close: Broken pipe
[ OK ] Parameters/TestRpc.TestCallTimeoutDoesntAffectNegotiation/SSL_UnixSocket (537 ms)
[ RUN ] Parameters/TestRpc.TestRpcHandlerLatencyMetric/SSL_UnixSocket
I20260924 23:05:05.712540 7287 acceptor_pool.cc:254] collecting diagnostics on the listening RPC socket unix:/tmp/dist-test-taskM7TgU_/test-tmp/rpc-test-6763b76e009245f79ce448634ba8e205.sock every 8 connection(s)
I20260924 23:05:05.712579 7288 acceptor_pool.cc:254] collecting diagnostics on the listening RPC socket unix:/tmp/dist-test-taskM7TgU_/test-tmp/rpc-test-6763b76e009245f79ce448634ba8e205.sock every 8 connection(s)
I20260924 23:05:05.744035 6970 rpc-test.cc:1236] Sleep() min lat: 20293
I20260924 23:05:05.744122 6970 rpc-test.cc:1237] Sleep() mean lat: 20293
I20260924 23:05:05.744146 6970 rpc-test.cc:1238] Sleep() max lat: 20293
I20260924 23:05:05.744158 6970 rpc-test.cc:1239] Sleep() #calls: 1
[ OK ] Parameters/TestRpc.TestRpcHandlerLatencyMetric/SSL_UnixSocket (48 ms)
[ RUN ] Parameters/TestRpc.TimedOutOnResponseMetricServiceQueue/SSL_UnixSocket
I20260924 23:05:05.767503 7313 acceptor_pool.cc:254] collecting diagnostics on the listening RPC socket unix:/tmp/dist-test-taskM7TgU_/test-tmp/rpc-test-bead82c36d144422955f3b115da28393.sock every 8 connection(s)
I20260924 23:05:05.767508 7314 acceptor_pool.cc:254] collecting diagnostics on the listening RPC socket unix:/tmp/dist-test-taskM7TgU_/test-tmp/rpc-test-bead82c36d144422955f3b115da28393.sock every 8 connection(s)
W20260924 23:05:05.829864 7315 rpcz_store.cc:267] Call kudu.rpc_test.CalculatorService.Sleep from unix:<unnamed> (request call id 2) took 20 ms (client timeout 20 ms). Trace:
W20260924 23:05:05.829958 7315 rpcz_store.cc:269] 0924 23:05:05.809648 (+ 0us) service_pool.cc:170] Inserting onto call queue
0924 23:05:05.829834 (+ 20186us) service_pool.cc:214] Skipping call since client already timed out
0924 23:05:05.829851 (+ 17us) inbound_call.cc:173] Queueing failure response
Metrics: {}
[ OK ] Parameters/TestRpc.TimedOutOnResponseMetricServiceQueue/SSL_UnixSocket (85 ms)
[ RUN ] Parameters/TestRpc.RpcPendingConnectionsMetric/SSL_UnixSocket
I20260924 23:05:05.832999 7336 acceptor_pool.cc:254] collecting diagnostics on the listening RPC socket 0.0.0.0:43611 every 8 connection(s)
I20260924 23:05:05.833010 7337 acceptor_pool.cc:254] collecting diagnostics on the listening RPC socket 0.0.0.0:43611 every 8 connection(s)
W20260924 23:05:05.833549 7332 negotiation.cc:337] Failed RPC negotiation. Trace:
0924 23:05:05.833409 (+ 0us) reactor.cc:625] Submitting negotiation task for server connection from 127.0.0.1:32936 (local address 127.0.0.1:43611)
0924 23:05:05.833451 (+ 42us) server_negotiation.cc:206] Beginning negotiation
0924 23:05:05.833453 (+ 2us) server_negotiation.cc:399] Waiting for connection header
0924 23:05:05.833500 (+ 47us) negotiation.cc:327] Negotiation complete: Network error: Server connection negotiation failed: server connection from 127.0.0.1:32936: BlockingRecv error: recv got EOF from 127.0.0.1:32936 (error 108)
Metrics: {"server-negotiator.queue_time_us":16}
[ OK ] Parameters/TestRpc.RpcPendingConnectionsMetric/SSL_UnixSocket (13 ms)
[ RUN ] Parameters/TestRpc.TestRpcContextClientDeadline/SSL_UnixSocket
I20260924 23:05:05.864621 7352 acceptor_pool.cc:254] collecting diagnostics on the listening RPC socket unix:/tmp/dist-test-taskM7TgU_/test-tmp/rpc-test-c3adf0237f71459aa9d6b685c418d333.sock every 8 connection(s)
I20260924 23:05:05.864673 7353 acceptor_pool.cc:254] collecting diagnostics on the listening RPC socket unix:/tmp/dist-test-taskM7TgU_/test-tmp/rpc-test-c3adf0237f71459aa9d6b685c418d333.sock every 8 connection(s)
[ OK ] Parameters/TestRpc.TestRpcContextClientDeadline/SSL_UnixSocket (54 ms)
[ RUN ] Parameters/TestRpc.TestApplicationFeatureFlagUnsupportedServer/SSL_UnixSocket
I20260924 23:05:05.926519 7377 acceptor_pool.cc:254] collecting diagnostics on the listening RPC socket unix:/tmp/dist-test-taskM7TgU_/test-tmp/rpc-test-96711308dc1a4b4d9426d6a4abf7e5ec.sock every 8 connection(s)
I20260924 23:05:05.926548 7378 acceptor_pool.cc:254] collecting diagnostics on the listening RPC socket unix:/tmp/dist-test-taskM7TgU_/test-tmp/rpc-test-96711308dc1a4b4d9426d6a4abf7e5ec.sock every 8 connection(s)
[ OK ] Parameters/TestRpc.TestApplicationFeatureFlagUnsupportedServer/SSL_UnixSocket (63 ms)
[ RUN ] Parameters/TestRpc.TestCancellationAsync/SSL_UnixSocket
I20260924 23:05:05.981619 7402 acceptor_pool.cc:254] collecting diagnostics on the listening RPC socket unix:/tmp/dist-test-taskM7TgU_/test-tmp/rpc-test-06c62e775d904abca03ed72213c4fa86.sock every 8 connection(s)
I20260924 23:05:05.981649 7403 acceptor_pool.cc:254] collecting diagnostics on the listening RPC socket unix:/tmp/dist-test-taskM7TgU_/test-tmp/rpc-test-06c62e775d904abca03ed72213c4fa86.sock every 8 connection(s)
I20260924 23:05:05.981791 6970 rpc-test.cc:1716] Connecting to unix:/tmp/dist-test-taskM7TgU_/test-tmp/rpc-test-06c62e775d904abca03ed72213c4fa86.sock
I20260924 23:05:06.013413 6970 test_util.cc:268] Using random seed: -1586814750
I20260924 23:05:06.030743 7406 rpc-test-base.h:240] got call: sleep_micros: 500 pattern: 4294967295 num_repetitions: 2097152 sidecar_idx: 0
I20260924 23:05:06.043666 7406 rpc-test-base.h:240] got call: sleep_micros: 500 pattern: 4294967295 num_repetitions: 2097152 sidecar_idx: 0
I20260924 23:05:06.054955 7406 rpc-test-base.h:240] got call: sleep_micros: 500 pattern: 4294967295 num_repetitions: 2097152 sidecar_idx: 0
I20260924 23:05:06.067094 7406 rpc-test-base.h:240] got call: sleep_micros: 500 pattern: 4294967295 num_repetitions: 2097152 sidecar_idx: 0
I20260924 23:05:06.079845 7406 rpc-test-base.h:240] got call: sleep_micros: 500 pattern: 4294967295 num_repetitions: 2097152 sidecar_idx: 0
I20260924 23:05:06.091935 7406 rpc-test-base.h:240] got call: sleep_micros: 500 pattern: 4294967295 num_repetitions: 2097152 sidecar_idx: 0
I20260924 23:05:06.103436 7406 rpc-test-base.h:240] got call: sleep_micros: 500 pattern: 4294967295 num_repetitions: 2097152 sidecar_idx: 0
I20260924 23:05:06.115758 7406 rpc-test-base.h:240] got call: sleep_micros: 500 pattern: 4294967295 num_repetitions: 2097152 sidecar_idx: 0
W20260924 23:05:06.117456 7399 connection.cc:196] Error closing socket: Network error: TlsSocket::Close: Broken pipe
W20260924 23:05:06.118836 7399 connection.cc:441] server connection from unix:<unnamed> torn down before Call kudu.rpc.GenericCalculatorService.SleepWithSidecar from unix:<unnamed> (request call id 9) could send its response
[ OK ] Parameters/TestRpc.TestCancellationAsync/SSL_UnixSocket (157 ms)
[ RUN ] Parameters/TestRpc.TestPerformanceBySocketType/SSL_UnixSocket
I20260924 23:05:06.132864 7427 acceptor_pool.cc:254] collecting diagnostics on the listening RPC socket unix:/tmp/dist-test-taskM7TgU_/test-tmp/rpc-test-544d6a4a5a4340d1a1c341578727f00d.sock every 8 connection(s)
I20260924 23:05:06.132918 7428 acceptor_pool.cc:254] collecting diagnostics on the listening RPC socket unix:/tmp/dist-test-taskM7TgU_/test-tmp/rpc-test-544d6a4a5a4340d1a1c341578727f00d.sock every 8 connection(s)
I20260924 23:05:06.133044 6970 rpc-test.cc:1846] Connecting to unix:/tmp/dist-test-taskM7TgU_/test-tmp/rpc-test-544d6a4a5a4340d1a1c341578727f00d.sock
I20260924 23:05:07.501225 6970 rpc-test.cc:1859] Sending 1024MB via ssl-enabled unix socket: real 1.361s user 1.548s sys 0.840s
I20260924 23:05:08.830325 6970 rpc-test.cc:1859] Sending 1024MB via ssl-enabled unix socket: real 1.329s user 1.480s sys 0.852s
I20260924 23:05:10.314503 6970 rpc-test.cc:1859] Sending 1024MB via ssl-enabled unix socket: real 1.484s user 1.677s sys 0.896s
I20260924 23:05:11.803557 6970 rpc-test.cc:1859] Sending 1024MB via ssl-enabled unix socket: real 1.489s user 1.568s sys 1.019s
I20260924 23:05:13.626561 6970 rpc-test.cc:1859] Sending 1024MB via ssl-enabled unix socket: real 1.823s user 1.868s sys 1.173s
W20260924 23:05:13.627429 7424 connection.cc:196] Error closing socket: Network error: TlsSocket::Close: Broken pipe
[ OK ] Parameters/TestRpc.TestPerformanceBySocketType/SSL_UnixSocket (7508 ms)
[----------] 20 tests from Parameters/TestRpc (27459 ms total)
[----------] 1 test from Parameters/TestRpcSocketTxRxQueue
[ RUN ] Parameters/TestRpcSocketTxRxQueue.AcceptorRxQueueSizeMetric/0
I20260924 23:05:13.634464 7452 acceptor_pool.cc:254] collecting diagnostics on the listening RPC socket 0.0.0.0:46229 every 1 connection(s)
I20260924 23:05:13.634579 7453 acceptor_pool.cc:254] collecting diagnostics on the listening RPC socket 0.0.0.0:46229 every 1 connection(s)
W20260924 23:05:13.635183 7448 negotiation.cc:337] Failed RPC negotiation. Trace:
0924 23:05:13.634989 (+ 0us) reactor.cc:625] Submitting negotiation task for server connection from 127.0.0.1:53618 (local address 127.0.0.1:46229)
0924 23:05:13.635057 (+ 68us) server_negotiation.cc:206] Beginning negotiation
0924 23:05:13.635058 (+ 1us) server_negotiation.cc:399] Waiting for connection header
0924 23:05:13.635142 (+ 84us) negotiation.cc:327] Negotiation complete: Network error: Server connection negotiation failed: server connection from 127.0.0.1:53618: BlockingRecv error: recv got EOF from 127.0.0.1:53618 (error 108)
Metrics: {"server-negotiator.queue_time_us":41}
[ OK ] Parameters/TestRpcSocketTxRxQueue.AcceptorRxQueueSizeMetric/0 (8 ms)
[----------] 1 test from Parameters/TestRpcSocketTxRxQueue (8 ms total)
[----------] Global test environment tear-down
[==========] 21 tests from 2 test suites ran. (27467 ms total)
[ PASSED ] 20 tests.
[ FAILED ] 1 test, listed below:
[ FAILED ] Parameters/TestRpc.TestCallWithChainCertAndChainCA/SSL_UnixSocket, where GetParam() = (true, true)
1 FAILED TEST