Parameters/TestRpc.TestCallWithChainCertAndRootCA/SSL_UnixSocket: /data0/somelongdirectorytoavoidrpathissues/src/kudu/src/kudu/rpc/rpc-test.cc:303: Failure
Failed
Bad status: Runtime error: could not verify certificate chain (error with cert: subject=CN = localhost, ST = sadfjas, C = AS, emailAddress = sdflkdsajf, O = lskdfjlsad, OU = sldfkja, issuer=C = AS, ST = ASDfkjdhf, L = lskdjf, O = saldfja, OU = skdjf, CN = localhost, emailAddress = sadjflkadsj): : certificate has expired
Google Test trace:
/data0/somelongdirectorytoavoidrpathissues/src/kudu/src/kudu/rpc/rpc-test.cc:300: Connecting to unix:/tmp/dist-test-taskqAkd5e/test-tmp/rpc-test-769dc722442b415094bdd7bad36a1fc3.sock
I20260928 06:17:38.612526 11780 test_util.cc:175] -----------------------------------------------
I20260928 06:17:38.612711 11780 test_util.cc:176] Had fatal failures, leaving test files at /tmp/dist-test-taskqAkd5e/test-tmp/rpc-test.2.Parameters_TestRpc.TestCallWithChainCertAndRootCA_SSL_UnixSocket.1790576254972844-11780-0
Note: This is test shard 3 of 8.
[==========] Running 21 tests from 2 test suites.
[----------] Global test environment set-up.
[----------] 1 test from TestRpc
[ RUN ] TestRpc.TestNegotiationTimeout
WARNING: Logging before InitGoogleLogging() is written to STDERR
I20260928 06:17:35.158726 11780 rpc-test-base.h:595] status: Timed out: connection negotiation to 0.0.0.0:40393 for RPC Sleep timed out after 0.100s (ON_OUTBOUND_QUEUE), seconds elapsed: 0.101614
W20260928 06:17:38.305245 11790 negotiation.cc:337] Failed RPC negotiation. Trace:
0928 06:17:35.058055 (+ 0us) reactor.cc:625] Submitting negotiation task for client connection to 0.0.0.0:40393 (local address 127.0.0.1:51730)
0928 06:17:35.058697 (+ 642us) negotiation.cc:107] Waiting for socket to connect
0928 06:17:35.058742 (+ 45us) client_negotiation.cc:174] Beginning negotiation
0928 06:17:35.070677 (+ 11935us) client_negotiation.cc:252] Sending NEGOTIATE NegotiatePB request
0928 06:17:38.304154 (+3233477us) negotiation.cc:327] Negotiation complete: Timed out: Client connection negotiation failed: client connection to 0.0.0.0:40393: received 0 of 4 requested bytes
Metrics: {"client-negotiator.queue_time_us":204}
[ OK ] TestRpc.TestNegotiationTimeout (3284 ms)
[----------] 1 test from TestRpc (3284 ms total)
[----------] 20 tests from Parameters/TestRpc
[ RUN ] Parameters/TestRpc.TestAcceptorPoolStartStop/SSL_UnixSocket
I20260928 06:17:38.338758 11806 acceptor_pool.cc:254] collecting diagnostics on the listening RPC socket unix:/tmp/dist-test-taskqAkd5e/test-tmp/rpc-test-c6bedde80705443098c16adcf9e66801.sock every 8 connection(s)
I20260928 06:17:38.340677 11807 acceptor_pool.cc:254] collecting diagnostics on the listening RPC socket unix:/tmp/dist-test-taskqAkd5e/test-tmp/rpc-test-c6bedde80705443098c16adcf9e66801.sock every 8 connection(s)
I20260928 06:17:38.375340 11817 acceptor_pool.cc:254] collecting diagnostics on the listening RPC socket unix:/tmp/dist-test-taskqAkd5e/test-tmp/rpc-test-c6bedde80705443098c16adcf9e66801.sock every 8 connection(s)
I20260928 06:17:38.376824 11818 acceptor_pool.cc:254] collecting diagnostics on the listening RPC socket unix:/tmp/dist-test-taskqAkd5e/test-tmp/rpc-test-c6bedde80705443098c16adcf9e66801.sock every 8 connection(s)
I20260928 06:17:38.395998 11828 acceptor_pool.cc:254] collecting diagnostics on the listening RPC socket unix:/tmp/dist-test-taskqAkd5e/test-tmp/rpc-test-c6bedde80705443098c16adcf9e66801.sock every 8 connection(s)
I20260928 06:17:38.396727 11829 acceptor_pool.cc:254] collecting diagnostics on the listening RPC socket unix:/tmp/dist-test-taskqAkd5e/test-tmp/rpc-test-c6bedde80705443098c16adcf9e66801.sock every 8 connection(s)
I20260928 06:17:38.417376 11839 acceptor_pool.cc:254] collecting diagnostics on the listening RPC socket unix:/tmp/dist-test-taskqAkd5e/test-tmp/rpc-test-c6bedde80705443098c16adcf9e66801.sock every 8 connection(s)
I20260928 06:17:38.418118 11840 acceptor_pool.cc:254] collecting diagnostics on the listening RPC socket unix:/tmp/dist-test-taskqAkd5e/test-tmp/rpc-test-c6bedde80705443098c16adcf9e66801.sock every 8 connection(s)
I20260928 06:17:38.456801 11850 acceptor_pool.cc:254] collecting diagnostics on the listening RPC socket unix:/tmp/dist-test-taskqAkd5e/test-tmp/rpc-test-c6bedde80705443098c16adcf9e66801.sock every 8 connection(s)
I20260928 06:17:38.457433 11851 acceptor_pool.cc:254] collecting diagnostics on the listening RPC socket unix:/tmp/dist-test-taskqAkd5e/test-tmp/rpc-test-c6bedde80705443098c16adcf9e66801.sock every 8 connection(s)
[ OK ] Parameters/TestRpc.TestAcceptorPoolStartStop/SSL_UnixSocket (153 ms)
[ RUN ] Parameters/TestRpc.TestCall/SSL_UnixSocket
I20260928 06:17:38.496642 11863 acceptor_pool.cc:254] collecting diagnostics on the listening RPC socket unix:/tmp/dist-test-taskqAkd5e/test-tmp/rpc-test-e4497cb029284609a2daf3f1f89db377.sock every 8 connection(s)
I20260928 06:17:38.498718 11864 acceptor_pool.cc:254] collecting diagnostics on the listening RPC socket unix:/tmp/dist-test-taskqAkd5e/test-tmp/rpc-test-e4497cb029284609a2daf3f1f89db377.sock every 8 connection(s)
I20260928 06:17:38.504241 11780 rpc-test.cc:234] Connecting to unix:/tmp/dist-test-taskqAkd5e/test-tmp/rpc-test-e4497cb029284609a2daf3f1f89db377.sock
W20260928 06:17:38.548764 11860 connection.cc:196] Error closing socket: Network error: TlsSocket::Close: Broken pipe
[ OK ] Parameters/TestRpc.TestCall/SSL_UnixSocket (91 ms)
[ RUN ] Parameters/TestRpc.TestCallWithChainCertAndRootCA/SSL_UnixSocket
I20260928 06:17:38.592185 11888 acceptor_pool.cc:254] collecting diagnostics on the listening RPC socket unix:/tmp/dist-test-taskqAkd5e/test-tmp/rpc-test-769dc722442b415094bdd7bad36a1fc3.sock every 8 connection(s)
I20260928 06:17:38.592901 11889 acceptor_pool.cc:254] collecting diagnostics on the listening RPC socket unix:/tmp/dist-test-taskqAkd5e/test-tmp/rpc-test-769dc722442b415094bdd7bad36a1fc3.sock every 8 connection(s)
/data0/somelongdirectorytoavoidrpathissues/src/kudu/src/kudu/rpc/rpc-test.cc:303: Failure
Failed
Bad status: Runtime error: could not verify certificate chain (error with cert: subject=CN = localhost, ST = sadfjas, C = AS, emailAddress = sdflkdsajf, O = lskdfjlsad, OU = sldfkja, issuer=C = AS, ST = ASDfkjdhf, L = lskdjf, O = saldfja, OU = skdjf, CN = localhost, emailAddress = sadjflkadsj): : certificate has expired
Google Test trace:
/data0/somelongdirectorytoavoidrpathissues/src/kudu/src/kudu/rpc/rpc-test.cc:300: Connecting to unix:/tmp/dist-test-taskqAkd5e/test-tmp/rpc-test-769dc722442b415094bdd7bad36a1fc3.sock
I20260928 06:17:38.612526 11780 test_util.cc:175] -----------------------------------------------
I20260928 06:17:38.612711 11780 test_util.cc:176] Had fatal failures, leaving test files at /tmp/dist-test-taskqAkd5e/test-tmp/rpc-test.2.Parameters_TestRpc.TestCallWithChainCertAndRootCA_SSL_UnixSocket.1790576254972844-11780-0
[ FAILED ] Parameters/TestRpc.TestCallWithChainCertAndRootCA/SSL_UnixSocket, where GetParam() = (true, true) (59 ms)
[ RUN ] Parameters/TestRpc.TestCallWithBadPasswordProtectedKey/SSL_UnixSocket
[ OK ] Parameters/TestRpc.TestCallWithBadPasswordProtectedKey/SSL_UnixSocket (31 ms)
[ RUN ] Parameters/TestRpc.TestInvalidMethodCall/SSL_UnixSocket
I20260928 06:17:38.680145 11925 acceptor_pool.cc:254] collecting diagnostics on the listening RPC socket unix:/tmp/dist-test-taskqAkd5e/test-tmp/rpc-test-5db9b7c2609148e5b7452bf56c9ed71a.sock every 8 connection(s)
I20260928 06:17:38.680995 11926 acceptor_pool.cc:254] collecting diagnostics on the listening RPC socket unix:/tmp/dist-test-taskqAkd5e/test-tmp/rpc-test-5db9b7c2609148e5b7452bf56c9ed71a.sock every 8 connection(s)
I20260928 06:17:38.684365 11780 rpc-test.cc:406] Connecting to unix:/tmp/dist-test-taskqAkd5e/test-tmp/rpc-test-5db9b7c2609148e5b7452bf56c9ed71a.sock
W20260928 06:17:38.711769 11922 connection.cc:196] Error closing socket: Network error: TlsSocket::Close: Broken pipe
[ OK ] Parameters/TestRpc.TestInvalidMethodCall/SSL_UnixSocket (76 ms)
[ RUN ] Parameters/TestRpc.TestHighFDs/SSL_UnixSocket
I20260928 06:17:38.950551 11950 acceptor_pool.cc:254] collecting diagnostics on the listening RPC socket unix:/tmp/dist-test-taskqAkd5e/test-tmp/rpc-test-6dabed8fa56547f4badcc8063129aa7b.sock every 8 connection(s)
I20260928 06:17:38.951215 11951 acceptor_pool.cc:254] collecting diagnostics on the listening RPC socket unix:/tmp/dist-test-taskqAkd5e/test-tmp/rpc-test-6dabed8fa56547f4badcc8063129aa7b.sock every 8 connection(s)
[ OK ] Parameters/TestRpc.TestHighFDs/SSL_UnixSocket (282 ms)
[ RUN ] Parameters/TestRpc.TestConnectionAlwaysKeepalive/SSL_UnixSocket
I20260928 06:17:39.027686 11973 acceptor_pool.cc:254] collecting diagnostics on the listening RPC socket unix:/tmp/dist-test-taskqAkd5e/test-tmp/rpc-test-6027f623c21e474d8b395c4b1cc0f88d.sock every 8 connection(s)
I20260928 06:17:39.028412 11974 acceptor_pool.cc:254] collecting diagnostics on the listening RPC socket unix:/tmp/dist-test-taskqAkd5e/test-tmp/rpc-test-6027f623c21e474d8b395c4b1cc0f88d.sock every 8 connection(s)
I20260928 06:17:39.031550 11780 rpc-test.cc:532] Connecting to unix:/tmp/dist-test-taskqAkd5e/test-tmp/rpc-test-6027f623c21e474d8b395c4b1cc0f88d.sock
W20260928 06:17:42.070148 11972 connection.cc:196] Error closing socket: Network error: TlsSocket::Close: Broken pipe
[ OK ] Parameters/TestRpc.TestConnectionAlwaysKeepalive/SSL_UnixSocket (3071 ms)
[ RUN ] Parameters/TestRpc.TestReopenOutboundConnections/SSL_UnixSocket
I20260928 06:17:42.101140 11996 acceptor_pool.cc:254] collecting diagnostics on the listening RPC socket unix:/tmp/dist-test-taskqAkd5e/test-tmp/rpc-test-19ec05175cec4624bef8416783dc6645.sock every 8 connection(s)
I20260928 06:17:42.101969 11997 acceptor_pool.cc:254] collecting diagnostics on the listening RPC socket unix:/tmp/dist-test-taskqAkd5e/test-tmp/rpc-test-19ec05175cec4624bef8416783dc6645.sock every 8 connection(s)
I20260928 06:17:42.105263 11780 rpc-test.cc:658] Connecting to unix:/tmp/dist-test-taskqAkd5e/test-tmp/rpc-test-19ec05175cec4624bef8416783dc6645.sock
W20260928 06:17:42.135833 11995 connection.cc:196] Error closing socket: Network error: TlsSocket::Close: Broken pipe
W20260928 06:17:42.145128 11995 connection.cc:196] Error closing socket: Network error: TlsSocket::Close: Broken pipe
W20260928 06:17:42.155205 11995 connection.cc:196] Error closing socket: Network error: TlsSocket::Close: Broken pipe
W20260928 06:17:42.164716 11995 connection.cc:196] Error closing socket: Network error: TlsSocket::Close: Broken pipe
W20260928 06:17:42.174516 11995 connection.cc:196] Error closing socket: Network error: TlsSocket::Close: Broken pipe
W20260928 06:17:42.184199 11995 connection.cc:196] Error closing socket: Network error: TlsSocket::Close: Broken pipe
W20260928 06:17:42.195326 11995 connection.cc:196] Error closing socket: Network error: TlsSocket::Close: Broken pipe
W20260928 06:17:42.204746 11995 connection.cc:196] Error closing socket: Network error: TlsSocket::Close: Broken pipe
W20260928 06:17:42.215122 11995 connection.cc:196] Error closing socket: Network error: TlsSocket::Close: Broken pipe
W20260928 06:17:42.225299 11995 connection.cc:196] Error closing socket: Network error: TlsSocket::Close: Broken pipe
W20260928 06:17:42.235795 11995 connection.cc:196] Error closing socket: Network error: TlsSocket::Close: Broken pipe
W20260928 06:17:42.246093 11995 connection.cc:196] Error closing socket: Network error: TlsSocket::Close: Broken pipe
W20260928 06:17:42.256068 11995 connection.cc:196] Error closing socket: Network error: TlsSocket::Close: Broken pipe
W20260928 06:17:42.266396 11995 connection.cc:196] Error closing socket: Network error: TlsSocket::Close: Broken pipe
W20260928 06:17:42.266523 11996 acceptor_pool.cc:285] unable to collect diagnostics on RPC socket unix:/tmp/dist-test-taskqAkd5e/test-tmp/rpc-test-19ec05175cec4624bef8416783dc6645.sock: Not implemented: netlink diagnostics is currently supported only on IPv4 TCP sockets
W20260928 06:17:42.275889 11995 connection.cc:196] Error closing socket: Network error: TlsSocket::Close: Broken pipe
W20260928 06:17:42.286481 11995 connection.cc:196] Error closing socket: Network error: TlsSocket::Close: Broken pipe
W20260928 06:17:42.296689 11995 connection.cc:196] Error closing socket: Network error: TlsSocket::Close: Broken pipe
W20260928 06:17:42.306720 11995 connection.cc:196] Error closing socket: Network error: TlsSocket::Close: Broken pipe
W20260928 06:17:42.317212 11995 connection.cc:196] Error closing socket: Network error: TlsSocket::Close: Broken pipe
W20260928 06:17:42.328234 11995 connection.cc:196] Error closing socket: Network error: TlsSocket::Close: Broken pipe
W20260928 06:17:42.339102 11995 connection.cc:196] Error closing socket: Network error: TlsSocket::Close: Broken pipe
W20260928 06:17:42.350317 11995 connection.cc:196] Error closing socket: Network error: TlsSocket::Close: Broken pipe
W20260928 06:17:42.361112 11995 connection.cc:196] Error closing socket: Network error: TlsSocket::Close: Broken pipe
W20260928 06:17:42.372321 11995 connection.cc:196] Error closing socket: Network error: TlsSocket::Close: Broken pipe
W20260928 06:17:42.384079 11995 connection.cc:196] Error closing socket: Network error: TlsSocket::Close: Broken pipe
W20260928 06:17:42.395079 11995 connection.cc:196] Error closing socket: Network error: TlsSocket::Close: Broken pipe
W20260928 06:17:42.405122 11995 connection.cc:196] Error closing socket: Network error: TlsSocket::Close: Broken pipe
W20260928 06:17:42.414373 11995 connection.cc:196] Error closing socket: Network error: TlsSocket::Close: Broken pipe
W20260928 06:17:42.424037 11995 connection.cc:196] Error closing socket: Network error: TlsSocket::Close: Broken pipe
W20260928 06:17:42.434096 11995 connection.cc:196] Error closing socket: Network error: TlsSocket::Close: Broken pipe
W20260928 06:17:42.443876 11995 connection.cc:196] Error closing socket: Network error: TlsSocket::Close: Broken pipe
W20260928 06:17:42.454672 11995 connection.cc:196] Error closing socket: Network error: TlsSocket::Close: Broken pipe
[ OK ] Parameters/TestRpc.TestReopenOutboundConnections/SSL_UnixSocket (383 ms)
[ RUN ] Parameters/TestRpc.TestConnectionNetworkPlane/SSL_UnixSocket
I20260928 06:17:42.476128 12019 acceptor_pool.cc:254] collecting diagnostics on the listening RPC socket unix:/tmp/dist-test-taskqAkd5e/test-tmp/rpc-test-e7f66b8a18234e94b4ed2e3fd975b886.sock every 8 connection(s)
I20260928 06:17:42.476835 12020 acceptor_pool.cc:254] collecting diagnostics on the listening RPC socket unix:/tmp/dist-test-taskqAkd5e/test-tmp/rpc-test-e7f66b8a18234e94b4ed2e3fd975b886.sock every 8 connection(s)
I20260928 06:17:42.480049 11780 rpc-test.cc:772] Connecting to unix:/tmp/dist-test-taskqAkd5e/test-tmp/rpc-test-e7f66b8a18234e94b4ed2e3fd975b886.sock
W20260928 06:17:42.515590 12018 connection.cc:196] Error closing socket: Network error: TlsSocket::Close: Broken pipe
[ OK ] Parameters/TestRpc.TestConnectionNetworkPlane/SSL_UnixSocket (61 ms)
[ RUN ] Parameters/TestRpc.TestTCPKeepalive/SSL_UnixSocket
I20260928 06:17:42.557046 12044 acceptor_pool.cc:254] collecting diagnostics on the listening RPC socket unix:/tmp/dist-test-taskqAkd5e/test-tmp/rpc-test-285704a8049242babbdca3c571bb8776.sock every 8 connection(s)
I20260928 06:17:42.557832 12045 acceptor_pool.cc:254] collecting diagnostics on the listening RPC socket unix:/tmp/dist-test-taskqAkd5e/test-tmp/rpc-test-285704a8049242babbdca3c571bb8776.sock every 8 connection(s)
I20260928 06:17:42.584946 12048 rpc-test-base.h:222] got call: sleep_micros: 8000000 deferred: true
I20260928 06:17:50.588967 12048 rpcz_store.cc:275] Call kudu.rpc.GenericCalculatorService.Sleep from unix:<unnamed> (request call id 0) took 8004 ms. Trace:
I20260928 06:17:50.589397 12048 rpcz_store.cc:276] 0928 06:17:42.584765 (+ 0us) service_pool.cc:170] Inserting onto call queue
0928 06:17:42.584884 (+ 119us) service_pool.cc:227] Handling call
0928 06:17:50.588803 (+8003919us) inbound_call.cc:173] Queueing success response
Metrics: {}
W20260928 06:17:50.594883 12041 connection.cc:196] Error closing socket: Network error: TlsSocket::Close: Broken pipe
[ OK ] Parameters/TestRpc.TestTCPKeepalive/SSL_UnixSocket (8081 ms)
[ RUN ] Parameters/TestRpc.TestMaxSmallSidecars/SSL_UnixSocket
I20260928 06:17:50.629694 12070 acceptor_pool.cc:254] collecting diagnostics on the listening RPC socket unix:/tmp/dist-test-taskqAkd5e/test-tmp/rpc-test-66518376f5494d2da2de79f9ea9ab9b1.sock every 8 connection(s)
I20260928 06:17:50.630584 12071 acceptor_pool.cc:254] collecting diagnostics on the listening RPC socket unix:/tmp/dist-test-taskqAkd5e/test-tmp/rpc-test-66518376f5494d2da2de79f9ea9ab9b1.sock every 8 connection(s)
W20260928 06:17:50.791417 12067 connection.cc:196] Error closing socket: Network error: TlsSocket::Close: Broken pipe
[ OK ] Parameters/TestRpc.TestMaxSmallSidecars/SSL_UnixSocket (193 ms)
[ RUN ] Parameters/TestRpc.TestCallTimeout/SSL_UnixSocket
I20260928 06:17:50.824703 12095 acceptor_pool.cc:254] collecting diagnostics on the listening RPC socket unix:/tmp/dist-test-taskqAkd5e/test-tmp/rpc-test-10a06be04916497f944408739effd3a7.sock every 8 connection(s)
I20260928 06:17:50.825429 12096 acceptor_pool.cc:254] collecting diagnostics on the listening RPC socket unix:/tmp/dist-test-taskqAkd5e/test-tmp/rpc-test-10a06be04916497f944408739effd3a7.sock every 8 connection(s)
I20260928 06:17:50.845634 11780 rpc-test-base.h:595] status: Timed out: connection negotiation to unix:/tmp/dist-test-taskqAkd5e/test-tmp/rpc-test-10a06be04916497f944408739effd3a7.sock for RPC Sleep timed out after 0.000s (ON_OUTBOUND_QUEUE), seconds elapsed: 0.00231023
I20260928 06:17:50.853816 12099 rpc-test-base.h:222] got call: sleep_micros: 700000
I20260928 06:17:51.047401 11780 rpc-test-base.h:595] status: Timed out: Sleep RPC to unix:/tmp/dist-test-taskqAkd5e/test-tmp/rpc-test-10a06be04916497f944408739effd3a7.sock timed out after 0.200s (SENT), seconds elapsed: 0.201441
I20260928 06:17:51.048854 12098 rpc-test-base.h:222] got call: sleep_micros: 2000000
W20260928 06:17:51.554462 12099 rpcz_store.cc:267] Call kudu.rpc.GenericCalculatorService.Sleep from unix:<unnamed> (request call id 1) took 700 ms (client timeout 200 ms). Trace:
W20260928 06:17:51.554786 12099 rpcz_store.cc:269] 0928 06:17:50.853647 (+ 0us) service_pool.cc:170] Inserting onto call queue
0928 06:17:50.853763 (+ 116us) service_pool.cc:227] Handling call
0928 06:17:51.554404 (+700641us) inbound_call.cc:173] Queueing success response
Metrics: {}
I20260928 06:17:52.550067 11780 rpc-test-base.h:595] status: Timed out: Sleep RPC to unix:/tmp/dist-test-taskqAkd5e/test-tmp/rpc-test-10a06be04916497f944408739effd3a7.sock timed out after 1.500s (SENT), seconds elapsed: 1.50228
W20260928 06:17:53.049326 12098 rpcz_store.cc:267] Call kudu.rpc.GenericCalculatorService.Sleep from unix:<unnamed> (request call id 2) took 2000 ms (client timeout 1500 ms). Trace:
W20260928 06:17:53.049640 12098 rpcz_store.cc:269] 0928 06:17:51.048661 (+ 0us) service_pool.cc:170] Inserting onto call queue
0928 06:17:51.048787 (+ 126us) service_pool.cc:227] Handling call
0928 06:17:53.049269 (+2000482us) inbound_call.cc:173] Queueing success response
Metrics: {}
W20260928 06:17:53.050195 12092 connection.cc:441] server connection from unix:<unnamed> torn down before Call kudu.rpc.GenericCalculatorService.Sleep from unix:<unnamed> (request call id 2) could send its response
[ OK ] Parameters/TestRpc.TestCallTimeout/SSL_UnixSocket (2258 ms)
[ RUN ] Parameters/TestRpc.TestServerShutsDown/SSL_UnixSocket
I20260928 06:17:53.057001 11780 rpc-test.cc:1125] Connecting to 0.0.0.0:43003
W20260928 06:17:53.067034 12112 negotiation.cc:337] Failed RPC negotiation. Trace:
0928 06:17:53.065603 (+ 0us) reactor.cc:625] Submitting negotiation task for client connection to 0.0.0.0:43003 (local address 127.0.0.1:59036)
0928 06:17:53.066063 (+ 460us) negotiation.cc:107] Waiting for socket to connect
0928 06:17:53.066098 (+ 35us) client_negotiation.cc:174] Beginning negotiation
0928 06:17:53.066320 (+ 222us) client_negotiation.cc:252] Sending NEGOTIATE NegotiatePB request
0928 06:17:53.066526 (+ 206us) negotiation.cc:327] Negotiation complete: Network error: Client connection negotiation failed: client connection to 0.0.0.0:43003: BlockingWrite error: write error: Broken pipe (error 32)
Metrics: {"client-negotiator.queue_time_us":125}
[ OK ] Parameters/TestRpc.TestServerShutsDown/SSL_UnixSocket (14 ms)
[ RUN ] Parameters/TestRpc.TimedOutOnResponseMetric/SSL_UnixSocket
I20260928 06:17:53.086556 12129 acceptor_pool.cc:254] collecting diagnostics on the listening RPC socket unix:/tmp/dist-test-taskqAkd5e/test-tmp/rpc-test-1abe3089511641a898c9d790baa00c4e.sock every 8 connection(s)
I20260928 06:17:53.087252 12130 acceptor_pool.cc:254] collecting diagnostics on the listening RPC socket unix:/tmp/dist-test-taskqAkd5e/test-tmp/rpc-test-1abe3089511641a898c9d790baa00c4e.sock every 8 connection(s)
W20260928 06:17:53.323906 12133 rpcz_store.cc:267] Call kudu.rpc_test.CalculatorService.Sleep from unix:<unnamed> (request call id 3) took 50 ms (client timeout 25 ms). Trace:
W20260928 06:17:53.324229 12133 rpcz_store.cc:269] 0928 06:17:53.273245 (+ 0us) service_pool.cc:170] Inserting onto call queue
0928 06:17:53.273385 (+ 140us) service_pool.cc:227] Handling call
0928 06:17:53.323811 (+ 50426us) inbound_call.cc:173] Queueing success response
Related trace 'test_child':
Metrics: {"test_sleep_us":50000,"child_traces":[["test_child",{"related_trace_metric":1}]]}
W20260928 06:17:53.383680 12133 rpcz_store.cc:267] Call kudu.rpc_test.CalculatorService.Sleep from unix:<unnamed> (request call id 4) took 50 ms (client timeout 50 ms). Trace:
W20260928 06:17:53.384052 12133 rpcz_store.cc:269] 0928 06:17:53.333059 (+ 0us) service_pool.cc:170] Inserting onto call queue
0928 06:17:53.333249 (+ 190us) service_pool.cc:227] Handling call
0928 06:17:53.383619 (+ 50370us) inbound_call.cc:173] Queueing success response
Related trace 'test_child':
Metrics: {"test_sleep_us":50000,"child_traces":[["test_child",{"related_trace_metric":1}]]}
[ OK ] Parameters/TestRpc.TimedOutOnResponseMetric/SSL_UnixSocket (322 ms)
[ RUN ] Parameters/TestRpc.AcceptorDispatchingTimesMetric/SSL_UnixSocket
I20260928 06:17:53.405212 12154 acceptor_pool.cc:254] collecting diagnostics on the listening RPC socket 0.0.0.0:34859 every 8 connection(s)
I20260928 06:17:53.406018 12155 acceptor_pool.cc:254] collecting diagnostics on the listening RPC socket 0.0.0.0:34859 every 8 connection(s)
W20260928 06:17:53.412403 12150 negotiation.cc:337] Failed RPC negotiation. Trace:
0928 06:17:53.410057 (+ 0us) reactor.cc:625] Submitting negotiation task for server connection from 127.0.0.1:39490 (local address 127.0.0.1:34859)
0928 06:17:53.410719 (+ 662us) server_negotiation.cc:206] Beginning negotiation
0928 06:17:53.410750 (+ 31us) server_negotiation.cc:399] Waiting for connection header
0928 06:17:53.411279 (+ 529us) negotiation.cc:327] Negotiation complete: Network error: Server connection negotiation failed: server connection from 127.0.0.1:39490: BlockingRecv error: recv got EOF from 127.0.0.1:39490 (error 108)
Metrics: {"server-negotiator.queue_time_us":176}
[ OK ] Parameters/TestRpc.AcceptorDispatchingTimesMetric/SSL_UnixSocket (22 ms)
[ RUN ] Parameters/TestRpc.TestRpcCallbackDestroysMessenger/SSL_UnixSocket
[ OK ] Parameters/TestRpc.TestRpcCallbackDestroysMessenger/SSL_UnixSocket (29 ms)
[ RUN ] Parameters/TestRpc.TestApplicationFeatureFlag/SSL_UnixSocket
I20260928 06:17:53.470386 12179 acceptor_pool.cc:254] collecting diagnostics on the listening RPC socket unix:/tmp/dist-test-taskqAkd5e/test-tmp/rpc-test-dbd7f0b07c654ed7bd6df63e0bdbe106.sock every 8 connection(s)
I20260928 06:17:53.471128 12180 acceptor_pool.cc:254] collecting diagnostics on the listening RPC socket unix:/tmp/dist-test-taskqAkd5e/test-tmp/rpc-test-dbd7f0b07c654ed7bd6df63e0bdbe106.sock every 8 connection(s)
W20260928 06:17:53.504040 12176 messenger.cc:357] Unable to handle RPC call: Not implemented: call requires unsupported application feature flags: 99
W20260928 06:17:53.507064 12176 connection.cc:196] Error closing socket: Network error: TlsSocket::Close: Broken pipe
[ OK ] Parameters/TestRpc.TestApplicationFeatureFlag/SSL_UnixSocket (66 ms)
[ RUN ] Parameters/TestRpc.TestCancellation/SSL_UnixSocket
I20260928 06:17:53.533345 12204 acceptor_pool.cc:254] collecting diagnostics on the listening RPC socket unix:/tmp/dist-test-taskqAkd5e/test-tmp/rpc-test-2295bee925cf4595887ef208af8a1f90.sock every 8 connection(s)
I20260928 06:17:53.534106 12205 acceptor_pool.cc:254] collecting diagnostics on the listening RPC socket unix:/tmp/dist-test-taskqAkd5e/test-tmp/rpc-test-2295bee925cf4595887ef208af8a1f90.sock every 8 connection(s)
I20260928 06:17:53.537308 11780 rpc-test.cc:1648] Connecting to unix:/tmp/dist-test-taskqAkd5e/test-tmp/rpc-test-2295bee925cf4595887ef208af8a1f90.sock
I20260928 06:17:53.645843 11780 rpc-test-base.h:595] status: Aborted: Sleep RPC to unix:/tmp/dist-test-taskqAkd5e/test-tmp/rpc-test-2295bee925cf4595887ef208af8a1f90.sock is cancelled in state READY, seconds elapsed: 0.000408662
I20260928 06:17:53.843802 11780 rpc-test-base.h:595] status: Aborted: Sleep RPC to unix:/tmp/dist-test-taskqAkd5e/test-tmp/rpc-test-2295bee925cf4595887ef208af8a1f90.sock is cancelled in state SENT, seconds elapsed: 0.000904425
I20260928 06:17:53.844069 12207 rpc-test-base.h:222] got call: sleep_micros: 510000
I20260928 06:17:54.020663 11780 rpc-test-base.h:595] status: Aborted: Sleep RPC to unix:/tmp/dist-test-taskqAkd5e/test-tmp/rpc-test-2295bee925cf4595887ef208af8a1f90.sock is cancelled in state SENT, seconds elapsed: 0.000968521
I20260928 06:17:54.020915 12206 rpc-test-base.h:222] got call: sleep_micros: 510000
I20260928 06:17:54.199072 11780 rpc-test-base.h:595] status: Aborted: Sleep RPC to unix:/tmp/dist-test-taskqAkd5e/test-tmp/rpc-test-2295bee925cf4595887ef208af8a1f90.sock is cancelled in state SENT, seconds elapsed: 0.000763888
W20260928 06:17:54.210153 12208 rpcz_store.cc:267] Call kudu.rpc.GenericCalculatorService.Sleep from unix:<unnamed> (request call id 11) took 10 ms (client timeout 10 ms). Trace:
W20260928 06:17:54.210443 12208 rpcz_store.cc:269] 0928 06:17:54.199203 (+ 0us) service_pool.cc:170] Inserting onto call queue
0928 06:17:54.209847 (+ 10644us) service_pool.cc:214] Skipping call since client already timed out
0928 06:17:54.209957 (+ 110us) inbound_call.cc:173] Queueing failure response
Metrics: {}
I20260928 06:17:54.211083 12208 rpc-test-base.h:222] got call: sleep_micros: 1500000
W20260928 06:17:54.354696 12207 rpcz_store.cc:267] Call kudu.rpc.GenericCalculatorService.Sleep from unix:<unnamed> (request call id 3) took 510 ms (client timeout 10 ms). Trace:
W20260928 06:17:54.355016 12207 rpcz_store.cc:269] 0928 06:17:53.843865 (+ 0us) service_pool.cc:170] Inserting onto call queue
0928 06:17:53.844005 (+ 140us) service_pool.cc:227] Handling call
0928 06:17:54.354642 (+510637us) inbound_call.cc:173] Queueing success response
Metrics: {}
W20260928 06:17:54.531644 12206 rpcz_store.cc:267] Call kudu.rpc.GenericCalculatorService.Sleep from unix:<unnamed> (request call id 7) took 511 ms (client timeout 10 ms). Trace:
W20260928 06:17:54.531985 12206 rpcz_store.cc:269] 0928 06:17:54.020695 (+ 0us) service_pool.cc:170] Inserting onto call queue
0928 06:17:54.020851 (+ 156us) service_pool.cc:227] Handling call
0928 06:17:54.531588 (+510737us) inbound_call.cc:173] Queueing success response
Metrics: {}
I20260928 06:17:55.200999 11780 rpc-test-base.h:595] status: Timed out: Sleep RPC to unix:/tmp/dist-test-taskqAkd5e/test-tmp/rpc-test-2295bee925cf4595887ef208af8a1f90.sock timed out after 1.000s (SENT), seconds elapsed: 1.00145
I20260928 06:17:55.203213 12206 rpc-test-base.h:222] got call: sleep_micros: 1500000
W20260928 06:17:55.711759 12208 rpcz_store.cc:267] Call kudu.rpc.GenericCalculatorService.Sleep from unix:<unnamed> (request call id 12) took 1511 ms (client timeout 1000 ms). Trace:
W20260928 06:17:55.712114 12208 rpcz_store.cc:269] 0928 06:17:54.200173 (+ 0us) service_pool.cc:170] Inserting onto call queue
0928 06:17:54.211031 (+ 10858us) service_pool.cc:227] Handling call
0928 06:17:55.711617 (+1500586us) inbound_call.cc:173] Queueing success response
Metrics: {}
I20260928 06:17:56.203748 11780 rpc-test-base.h:595] status: Timed out: Sleep RPC to unix:/tmp/dist-test-taskqAkd5e/test-tmp/rpc-test-2295bee925cf4595887ef208af8a1f90.sock timed out after 1.000s (SENT), seconds elapsed: 1.00216
W20260928 06:17:56.205585 12201 messenger.cc:357] Unable to handle RPC call: Not implemented: call requires unsupported application feature flags: 99, 1
W20260928 06:17:56.207407 12201 messenger.cc:357] Unable to handle RPC call: Not implemented: call requires unsupported application feature flags: 99, 1
W20260928 06:17:56.703868 12206 rpcz_store.cc:267] Call kudu.rpc.GenericCalculatorService.Sleep from unix:<unnamed> (request call id 13) took 1501 ms (client timeout 1000 ms). Trace:
W20260928 06:17:56.704216 12206 rpcz_store.cc:269] 0928 06:17:55.202885 (+ 0us) service_pool.cc:170] Inserting onto call queue
0928 06:17:55.203096 (+ 211us) service_pool.cc:227] Handling call
0928 06:17:56.703815 (+1500719us) inbound_call.cc:173] Queueing success response
Metrics: {}
W20260928 06:17:56.704885 12201 connection.cc:441] server connection from unix:<unnamed> torn down before Call kudu.rpc.GenericCalculatorService.Sleep from unix:<unnamed> (request call id 13) could send its response
[ OK ] Parameters/TestRpc.TestCancellation/SSL_UnixSocket (3201 ms)
[ RUN ] Parameters/TestRpc.TestCancellationMultiThreads/SSL_UnixSocket
I20260928 06:17:56.748693 12230 acceptor_pool.cc:254] collecting diagnostics on the listening RPC socket unix:/tmp/dist-test-taskqAkd5e/test-tmp/rpc-test-501bcb4c8d0d4902ab941e5e8923136d.sock every 8 connection(s)
I20260928 06:17:56.749571 12231 acceptor_pool.cc:254] collecting diagnostics on the listening RPC socket unix:/tmp/dist-test-taskqAkd5e/test-tmp/rpc-test-501bcb4c8d0d4902ab941e5e8923136d.sock every 8 connection(s)
I20260928 06:17:56.752674 11780 rpc-test.cc:1808] Connecting to unix:/tmp/dist-test-taskqAkd5e/test-tmp/rpc-test-501bcb4c8d0d4902ab941e5e8923136d.sock
I20260928 06:17:56.917971 12244 test_util.cc:268] Using random seed: 116248158
I20260928 06:17:56.919111 12245 test_util.cc:268] Using random seed: 116249392
I20260928 06:17:56.920717 12246 test_util.cc:268] Using random seed: 116250888
I20260928 06:17:56.922175 12247 test_util.cc:268] Using random seed: 116252433
I20260928 06:17:56.923835 12248 test_util.cc:268] Using random seed: 116253976
I20260928 06:17:56.925765 12249 test_util.cc:268] Using random seed: 116255869
I20260928 06:17:56.927421 12250 test_util.cc:268] Using random seed: 116257469
I20260928 06:17:56.929312 12251 test_util.cc:268] Using random seed: 116259425
I20260928 06:17:56.930785 12252 test_util.cc:268] Using random seed: 116260932
I20260928 06:17:56.933127 12253 test_util.cc:268] Using random seed: 116263279
I20260928 06:17:56.934751 12254 test_util.cc:268] Using random seed: 116264888
I20260928 06:17:56.936160 12255 test_util.cc:268] Using random seed: 116266313
I20260928 06:17:56.937889 12256 test_util.cc:268] Using random seed: 116268018
I20260928 06:17:56.939617 12257 test_util.cc:268] Using random seed: 116269685
I20260928 06:17:56.942863 12258 test_util.cc:268] Using random seed: 116272996
I20260928 06:17:56.944332 12259 test_util.cc:268] Using random seed: 116274498
I20260928 06:17:56.945792 12260 test_util.cc:268] Using random seed: 116275974
I20260928 06:17:56.947542 12261 test_util.cc:268] Using random seed: 116277653
I20260928 06:17:56.948961 12262 test_util.cc:268] Using random seed: 116279083
I20260928 06:17:56.950558 12263 test_util.cc:268] Using random seed: 116280710
I20260928 06:17:56.952360 12264 test_util.cc:268] Using random seed: 116282469
I20260928 06:17:56.954136 12265 test_util.cc:268] Using random seed: 116284280
I20260928 06:17:56.956192 12266 test_util.cc:268] Using random seed: 116286232
I20260928 06:17:56.957926 12267 test_util.cc:268] Using random seed: 116287980
I20260928 06:17:56.960280 12268 test_util.cc:268] Using random seed: 116290392
I20260928 06:17:56.972471 12269 test_util.cc:268] Using random seed: 116302577
I20260928 06:17:56.974056 12270 test_util.cc:268] Using random seed: 116304182
I20260928 06:17:56.976263 12271 test_util.cc:268] Using random seed: 116306370
I20260928 06:17:56.978384 12272 test_util.cc:268] Using random seed: 116308481
I20260928 06:17:56.980258 12273 test_util.cc:268] Using random seed: 116310390
W20260928 06:18:16.556435 12227 connection.cc:196] Error closing socket: Network error: TlsSocket::Close: Broken pipe
[ OK ] Parameters/TestRpc.TestCancellationMultiThreads/SSL_UnixSocket (19861 ms)
[ RUN ] Parameters/TestRpc.TestCallId/SSL_UnixSocket
I20260928 06:18:16.599575 12287 acceptor_pool.cc:254] collecting diagnostics on the listening RPC socket unix:/tmp/dist-test-taskqAkd5e/test-tmp/rpc-test-74247bd2d691420e9d68f90e899161dd.sock every 8 connection(s)
I20260928 06:18:16.600389 12288 acceptor_pool.cc:254] collecting diagnostics on the listening RPC socket unix:/tmp/dist-test-taskqAkd5e/test-tmp/rpc-test-74247bd2d691420e9d68f90e899161dd.sock every 8 connection(s)
W20260928 06:18:16.676657 12284 connection.cc:196] Error closing socket: Network error: TlsSocket::Close: Broken pipe
[ OK ] Parameters/TestRpc.TestCallId/SSL_UnixSocket (107 ms)
[----------] 20 tests from Parameters/TestRpc (38374 ms total)
[----------] Global test environment tear-down
[==========] 21 tests from 2 test suites ran. (41659 ms total)
[ PASSED ] 20 tests.
[ FAILED ] 1 test, listed below:
[ FAILED ] Parameters/TestRpc.TestCallWithChainCertAndRootCA/SSL_UnixSocket, where GetParam() = (true, true)
1 FAILED TEST
I20260928 06:18:16.700217 11780 logging.cc:424] LogThrottler /data0/somelongdirectorytoavoidrpathissues/src/kudu/src/kudu/rpc/acceptor_pool.cc:285: suppressed but not reported on 3 messages since previous log ~34 seconds ago