Diagnosed failure

Parameters/TestRpc.TestCallWithChainCertAndChainCA/SSL_TCP: /data0/somelongdirectorytoavoidrpathissues/src/kudu/src/kudu/rpc/rpc-test.cc:270: Failure
Failed
Bad status: Runtime error: could not verify certificate chain (error with cert: subject=CN = localhost, ST = sadfjas, C = AS, emailAddress = sdflkdsajf, O = lskdfjlsad, OU = sldfkja, issuer=C = AS, ST = ASDfkjdhf, L = lskdjf, O = saldfja, OU = skdjf, CN = localhost, emailAddress = sadjflkadsj): : certificate has expired
Google Test trace:
/data0/somelongdirectorytoavoidrpathissues/src/kudu/src/kudu/rpc/rpc-test.cc:267: Connecting to 0.0.0.0:44649
I20260925 07:18:37.866056   772 test_util.cc:175] -----------------------------------------------
I20260925 07:18:37.866128   772 test_util.cc:176] Had fatal failures, leaving test files at /tmp/dist-test-taskM6gG4j/test-tmp/rpc-test.5.Parameters_TestRpc.TestCallWithChainCertAndChainCA_SSL_TCP.1790320717803602-772-0

Full log

Note: This is test shard 6 of 8.
[==========] Running 21 tests from 2 test suites.
[----------] Global test environment set-up.
[----------] 20 tests from Parameters/TestRpc
[ RUN      ] Parameters/TestRpc.TestMessengerCreateDestroy/SSL_TCP
WARNING: Logging before InitGoogleLogging() is written to STDERR
I20260925 07:18:37.828310   772 rpc-test.cc:169] started messenger TestCreateDestroy
[       OK ] Parameters/TestRpc.TestMessengerCreateDestroy/SSL_TCP (23 ms)
[ RUN      ] Parameters/TestRpc.TestNegotiationDeadlock/SSL_TCP
I20260925 07:18:37.836552   792 acceptor_pool.cc:254] collecting diagnostics on the listening RPC socket 0.0.0.0:38139 every 8 connection(s)
I20260925 07:18:37.836584   793 acceptor_pool.cc:254] collecting diagnostics on the listening RPC socket 0.0.0.0:38139 every 8 connection(s)
[       OK ] Parameters/TestRpc.TestNegotiationDeadlock/SSL_TCP (14 ms)
[ RUN      ] Parameters/TestRpc.TestCallWithChainCertAndChainCA/SSL_TCP
I20260925 07:18:37.861776   808 acceptor_pool.cc:254] collecting diagnostics on the listening RPC socket 0.0.0.0:44649 every 8 connection(s)
I20260925 07:18:37.861804   809 acceptor_pool.cc:254] collecting diagnostics on the listening RPC socket 0.0.0.0:44649 every 8 connection(s)
/data0/somelongdirectorytoavoidrpathissues/src/kudu/src/kudu/rpc/rpc-test.cc:270: Failure
Failed
Bad status: Runtime error: could not verify certificate chain (error with cert: subject=CN = localhost, ST = sadfjas, C = AS, emailAddress = sdflkdsajf, O = lskdfjlsad, OU = sldfkja, issuer=C = AS, ST = ASDfkjdhf, L = lskdjf, O = saldfja, OU = skdjf, CN = localhost, emailAddress = sadjflkadsj): : certificate has expired
Google Test trace:
/data0/somelongdirectorytoavoidrpathissues/src/kudu/src/kudu/rpc/rpc-test.cc:267: Connecting to 0.0.0.0:44649
I20260925 07:18:37.866056   772 test_util.cc:175] -----------------------------------------------
I20260925 07:18:37.866128   772 test_util.cc:176] Had fatal failures, leaving test files at /tmp/dist-test-taskM6gG4j/test-tmp/rpc-test.5.Parameters_TestRpc.TestCallWithChainCertAndChainCA_SSL_TCP.1790320717803602-772-0
[  FAILED  ] Parameters/TestRpc.TestCallWithChainCertAndChainCA/SSL_TCP, where GetParam() = (true, false) (22 ms)
[ RUN      ] Parameters/TestRpc.TestCallWithPasswordProtectedKey/SSL_TCP
I20260925 07:18:37.892936   834 acceptor_pool.cc:254] collecting diagnostics on the listening RPC socket 0.0.0.0:35005 every 8 connection(s)
I20260925 07:18:37.892936   833 acceptor_pool.cc:254] collecting diagnostics on the listening RPC socket 0.0.0.0:35005 every 8 connection(s)
[       OK ] Parameters/TestRpc.TestCallWithPasswordProtectedKey/SSL_TCP (40 ms)
[ RUN      ] Parameters/TestRpc.TestCallToBadServer/SSL_TCP
I20260925 07:18:37.921518   772 rpc-test.cc:394] Status: Network error: Client connection negotiation failed: client connection to 0.0.0.0:0: connect: Connection refused (error 111)
I20260925 07:18:37.921823   772 rpc-test.cc:394] Status: Network error: Client connection negotiation failed: client connection to 0.0.0.0:0: connect: Connection refused (error 111)
I20260925 07:18:37.922068   772 rpc-test.cc:394] Status: Network error: Client connection negotiation failed: client connection to 0.0.0.0:0: connect: Connection refused (error 111)
I20260925 07:18:37.922287   772 rpc-test.cc:394] Status: Network error: Client connection negotiation failed: client connection to 0.0.0.0:0: connect: Connection refused (error 111)
I20260925 07:18:37.922638   772 rpc-test.cc:394] Status: Network error: Client connection negotiation failed: client connection to 0.0.0.0:0: connect: Connection refused (error 111)
[       OK ] Parameters/TestRpc.TestCallToBadServer/SSL_TCP (16 ms)
[ RUN      ] Parameters/TestRpc.TestWrongService/SSL_TCP
I20260925 07:18:37.947599   868 acceptor_pool.cc:254] collecting diagnostics on the listening RPC socket 0.0.0.0:41843 every 8 connection(s)
I20260925 07:18:37.947613   869 acceptor_pool.cc:254] collecting diagnostics on the listening RPC socket 0.0.0.0:41843 every 8 connection(s)
I20260925 07:18:37.961688   865 messenger.cc:345] service WrongServiceName not registered on TestServer
[       OK ] Parameters/TestRpc.TestWrongService/SSL_TCP (39 ms)
[ RUN      ] Parameters/TestRpc.TestConnectionKeepalive/SSL_TCP
I20260925 07:18:37.969745   891 acceptor_pool.cc:254] collecting diagnostics on the listening RPC socket 0.0.0.0:33431 every 8 connection(s)
I20260925 07:18:37.969802   892 acceptor_pool.cc:254] collecting diagnostics on the listening RPC socket 0.0.0.0:33431 every 8 connection(s)
I20260925 07:18:37.969950   772 rpc-test.cc:488] Connecting to 0.0.0.0:33431
[       OK ] Parameters/TestRpc.TestConnectionKeepalive/SSL_TCP (1036 ms)
[ RUN      ] Parameters/TestRpc.TestClientConnectionMetrics/SSL_TCP
I20260925 07:18:39.010742   916 acceptor_pool.cc:254] collecting diagnostics on the listening RPC socket 0.0.0.0:42533 every 8 connection(s)
I20260925 07:18:39.010841   917 acceptor_pool.cc:254] collecting diagnostics on the listening RPC socket 0.0.0.0:42533 every 8 connection(s)
I20260925 07:18:39.010962   772 rpc-test.cc:569] Connecting to 0.0.0.0:42533
[       OK ] Parameters/TestRpc.TestClientConnectionMetrics/SSL_TCP (8565 ms)
[ RUN      ] Parameters/TestRpc.TestCredentialsPolicy/SSL_TCP
I20260925 07:18:47.580544   939 acceptor_pool.cc:254] collecting diagnostics on the listening RPC socket 0.0.0.0:37533 every 8 connection(s)
I20260925 07:18:47.580585   940 acceptor_pool.cc:254] collecting diagnostics on the listening RPC socket 0.0.0.0:37533 every 8 connection(s)
I20260925 07:18:47.580772   772 rpc-test.cc:700] Connecting to 0.0.0.0:37533
[       OK ] Parameters/TestRpc.TestCredentialsPolicy/SSL_TCP (41 ms)
[ RUN      ] Parameters/TestRpc.TestCallLongerThanKeepalive/SSL_TCP
I20260925 07:18:47.619045   964 acceptor_pool.cc:254] collecting diagnostics on the listening RPC socket 0.0.0.0:45467 every 8 connection(s)
I20260925 07:18:47.619086   965 acceptor_pool.cc:254] collecting diagnostics on the listening RPC socket 0.0.0.0:45467 every 8 connection(s)
I20260925 07:18:47.637959   968 rpc-test-base.h:222] got call: sleep_micros: 3000000 deferred: true
I20260925 07:18:50.638638   968 rpcz_store.cc:275] Call kudu.rpc.GenericCalculatorService.Sleep from 127.0.0.1:51902 (request call id 0) took 3000 ms. Trace:
I20260925 07:18:50.638769   968 rpcz_store.cc:276] 0925 07:18:47.637905 (+     0us) service_pool.cc:170] Inserting onto call queue
0925 07:18:47.637941 (+    36us) service_pool.cc:227] Handling call
0925 07:18:50.638623 (+3000682us) inbound_call.cc:173] Queueing success response
Metrics: {}
[       OK ] Parameters/TestRpc.TestCallLongerThanKeepalive/SSL_TCP (3034 ms)
[ RUN      ] Parameters/TestRpc.TestRpcSidecar/SSL_TCP
I20260925 07:18:50.652529   989 acceptor_pool.cc:254] collecting diagnostics on the listening RPC socket 0.0.0.0:43127 every 8 connection(s)
I20260925 07:18:50.652588   990 acceptor_pool.cc:254] collecting diagnostics on the listening RPC socket 0.0.0.0:43127 every 8 connection(s)
[       OK ] Parameters/TestRpc.TestRpcSidecar/SSL_TCP (54 ms)
[ RUN      ] Parameters/TestRpc.TestRpcSidecarLimits/SSL_TCP
I20260925 07:18:52.429819  1014 acceptor_pool.cc:254] collecting diagnostics on the listening RPC socket 0.0.0.0:46359 every 8 connection(s)
I20260925 07:18:52.429848  1015 acceptor_pool.cc:254] collecting diagnostics on the listening RPC socket 0.0.0.0:46359 every 8 connection(s)
W20260925 07:18:52.450764   772 serialization.cc:72] Serialized kudu.rpc_test.PushStringsRequestPB (2147483654 bytes) is larger than the maximum configured RPC message size (52428800 bytes). Sending anyway, but peer may reject the data.
W20260925 07:18:52.454169  1011 connection.cc:535] server connection from 127.0.0.1:60372 recv error: Network error: RPC frame had a length of 2147483714, but we only support messages up to 52428800 bytes long.
W20260925 07:18:52.454241  1011 connection.cc:158] shutting down server connection from 127.0.0.1:60372 with pending inbound data: 4/2147483714 bytes received; last active 0 ns ago: status Network error: RPC frame had a length of 2147483714, but we only support messages up to 52428800 bytes long.
W20260925 07:18:52.454468  1027 connection.cc:196] Error closing socket: Network error: TlsSocket::Close: Connection reset by peer
I20260925 07:18:52.470520  1039 acceptor_pool.cc:254] collecting diagnostics on the listening RPC socket 0.0.0.0:43865 every 8 connection(s)
I20260925 07:18:52.470541  1040 acceptor_pool.cc:254] collecting diagnostics on the listening RPC socket 0.0.0.0:43865 every 8 connection(s)
W20260925 07:18:56.375476  1037 connection.cc:577] server connection from 127.0.0.1:47132: received bad data: 'Corruption: Invalid packet: message had a length of 2147483710, but we only support messages up to 2147483647 bytes
'
[       OK ] Parameters/TestRpc.TestRpcSidecarLimits/SSL_TCP (5682 ms)
[ RUN      ] Parameters/TestRpc.TestCallTimeoutDoesntAffectNegotiation/SSL_TCP
I20260925 07:18:56.390089  1064 acceptor_pool.cc:254] collecting diagnostics on the listening RPC socket 0.0.0.0:37499 every 8 connection(s)
I20260925 07:18:56.390192  1065 acceptor_pool.cc:254] collecting diagnostics on the listening RPC socket 0.0.0.0:37499 every 8 connection(s)
W20260925 07:18:56.403757  1060 negotiation.cc:266] Injecting 500ms delay in negotiation
I20260925 07:18:56.453979   772 rpc-test-base.h:595] status: Timed out: connection negotiation to 0.0.0.0:37499 for RPC Sleep timed out after 0.050s (ON_OUTBOUND_QUEUE), seconds elapsed: 0.0506416
[       OK ] Parameters/TestRpc.TestCallTimeoutDoesntAffectNegotiation/SSL_TCP (531 ms)
[ RUN      ] Parameters/TestRpc.TestRpcHandlerLatencyMetric/SSL_TCP
I20260925 07:18:56.915796  1089 acceptor_pool.cc:254] collecting diagnostics on the listening RPC socket 0.0.0.0:45837 every 8 connection(s)
I20260925 07:18:56.915940  1090 acceptor_pool.cc:254] collecting diagnostics on the listening RPC socket 0.0.0.0:45837 every 8 connection(s)
I20260925 07:18:56.951843   772 rpc-test.cc:1236] Sleep() min lat: 20308
I20260925 07:18:56.951921   772 rpc-test.cc:1237] Sleep() mean lat: 20308
I20260925 07:18:56.951948   772 rpc-test.cc:1238] Sleep() max lat: 20308
I20260925 07:18:56.951961   772 rpc-test.cc:1239] Sleep() #calls: 1
[       OK ] Parameters/TestRpc.TestRpcHandlerLatencyMetric/SSL_TCP (43 ms)
[ RUN      ] Parameters/TestRpc.TimedOutOnResponseMetricServiceQueue/SSL_TCP
I20260925 07:18:56.959117  1115 acceptor_pool.cc:254] collecting diagnostics on the listening RPC socket 0.0.0.0:45147 every 8 connection(s)
I20260925 07:18:56.959161  1116 acceptor_pool.cc:254] collecting diagnostics on the listening RPC socket 0.0.0.0:45147 every 8 connection(s)
W20260925 07:18:57.035316  1117 rpcz_store.cc:267] Call kudu.rpc_test.CalculatorService.Sleep from 127.0.0.1:52952 (request call id 2) took 20 ms (client timeout 20 ms). Trace:
W20260925 07:18:57.035430  1117 rpcz_store.cc:269] 0925 07:18:57.015008 (+     0us) service_pool.cc:170] Inserting onto call queue
0925 07:18:57.035261 (+ 20253us) service_pool.cc:214] Skipping call since client already timed out
0925 07:18:57.035273 (+    12us) inbound_call.cc:173] Queueing failure response
Metrics: {}
[       OK ] Parameters/TestRpc.TimedOutOnResponseMetricServiceQueue/SSL_TCP (83 ms)
[ RUN      ] Parameters/TestRpc.RpcPendingConnectionsMetric/SSL_TCP
I20260925 07:18:57.038668  1138 acceptor_pool.cc:254] collecting diagnostics on the listening RPC socket 0.0.0.0:43975 every 8 connection(s)
I20260925 07:18:57.038735  1139 acceptor_pool.cc:254] collecting diagnostics on the listening RPC socket 0.0.0.0:43975 every 8 connection(s)
W20260925 07:18:57.048031  1134 negotiation.cc:337] Failed RPC negotiation. Trace:
0925 07:18:57.047793 (+     0us) reactor.cc:625] Submitting negotiation task for server connection from 127.0.0.1:34122 (local address 127.0.0.1:43975)
0925 07:18:57.047884 (+    91us) server_negotiation.cc:206] Beginning negotiation
0925 07:18:57.047887 (+     3us) server_negotiation.cc:399] Waiting for connection header
0925 07:18:57.047967 (+    80us) negotiation.cc:327] Negotiation complete: Network error: Server connection negotiation failed: server connection from 127.0.0.1:34122: BlockingRecv error: recv got EOF from 127.0.0.1:34122 (error 108)
Metrics: {"server-negotiator.queue_time_us":55}
[       OK ] Parameters/TestRpc.RpcPendingConnectionsMetric/SSL_TCP (22 ms)
[ RUN      ] Parameters/TestRpc.TestRpcContextClientDeadline/SSL_TCP
I20260925 07:18:57.070855  1154 acceptor_pool.cc:254] collecting diagnostics on the listening RPC socket 0.0.0.0:42973 every 8 connection(s)
I20260925 07:18:57.070878  1155 acceptor_pool.cc:254] collecting diagnostics on the listening RPC socket 0.0.0.0:42973 every 8 connection(s)
[       OK ] Parameters/TestRpc.TestRpcContextClientDeadline/SSL_TCP (52 ms)
[ RUN      ] Parameters/TestRpc.TestApplicationFeatureFlagUnsupportedServer/SSL_TCP
I20260925 07:18:57.127059  1179 acceptor_pool.cc:254] collecting diagnostics on the listening RPC socket 0.0.0.0:38453 every 8 connection(s)
I20260925 07:18:57.127106  1180 acceptor_pool.cc:254] collecting diagnostics on the listening RPC socket 0.0.0.0:38453 every 8 connection(s)
[       OK ] Parameters/TestRpc.TestApplicationFeatureFlagUnsupportedServer/SSL_TCP (26 ms)
[ RUN      ] Parameters/TestRpc.TestCancellationAsync/SSL_TCP
I20260925 07:18:57.157071  1204 acceptor_pool.cc:254] collecting diagnostics on the listening RPC socket 0.0.0.0:35415 every 8 connection(s)
I20260925 07:18:57.157111  1205 acceptor_pool.cc:254] collecting diagnostics on the listening RPC socket 0.0.0.0:35415 every 8 connection(s)
I20260925 07:18:57.157287   772 rpc-test.cc:1716] Connecting to 0.0.0.0:35415
I20260925 07:18:57.169275   772 test_util.cc:268] Using random seed: -2020429959
I20260925 07:18:57.189445  1208 rpc-test-base.h:240] got call: sleep_micros: 500 pattern: 4294967295 num_repetitions: 2097152 sidecar_idx: 0
I20260925 07:18:57.205250  1208 rpc-test-base.h:240] got call: sleep_micros: 500 pattern: 4294967295 num_repetitions: 2097152 sidecar_idx: 0
I20260925 07:18:57.223008  1208 rpc-test-base.h:240] got call: sleep_micros: 500 pattern: 4294967295 num_repetitions: 2097152 sidecar_idx: 0
I20260925 07:18:57.241132  1208 rpc-test-base.h:240] got call: sleep_micros: 500 pattern: 4294967295 num_repetitions: 2097152 sidecar_idx: 0
I20260925 07:18:57.254317  1208 rpc-test-base.h:240] got call: sleep_micros: 500 pattern: 4294967295 num_repetitions: 2097152 sidecar_idx: 0
I20260925 07:18:57.272298  1208 rpc-test-base.h:240] got call: sleep_micros: 500 pattern: 4294967295 num_repetitions: 2097152 sidecar_idx: 0
I20260925 07:18:57.290562  1208 rpc-test-base.h:240] got call: sleep_micros: 500 pattern: 4294967295 num_repetitions: 2097152 sidecar_idx: 0
I20260925 07:18:57.308948  1208 rpc-test-base.h:240] got call: sleep_micros: 500 pattern: 4294967295 num_repetitions: 2097152 sidecar_idx: 0
W20260925 07:18:57.312150  1201 connection.cc:441] server connection from 127.0.0.1:53178 torn down before Call kudu.rpc.GenericCalculatorService.SleepWithSidecar from 127.0.0.1:53178 (request call id 9) could send its response
[       OK ] Parameters/TestRpc.TestCancellationAsync/SSL_TCP (175 ms)
[ RUN      ] Parameters/TestRpc.TestPerformanceBySocketType/SSL_TCP
I20260925 07:18:57.321973  1229 acceptor_pool.cc:254] collecting diagnostics on the listening RPC socket 0.0.0.0:43479 every 8 connection(s)
I20260925 07:18:57.322014  1230 acceptor_pool.cc:254] collecting diagnostics on the listening RPC socket 0.0.0.0:43479 every 8 connection(s)
I20260925 07:18:57.322161   772 rpc-test.cc:1846] Connecting to 0.0.0.0:43479
I20260925 07:18:58.998647   772 rpc-test.cc:1859] Sending 1024MB via ssl-enabled tcp socket: real 1.662s	user 1.510s	sys 1.426s
I20260925 07:19:00.728749   772 rpc-test.cc:1859] Sending 1024MB via ssl-enabled tcp socket: real 1.730s	user 1.673s	sys 1.381s
I20260925 07:19:02.486425   772 rpc-test.cc:1859] Sending 1024MB via ssl-enabled tcp socket: real 1.758s	user 1.575s	sys 1.530s
I20260925 07:19:04.157013   772 rpc-test.cc:1859] Sending 1024MB via ssl-enabled tcp socket: real 1.670s	user 1.622s	sys 1.346s
I20260925 07:19:05.781200   772 rpc-test.cc:1859] Sending 1024MB via ssl-enabled tcp socket: real 1.624s	user 1.366s	sys 1.524s
[       OK ] Parameters/TestRpc.TestPerformanceBySocketType/SSL_TCP (8469 ms)
[----------] 20 tests from Parameters/TestRpc (27976 ms total)

[----------] 1 test from Parameters/TestRpcSocketTxRxQueue
[ RUN      ] Parameters/TestRpcSocketTxRxQueue.OverCapacity/0
W20260925 07:19:06.052949  1255 negotiation.cc:337] Failed RPC negotiation. Trace:
0925 07:19:05.790287 (+     0us) reactor.cc:625] Submitting negotiation task for client connection to 0.0.0.0:46551 (local address 127.0.0.1:60346)
0925 07:19:05.790327 (+    40us) negotiation.cc:107] Waiting for socket to connect
0925 07:19:05.790335 (+     8us) client_negotiation.cc:174] Beginning negotiation
0925 07:19:05.790375 (+    40us) client_negotiation.cc:252] Sending NEGOTIATE NegotiatePB request
0925 07:19:06.052759 (+262384us) negotiation.cc:327] Negotiation complete: Network error: Client connection negotiation failed: client connection to 0.0.0.0:46551: BlockingRecv error: recv error from unknown peer: Transport endpoint is not connected (error 107)
Metrics: {"client-negotiator.queue_time_us":16}
W20260925 07:19:06.052953  1273 negotiation.cc:337] Failed RPC negotiation. Trace:
0925 07:19:05.792018 (+     0us) reactor.cc:625] Submitting negotiation task for client connection to 0.0.0.0:46551 (local address 127.0.0.1:60372)
0925 07:19:05.792053 (+    35us) negotiation.cc:107] Waiting for socket to connect
0925 07:19:05.792060 (+     7us) client_negotiation.cc:174] Beginning negotiation
0925 07:19:05.792093 (+    33us) client_negotiation.cc:252] Sending NEGOTIATE NegotiatePB request
0925 07:19:06.052761 (+260668us) negotiation.cc:327] Negotiation complete: Network error: Client connection negotiation failed: client connection to 0.0.0.0:46551: BlockingRecv error: recv error from unknown peer: Transport endpoint is not connected (error 107)
Metrics: {"client-negotiator.queue_time_us":16}
W20260925 07:19:06.053135  1291 negotiation.cc:337] Failed RPC negotiation. Trace:
0925 07:19:05.793715 (+     0us) reactor.cc:625] Submitting negotiation task for client connection to 0.0.0.0:46551 (local address 127.0.0.1:60384)
0925 07:19:05.793746 (+    31us) negotiation.cc:107] Waiting for socket to connect
0925 07:19:05.793753 (+     7us) client_negotiation.cc:174] Beginning negotiation
0925 07:19:05.793787 (+    34us) client_negotiation.cc:252] Sending NEGOTIATE NegotiatePB request
0925 07:19:06.053089 (+259302us) negotiation.cc:327] Negotiation complete: Network error: Client connection negotiation failed: client connection to 0.0.0.0:46551: BlockingRecv error: recv error from unknown peer: Transport endpoint is not connected (error 107)
Metrics: {"client-negotiator.queue_time_us":15}
W20260925 07:19:06.052960  1264 negotiation.cc:337] Failed RPC negotiation. Trace:
0925 07:19:05.791206 (+     0us) reactor.cc:625] Submitting negotiation task for client connection to 0.0.0.0:46551 (local address 127.0.0.1:60356)
0925 07:19:05.791283 (+    77us) negotiation.cc:107] Waiting for socket to connect
0925 07:19:05.791294 (+    11us) client_negotiation.cc:174] Beginning negotiation
0925 07:19:05.791336 (+    42us) client_negotiation.cc:252] Sending NEGOTIATE NegotiatePB request
0925 07:19:06.052795 (+261459us) negotiation.cc:327] Negotiation complete: Network error: Client connection negotiation failed: client connection to 0.0.0.0:46551: BlockingRecv error: recv error from unknown peer: Transport endpoint is not connected (error 107)
Metrics: {"client-negotiator.queue_time_us":37}
W20260925 07:19:06.053310  1282 negotiation.cc:337] Failed RPC negotiation. Trace:
0925 07:19:05.792897 (+     0us) reactor.cc:625] Submitting negotiation task for client connection to 0.0.0.0:46551 (local address 127.0.0.1:60374)
0925 07:19:05.792940 (+    43us) negotiation.cc:107] Waiting for socket to connect
0925 07:19:05.792948 (+     8us) client_negotiation.cc:174] Beginning negotiation
0925 07:19:05.793008 (+    60us) client_negotiation.cc:252] Sending NEGOTIATE NegotiatePB request
0925 07:19:06.053041 (+260033us) negotiation.cc:327] Negotiation complete: Network error: Client connection negotiation failed: client connection to 0.0.0.0:46551: BlockingRecv error: recv error from unknown peer: Transport endpoint is not connected (error 107)
Metrics: {"client-negotiator.queue_time_us":25}
W20260925 07:19:06.052960  1246 negotiation.cc:337] Failed RPC negotiation. Trace:
0925 07:19:05.789306 (+     0us) reactor.cc:625] Submitting negotiation task for client connection to 0.0.0.0:46551 (local address 127.0.0.1:60340)
0925 07:19:05.789391 (+    85us) negotiation.cc:107] Waiting for socket to connect
0925 07:19:05.789403 (+    12us) client_negotiation.cc:174] Beginning negotiation
0925 07:19:05.789479 (+    76us) client_negotiation.cc:252] Sending NEGOTIATE NegotiatePB request
0925 07:19:06.052794 (+263315us) negotiation.cc:327] Negotiation complete: Network error: Client connection negotiation failed: client connection to 0.0.0.0:46551: BlockingRecv error: recv error from unknown peer: Transport endpoint is not connected (error 107)
Metrics: {"client-negotiator.queue_time_us":46}
[       OK ] Parameters/TestRpcSocketTxRxQueue.OverCapacity/0 (1037 ms)
[----------] 1 test from Parameters/TestRpcSocketTxRxQueue (1037 ms total)

[----------] Global test environment tear-down
[==========] 21 tests from 2 test suites ran. (29014 ms total)
[  PASSED  ] 20 tests.
[  FAILED  ] 1 test, listed below:
[  FAILED  ] Parameters/TestRpc.TestCallWithChainCertAndChainCA/SSL_TCP, where GetParam() = (true, false)

 1 FAILED TEST