Diagnosed failure
Parameters/TestRpc.TestCallWithChainCertAndChainCA/SSL_UnixSocket: /data0/somelongdirectorytoavoidrpathissues/src/kudu/src/kudu/rpc/rpc-test.cc:270: Failure
Failed
Bad status: Runtime error: could not verify certificate chain (error with cert: subject=CN = localhost, ST = sadfjas, C = AS, emailAddress = sdflkdsajf, O = lskdfjlsad, OU = sldfkja, issuer=C = AS, ST = ASDfkjdhf, L = lskdjf, O = saldfja, OU = skdjf, CN = localhost, emailAddress = sadjflkadsj): : certificate has expired
Google Test trace:
/data0/somelongdirectorytoavoidrpathissues/src/kudu/src/kudu/rpc/rpc-test.cc:267: Connecting to unix:/tmp/dist-test-taskBkvhwh/test-tmp/rpc-test-d1c9b4e9a3ad4989a08fb2a8521e9875.sock
I20260927 13:35:31.931649 2371 test_util.cc:175] -----------------------------------------------
I20260927 13:35:31.931700 2371 test_util.cc:176] Had fatal failures, leaving test files at /tmp/dist-test-taskBkvhwh/test-tmp/rpc-test.6.Parameters_TestRpc.TestCallWithChainCertAndChainCA_SSL_UnixSocket.1790516131886045-2371-0
Full log
Note: This is test shard 7 of 8.
[==========] Running 21 tests from 2 test suites.
[----------] Global test environment set-up.
[----------] 20 tests from Parameters/TestRpc
[ RUN ] Parameters/TestRpc.TestMessengerCreateDestroy/SSL_UnixSocket
WARNING: Logging before InitGoogleLogging() is written to STDERR
I20260927 13:35:31.905481 2371 rpc-test.cc:169] started messenger TestCreateDestroy
[ OK ] Parameters/TestRpc.TestMessengerCreateDestroy/SSL_UnixSocket (17 ms)
[ RUN ] Parameters/TestRpc.TestNegotiationDeadlock/SSL_UnixSocket
I20260927 13:35:31.913034 2391 acceptor_pool.cc:254] collecting diagnostics on the listening RPC socket unix:/tmp/dist-test-taskBkvhwh/test-tmp/rpc-test-6974d585bca24faea7561d05fb82c141.sock every 8 connection(s)
I20260927 13:35:31.913034 2392 acceptor_pool.cc:254] collecting diagnostics on the listening RPC socket unix:/tmp/dist-test-taskBkvhwh/test-tmp/rpc-test-6974d585bca24faea7561d05fb82c141.sock every 8 connection(s)
[ OK ] Parameters/TestRpc.TestNegotiationDeadlock/SSL_UnixSocket (13 ms)
[ RUN ] Parameters/TestRpc.TestCallWithChainCertAndChainCA/SSL_UnixSocket
I20260927 13:35:31.927691 2407 acceptor_pool.cc:254] collecting diagnostics on the listening RPC socket unix:/tmp/dist-test-taskBkvhwh/test-tmp/rpc-test-d1c9b4e9a3ad4989a08fb2a8521e9875.sock every 8 connection(s)
I20260927 13:35:31.927695 2408 acceptor_pool.cc:254] collecting diagnostics on the listening RPC socket unix:/tmp/dist-test-taskBkvhwh/test-tmp/rpc-test-d1c9b4e9a3ad4989a08fb2a8521e9875.sock every 8 connection(s)
/data0/somelongdirectorytoavoidrpathissues/src/kudu/src/kudu/rpc/rpc-test.cc:270: Failure
Failed
Bad status: Runtime error: could not verify certificate chain (error with cert: subject=CN = localhost, ST = sadfjas, C = AS, emailAddress = sdflkdsajf, O = lskdfjlsad, OU = sldfkja, issuer=C = AS, ST = ASDfkjdhf, L = lskdjf, O = saldfja, OU = skdjf, CN = localhost, emailAddress = sadjflkadsj): : certificate has expired
Google Test trace:
/data0/somelongdirectorytoavoidrpathissues/src/kudu/src/kudu/rpc/rpc-test.cc:267: Connecting to unix:/tmp/dist-test-taskBkvhwh/test-tmp/rpc-test-d1c9b4e9a3ad4989a08fb2a8521e9875.sock
I20260927 13:35:31.931649 2371 test_util.cc:175] -----------------------------------------------
I20260927 13:35:31.931700 2371 test_util.cc:176] Had fatal failures, leaving test files at /tmp/dist-test-taskBkvhwh/test-tmp/rpc-test.6.Parameters_TestRpc.TestCallWithChainCertAndChainCA_SSL_UnixSocket.1790516131886045-2371-0
[ FAILED ] Parameters/TestRpc.TestCallWithChainCertAndChainCA/SSL_UnixSocket, where GetParam() = (true, true) (11 ms)
[ RUN ] Parameters/TestRpc.TestCallWithPasswordProtectedKey/SSL_UnixSocket
I20260927 13:35:31.941370 2432 acceptor_pool.cc:254] collecting diagnostics on the listening RPC socket unix:/tmp/dist-test-taskBkvhwh/test-tmp/rpc-test-b270211d75a74739824abd0c42c2ddd4.sock every 8 connection(s)
I20260927 13:35:31.941462 2433 acceptor_pool.cc:254] collecting diagnostics on the listening RPC socket unix:/tmp/dist-test-taskBkvhwh/test-tmp/rpc-test-b270211d75a74739824abd0c42c2ddd4.sock every 8 connection(s)
W20260927 13:35:31.953240 2429 connection.cc:196] Error closing socket: Network error: TlsSocket::Close: Broken pipe
[ OK ] Parameters/TestRpc.TestCallWithPasswordProtectedKey/SSL_UnixSocket (22 ms)
[ RUN ] Parameters/TestRpc.TestCallToBadServer/SSL_UnixSocket
I20260927 13:35:31.968458 2371 rpc-test.cc:394] Status: Network error: Client connection negotiation failed: client connection to 0.0.0.0:0: connect: Connection refused (error 111)
I20260927 13:35:31.968827 2371 rpc-test.cc:394] Status: Network error: Client connection negotiation failed: client connection to 0.0.0.0:0: connect: Connection refused (error 111)
I20260927 13:35:31.969108 2371 rpc-test.cc:394] Status: Network error: Client connection negotiation failed: client connection to 0.0.0.0:0: connect: Connection refused (error 111)
I20260927 13:35:31.969321 2371 rpc-test.cc:394] Status: Network error: Client connection negotiation failed: client connection to 0.0.0.0:0: connect: Connection refused (error 111)
I20260927 13:35:31.969506 2371 rpc-test.cc:394] Status: Network error: Client connection negotiation failed: client connection to 0.0.0.0:0: connect: Connection refused (error 111)
[ OK ] Parameters/TestRpc.TestCallToBadServer/SSL_UnixSocket (15 ms)
[ RUN ] Parameters/TestRpc.TestWrongService/SSL_UnixSocket
I20260927 13:35:31.979238 2467 acceptor_pool.cc:254] collecting diagnostics on the listening RPC socket unix:/tmp/dist-test-taskBkvhwh/test-tmp/rpc-test-35f1f4cdb37f4cab924a2bd0a2a4724d.sock every 8 connection(s)
I20260927 13:35:31.979300 2468 acceptor_pool.cc:254] collecting diagnostics on the listening RPC socket unix:/tmp/dist-test-taskBkvhwh/test-tmp/rpc-test-35f1f4cdb37f4cab924a2bd0a2a4724d.sock every 8 connection(s)
I20260927 13:35:31.989696 2464 messenger.cc:345] service WrongServiceName not registered on TestServer
[ OK ] Parameters/TestRpc.TestWrongService/SSL_UnixSocket (21 ms)
[ RUN ] Parameters/TestRpc.TestConnectionKeepalive/SSL_UnixSocket
I20260927 13:35:32.007858 2490 acceptor_pool.cc:254] collecting diagnostics on the listening RPC socket unix:/tmp/dist-test-taskBkvhwh/test-tmp/rpc-test-cf7d253d4bff4c43aee5454f8f53b7ca.sock every 8 connection(s)
I20260927 13:35:32.007930 2491 acceptor_pool.cc:254] collecting diagnostics on the listening RPC socket unix:/tmp/dist-test-taskBkvhwh/test-tmp/rpc-test-cf7d253d4bff4c43aee5454f8f53b7ca.sock every 8 connection(s)
I20260927 13:35:32.008145 2371 rpc-test.cc:488] Connecting to unix:/tmp/dist-test-taskBkvhwh/test-tmp/rpc-test-cf7d253d4bff4c43aee5454f8f53b7ca.sock
W20260927 13:35:32.492780 2503 connection.cc:196] Error closing socket: Network error: TlsSocket::Close: Broken pipe
[ OK ] Parameters/TestRpc.TestConnectionKeepalive/SSL_UnixSocket (1033 ms)
[ RUN ] Parameters/TestRpc.TestClientConnectionMetrics/SSL_UnixSocket
I20260927 13:35:33.036337 2515 acceptor_pool.cc:254] collecting diagnostics on the listening RPC socket unix:/tmp/dist-test-taskBkvhwh/test-tmp/rpc-test-14e057556f3446538079aed25b05871f.sock every 8 connection(s)
I20260927 13:35:33.036392 2516 acceptor_pool.cc:254] collecting diagnostics on the listening RPC socket unix:/tmp/dist-test-taskBkvhwh/test-tmp/rpc-test-14e057556f3446538079aed25b05871f.sock every 8 connection(s)
I20260927 13:35:33.036645 2371 rpc-test.cc:569] Connecting to unix:/tmp/dist-test-taskBkvhwh/test-tmp/rpc-test-14e057556f3446538079aed25b05871f.sock
W20260927 13:35:42.975688 2512 connection.cc:196] Error closing socket: Network error: TlsSocket::Close: Broken pipe
[ OK ] Parameters/TestRpc.TestClientConnectionMetrics/SSL_UnixSocket (9951 ms)
[ RUN ] Parameters/TestRpc.TestCredentialsPolicy/SSL_UnixSocket
I20260927 13:35:42.984869 2538 acceptor_pool.cc:254] collecting diagnostics on the listening RPC socket unix:/tmp/dist-test-taskBkvhwh/test-tmp/rpc-test-15723376430445f186ebb129d1a07d91.sock every 8 connection(s)
I20260927 13:35:42.984928 2539 acceptor_pool.cc:254] collecting diagnostics on the listening RPC socket unix:/tmp/dist-test-taskBkvhwh/test-tmp/rpc-test-15723376430445f186ebb129d1a07d91.sock every 8 connection(s)
I20260927 13:35:42.985085 2371 rpc-test.cc:700] Connecting to unix:/tmp/dist-test-taskBkvhwh/test-tmp/rpc-test-15723376430445f186ebb129d1a07d91.sock
W20260927 13:35:43.007038 2537 connection.cc:196] Error closing socket: Network error: TlsSocket::Close: Broken pipe
[ OK ] Parameters/TestRpc.TestCredentialsPolicy/SSL_UnixSocket (35 ms)
[ RUN ] Parameters/TestRpc.TestCallLongerThanKeepalive/SSL_UnixSocket
I20260927 13:35:43.030768 2563 acceptor_pool.cc:254] collecting diagnostics on the listening RPC socket unix:/tmp/dist-test-taskBkvhwh/test-tmp/rpc-test-30a5ed92bf2b44918b21c2a7dc064395.sock every 8 connection(s)
I20260927 13:35:43.030818 2564 acceptor_pool.cc:254] collecting diagnostics on the listening RPC socket unix:/tmp/dist-test-taskBkvhwh/test-tmp/rpc-test-30a5ed92bf2b44918b21c2a7dc064395.sock every 8 connection(s)
I20260927 13:35:43.042971 2567 rpc-test-base.h:222] got call: sleep_micros: 3000000 deferred: true
I20260927 13:35:46.043888 2567 rpcz_store.cc:275] Call kudu.rpc.GenericCalculatorService.Sleep from unix:<unnamed> (request call id 0) took 3000 ms. Trace:
I20260927 13:35:46.044055 2567 rpcz_store.cc:276] 0927 13:35:43.042911 (+ 0us) service_pool.cc:170] Inserting onto call queue
0927 13:35:43.042950 (+ 39us) service_pool.cc:227] Handling call
0927 13:35:46.043861 (+3000911us) inbound_call.cc:173] Queueing success response
Metrics: {}
[ OK ] Parameters/TestRpc.TestCallLongerThanKeepalive/SSL_UnixSocket (3035 ms)
[ RUN ] Parameters/TestRpc.TestRpcSidecar/SSL_UnixSocket
I20260927 13:35:46.056116 2588 acceptor_pool.cc:254] collecting diagnostics on the listening RPC socket unix:/tmp/dist-test-taskBkvhwh/test-tmp/rpc-test-ac8393e08bbd4dfca9bf17a3b607a103.sock every 8 connection(s)
I20260927 13:35:46.056195 2589 acceptor_pool.cc:254] collecting diagnostics on the listening RPC socket unix:/tmp/dist-test-taskBkvhwh/test-tmp/rpc-test-ac8393e08bbd4dfca9bf17a3b607a103.sock every 8 connection(s)
W20260927 13:35:46.102874 2585 connection.cc:196] Error closing socket: Network error: TlsSocket::Close: Broken pipe
[ OK ] Parameters/TestRpc.TestRpcSidecar/SSL_UnixSocket (56 ms)
[ RUN ] Parameters/TestRpc.TestRpcSidecarLimits/SSL_UnixSocket
I20260927 13:35:51.714574 2613 acceptor_pool.cc:254] collecting diagnostics on the listening RPC socket unix:/tmp/dist-test-taskBkvhwh/test-tmp/rpc-test-7b0ef42c300140c988bdb03ee994b0ab.sock every 8 connection(s)
I20260927 13:35:51.714709 2614 acceptor_pool.cc:254] collecting diagnostics on the listening RPC socket unix:/tmp/dist-test-taskBkvhwh/test-tmp/rpc-test-7b0ef42c300140c988bdb03ee994b0ab.sock every 8 connection(s)
W20260927 13:35:51.744127 2371 serialization.cc:72] Serialized kudu.rpc_test.PushStringsRequestPB (2147483654 bytes) is larger than the maximum configured RPC message size (52428800 bytes). Sending anyway, but peer may reject the data.
W20260927 13:35:51.748348 2610 connection.cc:535] server connection from unix:<unnamed> recv error: Network error: RPC frame had a length of 2147483714, but we only support messages up to 52428800 bytes long.
W20260927 13:35:51.748500 2610 connection.cc:158] shutting down server connection from unix:<unnamed> with pending inbound data: 4/2147483714 bytes received; last active 0 ns ago: status Network error: RPC frame had a length of 2147483714, but we only support messages up to 52428800 bytes long.
W20260927 13:35:51.748705 2626 connection.cc:698] client connection to unix:/tmp/dist-test-taskBkvhwh/test-tmp/rpc-test-7b0ef42c300140c988bdb03ee994b0ab.sock send error: Network error: failed to write to TLS socket: Broken pipe
W20260927 13:35:51.748842 2626 connection.cc:196] Error closing socket: Network error: TlsSocket::Close: Success
I20260927 13:35:51.761051 2639 acceptor_pool.cc:254] collecting diagnostics on the listening RPC socket unix:/tmp/dist-test-taskBkvhwh/test-tmp/rpc-test-7b0ef42c300140c988bdb03ee994b0ab.sock every 8 connection(s)
I20260927 13:35:51.761036 2638 acceptor_pool.cc:254] collecting diagnostics on the listening RPC socket unix:/tmp/dist-test-taskBkvhwh/test-tmp/rpc-test-7b0ef42c300140c988bdb03ee994b0ab.sock every 8 connection(s)
W20260927 13:36:00.784071 2635 connection.cc:577] server connection from unix:<unnamed>: received bad data: 'Corruption: Invalid packet: message had a length of 2147483710, but we only support messages up to 2147483647 bytes
'
W20260927 13:36:00.784530 2651 connection.cc:196] Error closing socket: Network error: TlsSocket::Close: Broken pipe
[ OK ] Parameters/TestRpc.TestRpcSidecarLimits/SSL_UnixSocket (14682 ms)
[ RUN ] Parameters/TestRpc.TestCallTimeoutDoesntAffectNegotiation/SSL_UnixSocket
I20260927 13:36:00.834537 2663 acceptor_pool.cc:254] collecting diagnostics on the listening RPC socket unix:/tmp/dist-test-taskBkvhwh/test-tmp/rpc-test-8ef28203decb4699bd11b543af96763e.sock every 8 connection(s)
I20260927 13:36:00.834610 2664 acceptor_pool.cc:254] collecting diagnostics on the listening RPC socket unix:/tmp/dist-test-taskBkvhwh/test-tmp/rpc-test-8ef28203decb4699bd11b543af96763e.sock every 8 connection(s)
W20260927 13:36:00.843469 2659 negotiation.cc:266] Injecting 500ms delay in negotiation
I20260927 13:36:00.893736 2371 rpc-test-base.h:595] status: Timed out: connection negotiation to unix:/tmp/dist-test-taskBkvhwh/test-tmp/rpc-test-8ef28203decb4699bd11b543af96763e.sock for RPC Sleep timed out after 0.050s (ON_OUTBOUND_QUEUE), seconds elapsed: 0.0506591
[ OK ] Parameters/TestRpc.TestCallTimeoutDoesntAffectNegotiation/SSL_UnixSocket (562 ms)
[ RUN ] Parameters/TestRpc.TestRpcHandlerLatencyMetric/SSL_UnixSocket
I20260927 13:36:01.361573 2688 acceptor_pool.cc:254] collecting diagnostics on the listening RPC socket unix:/tmp/dist-test-taskBkvhwh/test-tmp/rpc-test-84ff2f03bc1e4f9894e76ea8d87c0551.sock every 8 connection(s)
I20260927 13:36:01.361611 2689 acceptor_pool.cc:254] collecting diagnostics on the listening RPC socket unix:/tmp/dist-test-taskBkvhwh/test-tmp/rpc-test-84ff2f03bc1e4f9894e76ea8d87c0551.sock every 8 connection(s)
I20260927 13:36:01.407863 2371 rpc-test.cc:1236] Sleep() min lat: 20314
I20260927 13:36:01.407971 2371 rpc-test.cc:1237] Sleep() mean lat: 20314
I20260927 13:36:01.408010 2371 rpc-test.cc:1238] Sleep() max lat: 20314
I20260927 13:36:01.408025 2371 rpc-test.cc:1239] Sleep() #calls: 1
[ OK ] Parameters/TestRpc.TestRpcHandlerLatencyMetric/SSL_UnixSocket (60 ms)
[ RUN ] Parameters/TestRpc.TimedOutOnResponseMetricServiceQueue/SSL_UnixSocket
I20260927 13:36:01.418690 2715 acceptor_pool.cc:254] collecting diagnostics on the listening RPC socket unix:/tmp/dist-test-taskBkvhwh/test-tmp/rpc-test-a74b198bd21340b1a15f0e2a2fb2da9c.sock every 8 connection(s)
I20260927 13:36:01.418638 2714 acceptor_pool.cc:254] collecting diagnostics on the listening RPC socket unix:/tmp/dist-test-taskBkvhwh/test-tmp/rpc-test-a74b198bd21340b1a15f0e2a2fb2da9c.sock every 8 connection(s)
W20260927 13:36:01.499155 2716 rpcz_store.cc:267] Call kudu.rpc_test.CalculatorService.Sleep from unix:<unnamed> (request call id 2) took 20 ms (client timeout 20 ms). Trace:
W20260927 13:36:01.499284 2716 rpcz_store.cc:269] 0927 13:36:01.478896 (+ 0us) service_pool.cc:170] Inserting onto call queue
0927 13:36:01.499126 (+ 20230us) service_pool.cc:214] Skipping call since client already timed out
0927 13:36:01.499136 (+ 10us) inbound_call.cc:173] Queueing failure response
Metrics: {}
[ OK ] Parameters/TestRpc.TimedOutOnResponseMetricServiceQueue/SSL_UnixSocket (90 ms)
[ RUN ] Parameters/TestRpc.RpcPendingConnectionsMetric/SSL_UnixSocket
I20260927 13:36:01.502959 2737 acceptor_pool.cc:254] collecting diagnostics on the listening RPC socket 0.0.0.0:33471 every 8 connection(s)
I20260927 13:36:01.503122 2738 acceptor_pool.cc:254] collecting diagnostics on the listening RPC socket 0.0.0.0:33471 every 8 connection(s)
W20260927 13:36:01.515429 2733 negotiation.cc:337] Failed RPC negotiation. Trace:
0927 13:36:01.514975 (+ 0us) reactor.cc:625] Submitting negotiation task for server connection from 127.0.0.1:47468 (local address 127.0.0.1:33471)
0927 13:36:01.515062 (+ 87us) server_negotiation.cc:206] Beginning negotiation
0927 13:36:01.515065 (+ 3us) server_negotiation.cc:399] Waiting for connection header
0927 13:36:01.515251 (+ 186us) negotiation.cc:327] Negotiation complete: Network error: Server connection negotiation failed: server connection from 127.0.0.1:47468: BlockingRecv error: recv got EOF from 127.0.0.1:47468 (error 108)
Metrics: {"server-negotiator.queue_time_us":22}
[ OK ] Parameters/TestRpc.RpcPendingConnectionsMetric/SSL_UnixSocket (23 ms)
[ RUN ] Parameters/TestRpc.TestRpcContextClientDeadline/SSL_UnixSocket
I20260927 13:36:01.530469 2753 acceptor_pool.cc:254] collecting diagnostics on the listening RPC socket unix:/tmp/dist-test-taskBkvhwh/test-tmp/rpc-test-a3f5d6dad271445799f713edd51a8369.sock every 8 connection(s)
I20260927 13:36:01.530531 2754 acceptor_pool.cc:254] collecting diagnostics on the listening RPC socket unix:/tmp/dist-test-taskBkvhwh/test-tmp/rpc-test-a3f5d6dad271445799f713edd51a8369.sock every 8 connection(s)
[ OK ] Parameters/TestRpc.TestRpcContextClientDeadline/SSL_UnixSocket (46 ms)
[ RUN ] Parameters/TestRpc.TestApplicationFeatureFlagUnsupportedServer/SSL_UnixSocket
I20260927 13:36:01.579306 2778 acceptor_pool.cc:254] collecting diagnostics on the listening RPC socket unix:/tmp/dist-test-taskBkvhwh/test-tmp/rpc-test-9f83cf848c764ee6a7ebc066b033e2c5.sock every 8 connection(s)
I20260927 13:36:01.579365 2779 acceptor_pool.cc:254] collecting diagnostics on the listening RPC socket unix:/tmp/dist-test-taskBkvhwh/test-tmp/rpc-test-9f83cf848c764ee6a7ebc066b033e2c5.sock every 8 connection(s)
W20260927 13:36:01.590746 2775 connection.cc:196] Error closing socket: Network error: TlsSocket::Close: Broken pipe
[ OK ] Parameters/TestRpc.TestApplicationFeatureFlagUnsupportedServer/SSL_UnixSocket (20 ms)
[ RUN ] Parameters/TestRpc.TestCancellationAsync/SSL_UnixSocket
I20260927 13:36:01.602013 2803 acceptor_pool.cc:254] collecting diagnostics on the listening RPC socket unix:/tmp/dist-test-taskBkvhwh/test-tmp/rpc-test-d3a182c10e4545d9b4b8510f7d66aa71.sock every 8 connection(s)
I20260927 13:36:01.602087 2804 acceptor_pool.cc:254] collecting diagnostics on the listening RPC socket unix:/tmp/dist-test-taskBkvhwh/test-tmp/rpc-test-d3a182c10e4545d9b4b8510f7d66aa71.sock every 8 connection(s)
I20260927 13:36:01.602313 2371 rpc-test.cc:1716] Connecting to unix:/tmp/dist-test-taskBkvhwh/test-tmp/rpc-test-d3a182c10e4545d9b4b8510f7d66aa71.sock
I20260927 13:36:01.624505 2371 test_util.cc:268] Using random seed: 130496950
I20260927 13:36:01.643102 2807 rpc-test-base.h:240] got call: sleep_micros: 500 pattern: 4294967295 num_repetitions: 2097152 sidecar_idx: 0
I20260927 13:36:01.655453 2807 rpc-test-base.h:240] got call: sleep_micros: 500 pattern: 4294967295 num_repetitions: 2097152 sidecar_idx: 0
I20260927 13:36:01.666925 2807 rpc-test-base.h:240] got call: sleep_micros: 500 pattern: 4294967295 num_repetitions: 2097152 sidecar_idx: 0
I20260927 13:36:01.678620 2807 rpc-test-base.h:240] got call: sleep_micros: 500 pattern: 4294967295 num_repetitions: 2097152 sidecar_idx: 0
I20260927 13:36:01.690228 2807 rpc-test-base.h:240] got call: sleep_micros: 500 pattern: 4294967295 num_repetitions: 2097152 sidecar_idx: 0
I20260927 13:36:01.704732 2807 rpc-test-base.h:240] got call: sleep_micros: 500 pattern: 4294967295 num_repetitions: 2097152 sidecar_idx: 0
I20260927 13:36:01.718920 2807 rpc-test-base.h:240] got call: sleep_micros: 500 pattern: 4294967295 num_repetitions: 2097152 sidecar_idx: 0
I20260927 13:36:01.733703 2807 rpc-test-base.h:240] got call: sleep_micros: 500 pattern: 4294967295 num_repetitions: 2097152 sidecar_idx: 0
W20260927 13:36:01.735466 2800 connection.cc:196] Error closing socket: Network error: TlsSocket::Close: Broken pipe
W20260927 13:36:01.737124 2800 connection.cc:441] server connection from unix:<unnamed> torn down before Call kudu.rpc.GenericCalculatorService.SleepWithSidecar from unix:<unnamed> (request call id 9) could send its response
[ OK ] Parameters/TestRpc.TestCancellationAsync/SSL_UnixSocket (146 ms)
[ RUN ] Parameters/TestRpc.TestPerformanceBySocketType/SSL_UnixSocket
I20260927 13:36:01.751394 2828 acceptor_pool.cc:254] collecting diagnostics on the listening RPC socket unix:/tmp/dist-test-taskBkvhwh/test-tmp/rpc-test-c923141df6b642eca8bc4813a7ae2ab0.sock every 8 connection(s)
I20260927 13:36:01.751444 2829 acceptor_pool.cc:254] collecting diagnostics on the listening RPC socket unix:/tmp/dist-test-taskBkvhwh/test-tmp/rpc-test-c923141df6b642eca8bc4813a7ae2ab0.sock every 8 connection(s)
I20260927 13:36:01.751845 2371 rpc-test.cc:1846] Connecting to unix:/tmp/dist-test-taskBkvhwh/test-tmp/rpc-test-c923141df6b642eca8bc4813a7ae2ab0.sock
I20260927 13:36:03.029487 2371 rpc-test.cc:1859] Sending 1024MB via ssl-enabled unix socket: real 1.258s user 1.382s sys 0.887s
I20260927 13:36:04.220078 2371 rpc-test.cc:1859] Sending 1024MB via ssl-enabled unix socket: real 1.190s user 1.286s sys 0.869s
I20260927 13:36:05.431161 2371 rpc-test.cc:1859] Sending 1024MB via ssl-enabled unix socket: real 1.211s user 1.266s sys 0.927s
I20260927 13:36:06.584213 2371 rpc-test.cc:1859] Sending 1024MB via ssl-enabled unix socket: real 1.153s user 1.242s sys 0.846s
I20260927 13:36:07.789958 2371 rpc-test.cc:1859] Sending 1024MB via ssl-enabled unix socket: real 1.206s user 1.192s sys 0.977s
W20260927 13:36:07.790880 2825 connection.cc:196] Error closing socket: Network error: TlsSocket::Close: Broken pipe
[ OK ] Parameters/TestRpc.TestPerformanceBySocketType/SSL_UnixSocket (6053 ms)
[----------] 20 tests from Parameters/TestRpc (35903 ms total)
[----------] 1 test from Parameters/TestRpcSocketTxRxQueue
[ RUN ] Parameters/TestRpcSocketTxRxQueue.AcceptorRxQueueSizeMetric/0
I20260927 13:36:07.802532 2853 acceptor_pool.cc:254] collecting diagnostics on the listening RPC socket 0.0.0.0:45415 every 1 connection(s)
I20260927 13:36:07.802693 2854 acceptor_pool.cc:254] collecting diagnostics on the listening RPC socket 0.0.0.0:45415 every 1 connection(s)
W20260927 13:36:07.803347 2849 negotiation.cc:337] Failed RPC negotiation. Trace:
0927 13:36:07.803183 (+ 0us) reactor.cc:625] Submitting negotiation task for server connection from 127.0.0.1:48128 (local address 127.0.0.1:45415)
0927 13:36:07.803246 (+ 63us) server_negotiation.cc:206] Beginning negotiation
0927 13:36:07.803248 (+ 2us) server_negotiation.cc:399] Waiting for connection header
0927 13:36:07.803315 (+ 67us) negotiation.cc:327] Negotiation complete: Network error: Server connection negotiation failed: server connection from 127.0.0.1:48128: BlockingRecv error: recv got EOF from 127.0.0.1:48128 (error 108)
Metrics: {"server-negotiator.queue_time_us":20}
[ OK ] Parameters/TestRpcSocketTxRxQueue.AcceptorRxQueueSizeMetric/0 (13 ms)
[----------] 1 test from Parameters/TestRpcSocketTxRxQueue (13 ms total)
[----------] Global test environment tear-down
[==========] 21 tests from 2 test suites ran. (35917 ms total)
[ PASSED ] 20 tests.
[ FAILED ] 1 test, listed below:
[ FAILED ] Parameters/TestRpc.TestCallWithChainCertAndChainCA/SSL_UnixSocket, where GetParam() = (true, true)
1 FAILED TEST