Parameters/TestRpc.TestCallWithChainCertAndRootCA/SSL_TCP: /data0/somelongdirectorytoavoidrpathissues/src/kudu/src/kudu/rpc/rpc-test.cc:303: Failure
Failed
Bad status: Runtime error: could not verify certificate chain (error with cert: subject=CN = localhost, ST = sadfjas, C = AS, emailAddress = sdflkdsajf, O = lskdfjlsad, OU = sldfkja, issuer=C = AS, ST = ASDfkjdhf, L = lskdjf, O = saldfja, OU = skdjf, CN = localhost, emailAddress = sadjflkadsj): : certificate has expired
Google Test trace:
/data0/somelongdirectorytoavoidrpathissues/src/kudu/src/kudu/rpc/rpc-test.cc:300: Connecting to 0.0.0.0:35183
I20260928 06:17:40.004350 14899 test_util.cc:175] -----------------------------------------------
I20260928 06:17:40.004525 14899 test_util.cc:176] Had fatal failures, leaving test files at /tmp/dist-test-taskGcyKqF/test-tmp/rpc-test.1.Parameters_TestRpc.TestCallWithChainCertAndRootCA_SSL_TCP.1790576258426002-14899-0
Note: This is test shard 2 of 8.
[==========] Running 21 tests from 2 test suites.
[----------] Global test environment set-up.
[----------] 1 test from TestRpc
[ RUN ] TestRpc.TestMethodsByName
[ OK ] TestRpc.TestMethodsByName (16 ms)
[----------] 1 test from TestRpc (16 ms total)
[----------] 20 tests from Parameters/TestRpc
[ RUN ] Parameters/TestRpc.TestAcceptorPoolStartStop/SSL_TCP
WARNING: Logging before InitGoogleLogging() is written to STDERR
I20260928 06:17:38.598264 14914 acceptor_pool.cc:254] collecting diagnostics on the listening RPC socket 0.0.0.0:45355 every 8 connection(s)
I20260928 06:17:38.602747 14915 acceptor_pool.cc:254] collecting diagnostics on the listening RPC socket 0.0.0.0:45355 every 8 connection(s)
I20260928 06:17:39.785295 14926 acceptor_pool.cc:254] collecting diagnostics on the listening RPC socket 0.0.0.0:35419 every 8 connection(s)
I20260928 06:17:39.786353 14927 acceptor_pool.cc:254] collecting diagnostics on the listening RPC socket 0.0.0.0:35419 every 8 connection(s)
I20260928 06:17:39.821926 14937 acceptor_pool.cc:254] collecting diagnostics on the listening RPC socket 0.0.0.0:36373 every 8 connection(s)
I20260928 06:17:39.823369 14938 acceptor_pool.cc:254] collecting diagnostics on the listening RPC socket 0.0.0.0:36373 every 8 connection(s)
I20260928 06:17:39.848806 14948 acceptor_pool.cc:254] collecting diagnostics on the listening RPC socket 0.0.0.0:41843 every 8 connection(s)
I20260928 06:17:39.849529 14949 acceptor_pool.cc:254] collecting diagnostics on the listening RPC socket 0.0.0.0:41843 every 8 connection(s)
I20260928 06:17:39.865316 14959 acceptor_pool.cc:254] collecting diagnostics on the listening RPC socket 0.0.0.0:33175 every 8 connection(s)
I20260928 06:17:39.866025 14960 acceptor_pool.cc:254] collecting diagnostics on the listening RPC socket 0.0.0.0:33175 every 8 connection(s)
[ OK ] Parameters/TestRpc.TestAcceptorPoolStartStop/SSL_TCP (1350 ms)
[ RUN ] Parameters/TestRpc.TestCall/SSL_TCP
I20260928 06:17:39.893271 14972 acceptor_pool.cc:254] collecting diagnostics on the listening RPC socket 0.0.0.0:41505 every 8 connection(s)
I20260928 06:17:39.895462 14973 acceptor_pool.cc:254] collecting diagnostics on the listening RPC socket 0.0.0.0:41505 every 8 connection(s)
I20260928 06:17:39.901086 14899 rpc-test.cc:234] Connecting to 0.0.0.0:41505
[ OK ] Parameters/TestRpc.TestCall/SSL_TCP (97 ms)
[ RUN ] Parameters/TestRpc.TestCallWithChainCertAndRootCA/SSL_TCP
I20260928 06:17:39.983935 14997 acceptor_pool.cc:254] collecting diagnostics on the listening RPC socket 0.0.0.0:35183 every 8 connection(s)
I20260928 06:17:39.984706 14998 acceptor_pool.cc:254] collecting diagnostics on the listening RPC socket 0.0.0.0:35183 every 8 connection(s)
/data0/somelongdirectorytoavoidrpathissues/src/kudu/src/kudu/rpc/rpc-test.cc:303: Failure
Failed
Bad status: Runtime error: could not verify certificate chain (error with cert: subject=CN = localhost, ST = sadfjas, C = AS, emailAddress = sdflkdsajf, O = lskdfjlsad, OU = sldfkja, issuer=C = AS, ST = ASDfkjdhf, L = lskdjf, O = saldfja, OU = skdjf, CN = localhost, emailAddress = sadjflkadsj): : certificate has expired
Google Test trace:
/data0/somelongdirectorytoavoidrpathissues/src/kudu/src/kudu/rpc/rpc-test.cc:300: Connecting to 0.0.0.0:35183
I20260928 06:17:40.004350 14899 test_util.cc:175] -----------------------------------------------
I20260928 06:17:40.004525 14899 test_util.cc:176] Had fatal failures, leaving test files at /tmp/dist-test-taskGcyKqF/test-tmp/rpc-test.1.Parameters_TestRpc.TestCallWithChainCertAndRootCA_SSL_TCP.1790576258426002-14899-0
[ FAILED ] Parameters/TestRpc.TestCallWithChainCertAndRootCA/SSL_TCP, where GetParam() = (true, false) (37 ms)
[ RUN ] Parameters/TestRpc.TestCallWithBadPasswordProtectedKey/SSL_TCP
[ OK ] Parameters/TestRpc.TestCallWithBadPasswordProtectedKey/SSL_TCP (37 ms)
[ RUN ] Parameters/TestRpc.TestInvalidMethodCall/SSL_TCP
I20260928 06:17:40.073627 15034 acceptor_pool.cc:254] collecting diagnostics on the listening RPC socket 0.0.0.0:32981 every 8 connection(s)
I20260928 06:17:40.074469 15035 acceptor_pool.cc:254] collecting diagnostics on the listening RPC socket 0.0.0.0:32981 every 8 connection(s)
I20260928 06:17:40.077831 14899 rpc-test.cc:406] Connecting to 0.0.0.0:32981
[ OK ] Parameters/TestRpc.TestInvalidMethodCall/SSL_TCP (76 ms)
[ RUN ] Parameters/TestRpc.TestHighFDs/SSL_TCP
I20260928 06:17:40.315166 15059 acceptor_pool.cc:254] collecting diagnostics on the listening RPC socket 0.0.0.0:35477 every 8 connection(s)
I20260928 06:17:40.316154 15060 acceptor_pool.cc:254] collecting diagnostics on the listening RPC socket 0.0.0.0:35477 every 8 connection(s)
[ OK ] Parameters/TestRpc.TestHighFDs/SSL_TCP (241 ms)
[ RUN ] Parameters/TestRpc.TestConnectionAlwaysKeepalive/SSL_TCP
I20260928 06:17:40.376097 15082 acceptor_pool.cc:254] collecting diagnostics on the listening RPC socket 0.0.0.0:45317 every 8 connection(s)
I20260928 06:17:40.376868 15083 acceptor_pool.cc:254] collecting diagnostics on the listening RPC socket 0.0.0.0:45317 every 8 connection(s)
I20260928 06:17:40.380016 14899 rpc-test.cc:532] Connecting to 0.0.0.0:45317
[ OK ] Parameters/TestRpc.TestConnectionAlwaysKeepalive/SSL_TCP (3052 ms)
[ RUN ] Parameters/TestRpc.TestReopenOutboundConnections/SSL_TCP
I20260928 06:17:43.433009 15105 acceptor_pool.cc:254] collecting diagnostics on the listening RPC socket 0.0.0.0:41499 every 8 connection(s)
I20260928 06:17:43.433743 15106 acceptor_pool.cc:254] collecting diagnostics on the listening RPC socket 0.0.0.0:41499 every 8 connection(s)
I20260928 06:17:43.436926 14899 rpc-test.cc:658] Connecting to 0.0.0.0:41499
[ OK ] Parameters/TestRpc.TestReopenOutboundConnections/SSL_TCP (383 ms)
[ RUN ] Parameters/TestRpc.TestConnectionNetworkPlane/SSL_TCP
I20260928 06:17:43.817842 15128 acceptor_pool.cc:254] collecting diagnostics on the listening RPC socket 0.0.0.0:41295 every 8 connection(s)
I20260928 06:17:43.818332 15129 acceptor_pool.cc:254] collecting diagnostics on the listening RPC socket 0.0.0.0:41295 every 8 connection(s)
I20260928 06:17:43.821439 14899 rpc-test.cc:772] Connecting to 0.0.0.0:41295
[ OK ] Parameters/TestRpc.TestConnectionNetworkPlane/SSL_TCP (91 ms)
[ RUN ] Parameters/TestRpc.TestTCPKeepalive/SSL_TCP
I20260928 06:17:43.911276 15153 acceptor_pool.cc:254] collecting diagnostics on the listening RPC socket 0.0.0.0:42373 every 8 connection(s)
I20260928 06:17:43.911998 15154 acceptor_pool.cc:254] collecting diagnostics on the listening RPC socket 0.0.0.0:42373 every 8 connection(s)
I20260928 06:17:43.950697 15157 rpc-test-base.h:222] got call: sleep_micros: 8000000 deferred: true
I20260928 06:17:51.954788 15157 rpcz_store.cc:275] Call kudu.rpc.GenericCalculatorService.Sleep from 127.0.0.1:39818 (request call id 0) took 8004 ms. Trace:
I20260928 06:17:51.955185 15157 rpcz_store.cc:276] 0928 06:17:43.950441 (+ 0us) service_pool.cc:170] Inserting onto call queue
0928 06:17:43.950545 (+ 104us) service_pool.cc:227] Handling call
0928 06:17:51.954610 (+8004065us) inbound_call.cc:173] Queueing success response
Metrics: {}
[ OK ] Parameters/TestRpc.TestTCPKeepalive/SSL_TCP (8080 ms)
[ RUN ] Parameters/TestRpc.TestMaxSmallSidecars/SSL_TCP
I20260928 06:17:51.987931 15179 acceptor_pool.cc:254] collecting diagnostics on the listening RPC socket 0.0.0.0:37815 every 8 connection(s)
I20260928 06:17:51.988746 15180 acceptor_pool.cc:254] collecting diagnostics on the listening RPC socket 0.0.0.0:37815 every 8 connection(s)
[ OK ] Parameters/TestRpc.TestMaxSmallSidecars/SSL_TCP (212 ms)
[ RUN ] Parameters/TestRpc.TestCallTimeout/SSL_TCP
I20260928 06:17:52.220801 15204 acceptor_pool.cc:254] collecting diagnostics on the listening RPC socket 0.0.0.0:41521 every 8 connection(s)
I20260928 06:17:52.221541 15205 acceptor_pool.cc:254] collecting diagnostics on the listening RPC socket 0.0.0.0:41521 every 8 connection(s)
I20260928 06:17:52.262729 14899 rpc-test-base.h:595] status: Timed out: connection negotiation to 0.0.0.0:41521 for RPC Sleep timed out after 0.000s (ON_OUTBOUND_QUEUE), seconds elapsed: 0.00259962
I20260928 06:17:52.269834 15208 rpc-test-base.h:222] got call: sleep_micros: 700000
I20260928 06:17:52.464550 14899 rpc-test-base.h:595] status: Timed out: Sleep RPC to 0.0.0.0:41521 timed out after 0.200s (SENT), seconds elapsed: 0.201459
I20260928 06:17:52.466061 15207 rpc-test-base.h:222] got call: sleep_micros: 2000000
W20260928 06:17:52.970600 15208 rpcz_store.cc:267] Call kudu.rpc.GenericCalculatorService.Sleep from 127.0.0.1:52888 (request call id 1) took 700 ms (client timeout 200 ms). Trace:
W20260928 06:17:52.971032 15208 rpcz_store.cc:269] 0928 06:17:52.269679 (+ 0us) service_pool.cc:170] Inserting onto call queue
0928 06:17:52.269779 (+ 100us) service_pool.cc:227] Handling call
0928 06:17:52.970532 (+700753us) inbound_call.cc:173] Queueing success response
Metrics: {}
I20260928 06:17:53.967265 14899 rpc-test-base.h:595] status: Timed out: Sleep RPC to 0.0.0.0:41521 timed out after 1.500s (SENT), seconds elapsed: 1.50234
W20260928 06:17:54.466640 15207 rpcz_store.cc:267] Call kudu.rpc.GenericCalculatorService.Sleep from 127.0.0.1:52888 (request call id 2) took 2000 ms (client timeout 1500 ms). Trace:
W20260928 06:17:54.466990 15207 rpcz_store.cc:269] 0928 06:17:52.465754 (+ 0us) service_pool.cc:170] Inserting onto call queue
0928 06:17:52.465903 (+ 149us) service_pool.cc:227] Handling call
0928 06:17:54.466573 (+2000670us) inbound_call.cc:173] Queueing success response
Metrics: {}
W20260928 06:17:54.467573 15203 connection.cc:441] server connection from 127.0.0.1:52888 torn down before Call kudu.rpc.GenericCalculatorService.Sleep from 127.0.0.1:52888 (request call id 2) could send its response
[ OK ] Parameters/TestRpc.TestCallTimeout/SSL_TCP (2291 ms)
[ RUN ] Parameters/TestRpc.TestServerShutsDown/SSL_TCP
I20260928 06:17:54.474553 14899 rpc-test.cc:1125] Connecting to 0.0.0.0:34413
W20260928 06:17:54.484931 15221 negotiation.cc:337] Failed RPC negotiation. Trace:
0928 06:17:54.483079 (+ 0us) reactor.cc:625] Submitting negotiation task for client connection to 0.0.0.0:34413 (local address 127.0.0.1:41252)
0928 06:17:54.483723 (+ 644us) negotiation.cc:107] Waiting for socket to connect
0928 06:17:54.483757 (+ 34us) client_negotiation.cc:174] Beginning negotiation
0928 06:17:54.483985 (+ 228us) client_negotiation.cc:252] Sending NEGOTIATE NegotiatePB request
0928 06:17:54.484281 (+ 296us) negotiation.cc:327] Negotiation complete: Network error: Client connection negotiation failed: client connection to 0.0.0.0:34413: BlockingWrite error: write error: Broken pipe (error 32)
Metrics: {"client-negotiator.queue_time_us":141}
[ OK ] Parameters/TestRpc.TestServerShutsDown/SSL_TCP (14 ms)
[ RUN ] Parameters/TestRpc.TimedOutOnResponseMetric/SSL_TCP
I20260928 06:17:54.515360 15238 acceptor_pool.cc:254] collecting diagnostics on the listening RPC socket 0.0.0.0:41459 every 8 connection(s)
I20260928 06:17:54.516137 15239 acceptor_pool.cc:254] collecting diagnostics on the listening RPC socket 0.0.0.0:41459 every 8 connection(s)
W20260928 06:17:54.751628 15242 rpcz_store.cc:267] Call kudu.rpc_test.CalculatorService.Sleep from 127.0.0.1:40162 (request call id 3) took 50 ms (client timeout 25 ms). Trace:
W20260928 06:17:54.751991 15242 rpcz_store.cc:269] 0928 06:17:54.700973 (+ 0us) service_pool.cc:170] Inserting onto call queue
0928 06:17:54.701068 (+ 95us) service_pool.cc:227] Handling call
0928 06:17:54.751541 (+ 50473us) inbound_call.cc:173] Queueing success response
Related trace 'test_child':
Metrics: {"test_sleep_us":50000,"child_traces":[["test_child",{"related_trace_metric":1}]]}
W20260928 06:17:54.811095 15242 rpcz_store.cc:267] Call kudu.rpc_test.CalculatorService.Sleep from 127.0.0.1:40162 (request call id 4) took 50 ms (client timeout 50 ms). Trace:
W20260928 06:17:54.811398 15242 rpcz_store.cc:269] 0928 06:17:54.760623 (+ 0us) service_pool.cc:170] Inserting onto call queue
0928 06:17:54.760727 (+ 104us) service_pool.cc:227] Handling call
0928 06:17:54.811038 (+ 50311us) inbound_call.cc:173] Queueing success response
Related trace 'test_child':
Metrics: {"test_sleep_us":50000,"child_traces":[["test_child",{"related_trace_metric":1}]]}
[ OK ] Parameters/TestRpc.TimedOutOnResponseMetric/SSL_TCP (332 ms)
[ RUN ] Parameters/TestRpc.AcceptorDispatchingTimesMetric/SSL_TCP
I20260928 06:17:54.832023 15263 acceptor_pool.cc:254] collecting diagnostics on the listening RPC socket 0.0.0.0:33751 every 8 connection(s)
I20260928 06:17:54.832784 15264 acceptor_pool.cc:254] collecting diagnostics on the listening RPC socket 0.0.0.0:33751 every 8 connection(s)
W20260928 06:17:54.839243 15259 negotiation.cc:337] Failed RPC negotiation. Trace:
0928 06:17:54.837175 (+ 0us) reactor.cc:625] Submitting negotiation task for server connection from 127.0.0.1:56896 (local address 127.0.0.1:33751)
0928 06:17:54.837793 (+ 618us) server_negotiation.cc:206] Beginning negotiation
0928 06:17:54.837831 (+ 38us) server_negotiation.cc:399] Waiting for connection header
0928 06:17:54.838299 (+ 468us) negotiation.cc:327] Negotiation complete: Network error: Server connection negotiation failed: server connection from 127.0.0.1:56896: BlockingRecv error: recv got EOF from 127.0.0.1:56896 (error 108)
Metrics: {"server-negotiator.queue_time_us":158}
[ OK ] Parameters/TestRpc.AcceptorDispatchingTimesMetric/SSL_TCP (22 ms)
[ RUN ] Parameters/TestRpc.TestRpcCallbackDestroysMessenger/SSL_TCP
[ OK ] Parameters/TestRpc.TestRpcCallbackDestroysMessenger/SSL_TCP (27 ms)
[ RUN ] Parameters/TestRpc.TestApplicationFeatureFlag/SSL_TCP
I20260928 06:17:54.888851 15288 acceptor_pool.cc:254] collecting diagnostics on the listening RPC socket 0.0.0.0:39415 every 8 connection(s)
I20260928 06:17:54.889613 15289 acceptor_pool.cc:254] collecting diagnostics on the listening RPC socket 0.0.0.0:39415 every 8 connection(s)
W20260928 06:17:54.927896 15286 messenger.cc:357] Unable to handle RPC call: Not implemented: call requires unsupported application feature flags: 99
[ OK ] Parameters/TestRpc.TestApplicationFeatureFlag/SSL_TCP (66 ms)
[ RUN ] Parameters/TestRpc.TestCancellation/SSL_TCP
I20260928 06:17:54.971243 15313 acceptor_pool.cc:254] collecting diagnostics on the listening RPC socket 0.0.0.0:37547 every 8 connection(s)
I20260928 06:17:54.971997 15314 acceptor_pool.cc:254] collecting diagnostics on the listening RPC socket 0.0.0.0:37547 every 8 connection(s)
I20260928 06:17:54.975092 14899 rpc-test.cc:1648] Connecting to 0.0.0.0:37547
I20260928 06:17:55.092727 14899 rpc-test-base.h:595] status: Aborted: Sleep RPC to 0.0.0.0:37547 is cancelled in state READY, seconds elapsed: 0.000402367
I20260928 06:17:55.238469 14899 rpc-test-base.h:595] status: Aborted: Sleep RPC to 0.0.0.0:37547 is cancelled in state SENT, seconds elapsed: 0.000897176
I20260928 06:17:55.283420 15316 rpc-test-base.h:222] got call: sleep_micros: 510000
I20260928 06:17:55.413751 14899 rpc-test-base.h:595] status: Aborted: Sleep RPC to 0.0.0.0:37547 is cancelled in state SENT, seconds elapsed: 0.000940376
I20260928 06:17:55.456444 15315 rpc-test-base.h:222] got call: sleep_micros: 510000
I20260928 06:17:55.575312 14899 rpc-test-base.h:595] status: Aborted: Sleep RPC to 0.0.0.0:37547 is cancelled in state SENT, seconds elapsed: 0.000867733
W20260928 06:17:55.616964 15317 rpcz_store.cc:267] Call kudu.rpc.GenericCalculatorService.Sleep from 127.0.0.1:55864 (request call id 11) took 15 ms (client timeout 10 ms). Trace:
W20260928 06:17:55.617262 15317 rpcz_store.cc:269] 0928 06:17:55.601521 (+ 0us) service_pool.cc:170] Inserting onto call queue
0928 06:17:55.616657 (+ 15136us) service_pool.cc:214] Skipping call since client already timed out
0928 06:17:55.616788 (+ 131us) inbound_call.cc:173] Queueing failure response
Metrics: {}
I20260928 06:17:55.617767 15317 rpc-test-base.h:222] got call: sleep_micros: 1500000
W20260928 06:17:55.794201 15316 rpcz_store.cc:267] Call kudu.rpc.GenericCalculatorService.Sleep from 127.0.0.1:55864 (request call id 3) took 511 ms (client timeout 10 ms). Trace:
W20260928 06:17:55.794566 15316 rpcz_store.cc:269] 0928 06:17:55.283138 (+ 0us) service_pool.cc:170] Inserting onto call queue
0928 06:17:55.283339 (+ 201us) service_pool.cc:227] Handling call
0928 06:17:55.794143 (+510804us) inbound_call.cc:173] Queueing success response
Metrics: {}
W20260928 06:17:55.967025 15315 rpcz_store.cc:267] Call kudu.rpc.GenericCalculatorService.Sleep from 127.0.0.1:55864 (request call id 7) took 510 ms (client timeout 10 ms). Trace:
W20260928 06:17:55.967373 15315 rpcz_store.cc:269] 0928 06:17:55.456220 (+ 0us) service_pool.cc:170] Inserting onto call queue
0928 06:17:55.456388 (+ 168us) service_pool.cc:227] Handling call
0928 06:17:55.966963 (+510575us) inbound_call.cc:173] Queueing success response
Metrics: {}
I20260928 06:17:56.577093 14899 rpc-test-base.h:595] status: Timed out: Sleep RPC to 0.0.0.0:37547 timed out after 1.000s (SENT), seconds elapsed: 1.00141
I20260928 06:17:56.578374 15315 rpc-test-base.h:222] got call: sleep_micros: 1500000
W20260928 06:17:57.118358 15317 rpcz_store.cc:267] Call kudu.rpc.GenericCalculatorService.Sleep from 127.0.0.1:55864 (request call id 12) took 1516 ms (client timeout 1000 ms). Trace:
W20260928 06:17:57.118717 15317 rpcz_store.cc:269] 0928 06:17:55.601901 (+ 0us) service_pool.cc:170] Inserting onto call queue
0928 06:17:55.617727 (+ 15826us) service_pool.cc:227] Handling call
0928 06:17:57.118306 (+1500579us) inbound_call.cc:173] Queueing success response
Metrics: {}
I20260928 06:17:57.579248 14899 rpc-test-base.h:595] status: Timed out: Sleep RPC to 0.0.0.0:37547 timed out after 1.000s (SENT), seconds elapsed: 1.00184
W20260928 06:17:57.580658 15312 messenger.cc:357] Unable to handle RPC call: Not implemented: call requires unsupported application feature flags: 99, 1
W20260928 06:17:57.581985 15312 messenger.cc:357] Unable to handle RPC call: Not implemented: call requires unsupported application feature flags: 99, 1
W20260928 06:17:58.078944 15315 rpcz_store.cc:267] Call kudu.rpc.GenericCalculatorService.Sleep from 127.0.0.1:55864 (request call id 13) took 1500 ms (client timeout 1000 ms). Trace:
W20260928 06:17:58.079310 15315 rpcz_store.cc:269] 0928 06:17:56.578189 (+ 0us) service_pool.cc:170] Inserting onto call queue
0928 06:17:56.578325 (+ 136us) service_pool.cc:227] Handling call
0928 06:17:58.078884 (+1500559us) inbound_call.cc:173] Queueing success response
Metrics: {}
W20260928 06:17:58.079933 15312 connection.cc:441] server connection from 127.0.0.1:55864 torn down before Call kudu.rpc.GenericCalculatorService.Sleep from 127.0.0.1:55864 (request call id 13) could send its response
[ OK ] Parameters/TestRpc.TestCancellation/SSL_TCP (3149 ms)
[ RUN ] Parameters/TestRpc.TestCancellationMultiThreads/SSL_TCP
I20260928 06:17:58.107514 15338 acceptor_pool.cc:254] collecting diagnostics on the listening RPC socket 0.0.0.0:43923 every 8 connection(s)
I20260928 06:17:58.108208 15339 acceptor_pool.cc:254] collecting diagnostics on the listening RPC socket 0.0.0.0:43923 every 8 connection(s)
I20260928 06:17:58.111171 14899 rpc-test.cc:1808] Connecting to 0.0.0.0:43923
I20260928 06:17:58.249456 15352 test_util.cc:268] Using random seed: 117579728
I20260928 06:17:58.250578 15353 test_util.cc:268] Using random seed: 117580856
I20260928 06:17:58.251958 15354 test_util.cc:268] Using random seed: 117582238
I20260928 06:17:58.253296 15355 test_util.cc:268] Using random seed: 117583557
I20260928 06:17:58.254966 15356 test_util.cc:268] Using random seed: 117585078
I20260928 06:17:58.256398 15357 test_util.cc:268] Using random seed: 117586505
I20260928 06:17:58.258042 15358 test_util.cc:268] Using random seed: 117588147
I20260928 06:17:58.259723 15359 test_util.cc:268] Using random seed: 117589860
I20260928 06:17:58.261785 15360 test_util.cc:268] Using random seed: 117591933
I20260928 06:17:58.263568 15361 test_util.cc:268] Using random seed: 117593732
I20260928 06:17:58.265537 15362 test_util.cc:268] Using random seed: 117595226
I20260928 06:17:58.266839 15363 test_util.cc:268] Using random seed: 117596944
I20260928 06:17:58.268463 15364 test_util.cc:268] Using random seed: 117598640
I20260928 06:17:58.270263 15365 test_util.cc:268] Using random seed: 117599860
I20260928 06:17:58.272465 15366 test_util.cc:268] Using random seed: 117602091
I20260928 06:17:58.274075 15367 test_util.cc:268] Using random seed: 117604156
I20260928 06:17:58.280119 15368 test_util.cc:268] Using random seed: 117609830
I20260928 06:17:58.282423 15369 test_util.cc:268] Using random seed: 117612537
I20260928 06:17:58.284684 15370 test_util.cc:268] Using random seed: 117614810
I20260928 06:17:58.286937 15371 test_util.cc:268] Using random seed: 117617009
I20260928 06:17:58.290340 15372 test_util.cc:268] Using random seed: 117620453
I20260928 06:17:58.292554 15373 test_util.cc:268] Using random seed: 117622658
I20260928 06:17:58.300808 15374 test_util.cc:268] Using random seed: 117630895
I20260928 06:17:58.303499 15375 test_util.cc:268] Using random seed: 117633604
I20260928 06:17:58.305778 15376 test_util.cc:268] Using random seed: 117635896
I20260928 06:17:58.315398 15377 test_util.cc:268] Using random seed: 117645479
I20260928 06:17:58.317108 15378 test_util.cc:268] Using random seed: 117647211
I20260928 06:17:58.319278 15379 test_util.cc:268] Using random seed: 117649335
I20260928 06:17:58.327142 15380 test_util.cc:268] Using random seed: 117657291
I20260928 06:17:58.332422 15381 test_util.cc:268] Using random seed: 117662517
[ OK ] Parameters/TestRpc.TestCancellationMultiThreads/SSL_TCP (17744 ms)
[ RUN ] Parameters/TestRpc.TestCallId/SSL_TCP
I20260928 06:18:15.851822 15395 acceptor_pool.cc:254] collecting diagnostics on the listening RPC socket 0.0.0.0:35621 every 8 connection(s)
I20260928 06:18:15.852649 15396 acceptor_pool.cc:254] collecting diagnostics on the listening RPC socket 0.0.0.0:35621 every 8 connection(s)
[ OK ] Parameters/TestRpc.TestCallId/SSL_TCP (78 ms)
[----------] 20 tests from Parameters/TestRpc (37390 ms total)
[----------] Global test environment tear-down
[==========] 21 tests from 2 test suites ran. (37408 ms total)
[ PASSED ] 20 tests.
[ FAILED ] 1 test, listed below:
[ FAILED ] Parameters/TestRpc.TestCallWithChainCertAndRootCA/SSL_TCP, where GetParam() = (true, false)
1 FAILED TEST