Diagnosed failure
Parameters/TestRpc.TestCallWithChainCertAndChainCA/SSL_UnixSocket: /data0/somelongdirectorytoavoidrpathissues/src/kudu/src/kudu/rpc/rpc-test.cc:270: Failure
Failed
Bad status: Runtime error: could not verify certificate chain (error with cert: subject=CN = localhost, ST = sadfjas, C = AS, emailAddress = sdflkdsajf, O = lskdfjlsad, OU = sldfkja, issuer=C = AS, ST = ASDfkjdhf, L = lskdjf, O = saldfja, OU = skdjf, CN = localhost, emailAddress = sadjflkadsj): : certificate has expired
Google Test trace:
/data0/somelongdirectorytoavoidrpathissues/src/kudu/src/kudu/rpc/rpc-test.cc:267: Connecting to unix:/tmp/dist-test-taskbyjd48/test-tmp/rpc-test-32616873693449f78da82e5acf7a65b2.sock
I20260929 11:24:01.164139 379 test_util.cc:175] -----------------------------------------------
I20260929 11:24:01.164237 379 test_util.cc:176] Had fatal failures, leaving test files at /tmp/dist-test-taskbyjd48/test-tmp/rpc-test.6.Parameters_TestRpc.TestCallWithChainCertAndChainCA_SSL_UnixSocket.1790681041022731-379-0
Full log
Note: This is test shard 7 of 8.
[==========] Running 21 tests from 2 test suites.
[----------] Global test environment set-up.
[----------] 20 tests from Parameters/TestRpc
[ RUN ] Parameters/TestRpc.TestMessengerCreateDestroy/SSL_UnixSocket
WARNING: Logging before InitGoogleLogging() is written to STDERR
I20260929 11:24:01.079108 379 rpc-test.cc:169] started messenger TestCreateDestroy
[ OK ] Parameters/TestRpc.TestMessengerCreateDestroy/SSL_UnixSocket (38 ms)
[ RUN ] Parameters/TestRpc.TestNegotiationDeadlock/SSL_UnixSocket
I20260929 11:24:01.095052 399 acceptor_pool.cc:254] collecting diagnostics on the listening RPC socket unix:/tmp/dist-test-taskbyjd48/test-tmp/rpc-test-d372a3ebfda24c5e8b405520d4b044db.sock every 8 connection(s)
I20260929 11:24:01.095376 400 acceptor_pool.cc:254] collecting diagnostics on the listening RPC socket unix:/tmp/dist-test-taskbyjd48/test-tmp/rpc-test-d372a3ebfda24c5e8b405520d4b044db.sock every 8 connection(s)
[ OK ] Parameters/TestRpc.TestNegotiationDeadlock/SSL_UnixSocket (33 ms)
[ RUN ] Parameters/TestRpc.TestCallWithChainCertAndChainCA/SSL_UnixSocket
I20260929 11:24:01.151473 415 acceptor_pool.cc:254] collecting diagnostics on the listening RPC socket unix:/tmp/dist-test-taskbyjd48/test-tmp/rpc-test-32616873693449f78da82e5acf7a65b2.sock every 8 connection(s)
I20260929 11:24:01.151829 416 acceptor_pool.cc:254] collecting diagnostics on the listening RPC socket unix:/tmp/dist-test-taskbyjd48/test-tmp/rpc-test-32616873693449f78da82e5acf7a65b2.sock every 8 connection(s)
/data0/somelongdirectorytoavoidrpathissues/src/kudu/src/kudu/rpc/rpc-test.cc:270: Failure
Failed
Bad status: Runtime error: could not verify certificate chain (error with cert: subject=CN = localhost, ST = sadfjas, C = AS, emailAddress = sdflkdsajf, O = lskdfjlsad, OU = sldfkja, issuer=C = AS, ST = ASDfkjdhf, L = lskdjf, O = saldfja, OU = skdjf, CN = localhost, emailAddress = sadjflkadsj): : certificate has expired
Google Test trace:
/data0/somelongdirectorytoavoidrpathissues/src/kudu/src/kudu/rpc/rpc-test.cc:267: Connecting to unix:/tmp/dist-test-taskbyjd48/test-tmp/rpc-test-32616873693449f78da82e5acf7a65b2.sock
I20260929 11:24:01.164139 379 test_util.cc:175] -----------------------------------------------
I20260929 11:24:01.164237 379 test_util.cc:176] Had fatal failures, leaving test files at /tmp/dist-test-taskbyjd48/test-tmp/rpc-test.6.Parameters_TestRpc.TestCallWithChainCertAndChainCA_SSL_UnixSocket.1790681041022731-379-0
[ FAILED ] Parameters/TestRpc.TestCallWithChainCertAndChainCA/SSL_UnixSocket, where GetParam() = (true, true) (47 ms)
[ RUN ] Parameters/TestRpc.TestCallWithPasswordProtectedKey/SSL_UnixSocket
I20260929 11:24:01.182214 440 acceptor_pool.cc:254] collecting diagnostics on the listening RPC socket unix:/tmp/dist-test-taskbyjd48/test-tmp/rpc-test-48bc6527a5ea4b4badd7b1dea9e055a2.sock every 8 connection(s)
I20260929 11:24:01.182520 441 acceptor_pool.cc:254] collecting diagnostics on the listening RPC socket unix:/tmp/dist-test-taskbyjd48/test-tmp/rpc-test-48bc6527a5ea4b4badd7b1dea9e055a2.sock every 8 connection(s)
W20260929 11:24:01.214535 437 connection.cc:196] Error closing socket: Network error: TlsSocket::Close: Broken pipe
[ OK ] Parameters/TestRpc.TestCallWithPasswordProtectedKey/SSL_UnixSocket (54 ms)
[ RUN ] Parameters/TestRpc.TestCallToBadServer/SSL_UnixSocket
I20260929 11:24:01.235891 379 rpc-test.cc:394] Status: Network error: Client connection negotiation failed: client connection to 0.0.0.0:0: connect: Connection refused (error 111)
I20260929 11:24:01.236618 379 rpc-test.cc:394] Status: Network error: Client connection negotiation failed: client connection to 0.0.0.0:0: connect: Connection refused (error 111)
I20260929 11:24:01.237277 379 rpc-test.cc:394] Status: Network error: Client connection negotiation failed: client connection to 0.0.0.0:0: connect: Connection refused (error 111)
I20260929 11:24:01.237905 379 rpc-test.cc:394] Status: Network error: Client connection negotiation failed: client connection to 0.0.0.0:0: connect: Connection refused (error 111)
I20260929 11:24:01.238517 379 rpc-test.cc:394] Status: Network error: Client connection negotiation failed: client connection to 0.0.0.0:0: connect: Connection refused (error 111)
[ OK ] Parameters/TestRpc.TestCallToBadServer/SSL_UnixSocket (21 ms)
[ RUN ] Parameters/TestRpc.TestWrongService/SSL_UnixSocket
I20260929 11:24:01.257382 475 acceptor_pool.cc:254] collecting diagnostics on the listening RPC socket unix:/tmp/dist-test-taskbyjd48/test-tmp/rpc-test-7a6c61edb8c4443aa5bb82cd583ffee8.sock every 8 connection(s)
I20260929 11:24:01.257627 476 acceptor_pool.cc:254] collecting diagnostics on the listening RPC socket unix:/tmp/dist-test-taskbyjd48/test-tmp/rpc-test-7a6c61edb8c4443aa5bb82cd583ffee8.sock every 8 connection(s)
I20260929 11:24:01.275700 472 messenger.cc:345] service WrongServiceName not registered on TestServer
[ OK ] Parameters/TestRpc.TestWrongService/SSL_UnixSocket (39 ms)
[ RUN ] Parameters/TestRpc.TestConnectionKeepalive/SSL_UnixSocket
I20260929 11:24:01.307156 498 acceptor_pool.cc:254] collecting diagnostics on the listening RPC socket unix:/tmp/dist-test-taskbyjd48/test-tmp/rpc-test-c8c47adf9fdd4732b54b11d964153451.sock every 8 connection(s)
I20260929 11:24:01.307418 499 acceptor_pool.cc:254] collecting diagnostics on the listening RPC socket unix:/tmp/dist-test-taskbyjd48/test-tmp/rpc-test-c8c47adf9fdd4732b54b11d964153451.sock every 8 connection(s)
I20260929 11:24:01.308353 379 rpc-test.cc:488] Connecting to unix:/tmp/dist-test-taskbyjd48/test-tmp/rpc-test-c8c47adf9fdd4732b54b11d964153451.sock
W20260929 11:24:01.783437 511 connection.cc:196] Error closing socket: Network error: TlsSocket::Close: Broken pipe
[ OK ] Parameters/TestRpc.TestConnectionKeepalive/SSL_UnixSocket (1057 ms)
[ RUN ] Parameters/TestRpc.TestClientConnectionMetrics/SSL_UnixSocket
I20260929 11:24:02.358237 523 acceptor_pool.cc:254] collecting diagnostics on the listening RPC socket unix:/tmp/dist-test-taskbyjd48/test-tmp/rpc-test-7780906141cc4824a368184d1d43c052.sock every 8 connection(s)
I20260929 11:24:02.358536 524 acceptor_pool.cc:254] collecting diagnostics on the listening RPC socket unix:/tmp/dist-test-taskbyjd48/test-tmp/rpc-test-7780906141cc4824a368184d1d43c052.sock every 8 connection(s)
I20260929 11:24:02.359609 379 rpc-test.cc:569] Connecting to unix:/tmp/dist-test-taskbyjd48/test-tmp/rpc-test-7780906141cc4824a368184d1d43c052.sock
W20260929 11:24:24.326159 520 connection.cc:196] Error closing socket: Network error: TlsSocket::Close: Broken pipe
[ OK ] Parameters/TestRpc.TestClientConnectionMetrics/SSL_UnixSocket (21993 ms)
[ RUN ] Parameters/TestRpc.TestCredentialsPolicy/SSL_UnixSocket
I20260929 11:24:24.361263 546 acceptor_pool.cc:254] collecting diagnostics on the listening RPC socket unix:/tmp/dist-test-taskbyjd48/test-tmp/rpc-test-c4a58c21b90647fba90f21b8c7d5c9be.sock every 8 connection(s)
I20260929 11:24:24.361503 547 acceptor_pool.cc:254] collecting diagnostics on the listening RPC socket unix:/tmp/dist-test-taskbyjd48/test-tmp/rpc-test-c4a58c21b90647fba90f21b8c7d5c9be.sock every 8 connection(s)
I20260929 11:24:24.362474 379 rpc-test.cc:700] Connecting to unix:/tmp/dist-test-taskbyjd48/test-tmp/rpc-test-c4a58c21b90647fba90f21b8c7d5c9be.sock
W20260929 11:24:24.382565 545 connection.cc:196] Error closing socket: Network error: TlsSocket::Close: Broken pipe
W20260929 11:24:24.391249 545 connection.cc:196] Error closing socket: Network error: TlsSocket::Close: Broken pipe
[ OK ] Parameters/TestRpc.TestCredentialsPolicy/SSL_UnixSocket (61 ms)
[ RUN ] Parameters/TestRpc.TestCallLongerThanKeepalive/SSL_UnixSocket
I20260929 11:24:24.410820 571 acceptor_pool.cc:254] collecting diagnostics on the listening RPC socket unix:/tmp/dist-test-taskbyjd48/test-tmp/rpc-test-01c3350047df4a3da401c0f10e89b0ca.sock every 8 connection(s)
I20260929 11:24:24.411058 572 acceptor_pool.cc:254] collecting diagnostics on the listening RPC socket unix:/tmp/dist-test-taskbyjd48/test-tmp/rpc-test-01c3350047df4a3da401c0f10e89b0ca.sock every 8 connection(s)
I20260929 11:24:24.444996 575 rpc-test-base.h:222] got call: sleep_micros: 3000000 deferred: true
I20260929 11:24:27.446744 575 rpcz_store.cc:275] Call kudu.rpc.GenericCalculatorService.Sleep from unix:<unnamed> (request call id 0) took 3001 ms. Trace:
I20260929 11:24:27.446991 575 rpcz_store.cc:276] 0929 11:24:24.444900 (+ 0us) service_pool.cc:170] Inserting onto call queue
0929 11:24:24.444955 (+ 55us) service_pool.cc:227] Handling call
0929 11:24:27.446701 (+3001746us) inbound_call.cc:173] Queueing success response
Metrics: {}
[ OK ] Parameters/TestRpc.TestCallLongerThanKeepalive/SSL_UnixSocket (3059 ms)
[ RUN ] Parameters/TestRpc.TestRpcSidecar/SSL_UnixSocket
I20260929 11:24:27.475602 596 acceptor_pool.cc:254] collecting diagnostics on the listening RPC socket unix:/tmp/dist-test-taskbyjd48/test-tmp/rpc-test-4d66fabff929493e855790f724b45083.sock every 8 connection(s)
I20260929 11:24:27.475811 597 acceptor_pool.cc:254] collecting diagnostics on the listening RPC socket unix:/tmp/dist-test-taskbyjd48/test-tmp/rpc-test-4d66fabff929493e855790f724b45083.sock every 8 connection(s)
W20260929 11:24:27.566246 593 connection.cc:196] Error closing socket: Network error: TlsSocket::Close: Broken pipe
[ OK ] Parameters/TestRpc.TestRpcSidecar/SSL_UnixSocket (116 ms)
[ RUN ] Parameters/TestRpc.TestRpcSidecarLimits/SSL_UnixSocket
I20260929 11:24:29.799042 621 acceptor_pool.cc:254] collecting diagnostics on the listening RPC socket unix:/tmp/dist-test-taskbyjd48/test-tmp/rpc-test-2decb1fce4c5478f82ca8673ce9c2612.sock every 8 connection(s)
I20260929 11:24:29.799415 622 acceptor_pool.cc:254] collecting diagnostics on the listening RPC socket unix:/tmp/dist-test-taskbyjd48/test-tmp/rpc-test-2decb1fce4c5478f82ca8673ce9c2612.sock every 8 connection(s)
W20260929 11:24:29.814877 379 serialization.cc:72] Serialized kudu.rpc_test.PushStringsRequestPB (2147483654 bytes) is larger than the maximum configured RPC message size (52428800 bytes). Sending anyway, but peer may reject the data.
W20260929 11:24:29.821306 618 connection.cc:535] server connection from unix:<unnamed> recv error: Network error: RPC frame had a length of 2147483714, but we only support messages up to 52428800 bytes long.
W20260929 11:24:29.821434 618 connection.cc:158] shutting down server connection from unix:<unnamed> with pending inbound data: 4/2147483714 bytes received; last active 0 ns ago: status Network error: RPC frame had a length of 2147483714, but we only support messages up to 52428800 bytes long.
W20260929 11:24:29.822052 634 connection.cc:196] Error closing socket: Network error: TlsSocket::Close: Broken pipe
I20260929 11:24:29.838374 646 acceptor_pool.cc:254] collecting diagnostics on the listening RPC socket unix:/tmp/dist-test-taskbyjd48/test-tmp/rpc-test-2decb1fce4c5478f82ca8673ce9c2612.sock every 8 connection(s)
I20260929 11:24:29.838548 647 acceptor_pool.cc:254] collecting diagnostics on the listening RPC socket unix:/tmp/dist-test-taskbyjd48/test-tmp/rpc-test-2decb1fce4c5478f82ca8673ce9c2612.sock every 8 connection(s)
W20260929 11:24:35.592048 643 connection.cc:577] server connection from unix:<unnamed>: received bad data: 'Corruption: Invalid packet: message had a length of 2147483710, but we only support messages up to 2147483647 bytes
'
W20260929 11:24:35.592682 659 connection.cc:196] Error closing socket: Network error: TlsSocket::Close: Broken pipe
[ OK ] Parameters/TestRpc.TestRpcSidecarLimits/SSL_UnixSocket (8486 ms)
[ RUN ] Parameters/TestRpc.TestCallTimeoutDoesntAffectNegotiation/SSL_UnixSocket
I20260929 11:24:36.065310 671 acceptor_pool.cc:254] collecting diagnostics on the listening RPC socket unix:/tmp/dist-test-taskbyjd48/test-tmp/rpc-test-1234932c9b7045e9a2acfe1bdb4c77bc.sock every 8 connection(s)
I20260929 11:24:36.065595 672 acceptor_pool.cc:254] collecting diagnostics on the listening RPC socket unix:/tmp/dist-test-taskbyjd48/test-tmp/rpc-test-1234932c9b7045e9a2acfe1bdb4c77bc.sock every 8 connection(s)
W20260929 11:24:36.079600 667 negotiation.cc:266] Injecting 500ms delay in negotiation
I20260929 11:24:36.130053 379 rpc-test-base.h:595] status: Timed out: connection negotiation to unix:/tmp/dist-test-taskbyjd48/test-tmp/rpc-test-1234932c9b7045e9a2acfe1bdb4c77bc.sock for RPC Sleep timed out after 0.050s (ON_OUTBOUND_QUEUE), seconds elapsed: 0.0510306
W20260929 11:24:36.586851 668 connection.cc:196] Error closing socket: Network error: TlsSocket::Close: Broken pipe
[ OK ] Parameters/TestRpc.TestCallTimeoutDoesntAffectNegotiation/SSL_UnixSocket (532 ms)
[ RUN ] Parameters/TestRpc.TestRpcHandlerLatencyMetric/SSL_UnixSocket
I20260929 11:24:36.606772 696 acceptor_pool.cc:254] collecting diagnostics on the listening RPC socket unix:/tmp/dist-test-taskbyjd48/test-tmp/rpc-test-7ccdb271658f42d5b4bc669874f83422.sock every 8 connection(s)
I20260929 11:24:36.606952 697 acceptor_pool.cc:254] collecting diagnostics on the listening RPC socket unix:/tmp/dist-test-taskbyjd48/test-tmp/rpc-test-7ccdb271658f42d5b4bc669874f83422.sock every 8 connection(s)
I20260929 11:24:36.650053 379 rpc-test.cc:1236] Sleep() min lat: 20675
I20260929 11:24:36.650162 379 rpc-test.cc:1237] Sleep() mean lat: 20675
I20260929 11:24:36.650204 379 rpc-test.cc:1238] Sleep() max lat: 20675
I20260929 11:24:36.650223 379 rpc-test.cc:1239] Sleep() #calls: 1
W20260929 11:24:36.651523 693 connection.cc:196] Error closing socket: Network error: TlsSocket::Close: Broken pipe
[ OK ] Parameters/TestRpc.TestRpcHandlerLatencyMetric/SSL_UnixSocket (65 ms)
[ RUN ] Parameters/TestRpc.TimedOutOnResponseMetricServiceQueue/SSL_UnixSocket
I20260929 11:24:36.669239 722 acceptor_pool.cc:254] collecting diagnostics on the listening RPC socket unix:/tmp/dist-test-taskbyjd48/test-tmp/rpc-test-4a98b185bcde4bb39160407605c9d377.sock every 8 connection(s)
I20260929 11:24:36.669499 723 acceptor_pool.cc:254] collecting diagnostics on the listening RPC socket unix:/tmp/dist-test-taskbyjd48/test-tmp/rpc-test-4a98b185bcde4bb39160407605c9d377.sock every 8 connection(s)
W20260929 11:24:36.729851 724 rpcz_store.cc:267] Call kudu.rpc_test.CalculatorService.Sleep from unix:<unnamed> (request call id 2) took 20 ms (client timeout 20 ms). Trace:
W20260929 11:24:36.730131 724 rpcz_store.cc:269] 0929 11:24:36.709307 (+ 0us) service_pool.cc:170] Inserting onto call queue
0929 11:24:36.729696 (+ 20389us) service_pool.cc:214] Skipping call since client already timed out
0929 11:24:36.729826 (+ 130us) inbound_call.cc:173] Queueing failure response
Metrics: {}
[ OK ] Parameters/TestRpc.TimedOutOnResponseMetricServiceQueue/SSL_UnixSocket (79 ms)
[ RUN ] Parameters/TestRpc.RpcPendingConnectionsMetric/SSL_UnixSocket
I20260929 11:24:36.739856 745 acceptor_pool.cc:254] collecting diagnostics on the listening RPC socket 0.0.0.0:38905 every 8 connection(s)
I20260929 11:24:36.740097 746 acceptor_pool.cc:254] collecting diagnostics on the listening RPC socket 0.0.0.0:38905 every 8 connection(s)
W20260929 11:24:36.750846 741 negotiation.cc:337] Failed RPC negotiation. Trace:
0929 11:24:36.749944 (+ 0us) reactor.cc:625] Submitting negotiation task for server connection from 127.0.0.1:54552 (local address 127.0.0.1:38905)
0929 11:24:36.750245 (+ 301us) server_negotiation.cc:206] Beginning negotiation
0929 11:24:36.750250 (+ 5us) server_negotiation.cc:399] Waiting for connection header
0929 11:24:36.750404 (+ 154us) negotiation.cc:327] Negotiation complete: Network error: Server connection negotiation failed: server connection from 127.0.0.1:54552: BlockingRecv error: recv got EOF from 127.0.0.1:54552 (error 108)
Metrics: {"server-negotiator.queue_time_us":151}
[ OK ] Parameters/TestRpc.RpcPendingConnectionsMetric/SSL_UnixSocket (28 ms)
[ RUN ] Parameters/TestRpc.TestRpcContextClientDeadline/SSL_UnixSocket
I20260929 11:24:36.782817 761 acceptor_pool.cc:254] collecting diagnostics on the listening RPC socket unix:/tmp/dist-test-taskbyjd48/test-tmp/rpc-test-ef28d94281cb451aad4551e54dedd6d9.sock every 8 connection(s)
I20260929 11:24:36.783067 762 acceptor_pool.cc:254] collecting diagnostics on the listening RPC socket unix:/tmp/dist-test-taskbyjd48/test-tmp/rpc-test-ef28d94281cb451aad4551e54dedd6d9.sock every 8 connection(s)
W20260929 11:24:36.822866 758 connection.cc:196] Error closing socket: Network error: TlsSocket::Close: Broken pipe
[ OK ] Parameters/TestRpc.TestRpcContextClientDeadline/SSL_UnixSocket (62 ms)
[ RUN ] Parameters/TestRpc.TestApplicationFeatureFlagUnsupportedServer/SSL_UnixSocket
I20260929 11:24:36.871764 786 acceptor_pool.cc:254] collecting diagnostics on the listening RPC socket unix:/tmp/dist-test-taskbyjd48/test-tmp/rpc-test-7a975dbf5d70478aadc57af704fbd075.sock every 8 connection(s)
I20260929 11:24:36.871974 787 acceptor_pool.cc:254] collecting diagnostics on the listening RPC socket unix:/tmp/dist-test-taskbyjd48/test-tmp/rpc-test-7a975dbf5d70478aadc57af704fbd075.sock every 8 connection(s)
[ OK ] Parameters/TestRpc.TestApplicationFeatureFlagUnsupportedServer/SSL_UnixSocket (74 ms)
[ RUN ] Parameters/TestRpc.TestCancellationAsync/SSL_UnixSocket
I20260929 11:24:36.924587 811 acceptor_pool.cc:254] collecting diagnostics on the listening RPC socket unix:/tmp/dist-test-taskbyjd48/test-tmp/rpc-test-3e59b554932743dfa8604dd45b4cffd5.sock every 8 connection(s)
I20260929 11:24:36.924808 812 acceptor_pool.cc:254] collecting diagnostics on the listening RPC socket unix:/tmp/dist-test-taskbyjd48/test-tmp/rpc-test-3e59b554932743dfa8604dd45b4cffd5.sock every 8 connection(s)
I20260929 11:24:36.925897 379 rpc-test.cc:1716] Connecting to unix:/tmp/dist-test-taskbyjd48/test-tmp/rpc-test-3e59b554932743dfa8604dd45b4cffd5.sock
I20260929 11:24:36.943547 379 test_util.cc:268] Using random seed: 1837058729
I20260929 11:24:36.989549 815 rpc-test-base.h:240] got call: sleep_micros: 500 pattern: 4294967295 num_repetitions: 2097152 sidecar_idx: 0
I20260929 11:24:37.022491 815 rpc-test-base.h:240] got call: sleep_micros: 500 pattern: 4294967295 num_repetitions: 2097152 sidecar_idx: 0
I20260929 11:24:37.055747 815 rpc-test-base.h:240] got call: sleep_micros: 500 pattern: 4294967295 num_repetitions: 2097152 sidecar_idx: 0
I20260929 11:24:37.089581 815 rpc-test-base.h:240] got call: sleep_micros: 500 pattern: 4294967295 num_repetitions: 2097152 sidecar_idx: 0
I20260929 11:24:37.117430 814 rpc-test-base.h:240] got call: sleep_micros: 500 pattern: 4294967295 num_repetitions: 2097152 sidecar_idx: 0
I20260929 11:24:37.147684 815 rpc-test-base.h:240] got call: sleep_micros: 500 pattern: 4294967295 num_repetitions: 2097152 sidecar_idx: 0
W20260929 11:24:37.149961 808 connection.cc:196] Error closing socket: Network error: TlsSocket::Close: Broken pipe
W20260929 11:24:37.165407 808 connection.cc:441] server connection from unix:<unnamed> torn down before Call kudu.rpc.GenericCalculatorService.SleepWithSidecar from unix:<unnamed> (request call id 8) could send its response
W20260929 11:24:37.180814 808 connection.cc:441] server connection from unix:<unnamed> torn down before Call kudu.rpc.GenericCalculatorService.SleepWithSidecar from unix:<unnamed> (request call id 9) could send its response
[ OK ] Parameters/TestRpc.TestCancellationAsync/SSL_UnixSocket (283 ms)
[ RUN ] Parameters/TestRpc.TestPerformanceBySocketType/SSL_UnixSocket
I20260929 11:24:37.212141 836 acceptor_pool.cc:254] collecting diagnostics on the listening RPC socket unix:/tmp/dist-test-taskbyjd48/test-tmp/rpc-test-a802bec07a054f0ab07d3726e7457c8a.sock every 8 connection(s)
I20260929 11:24:37.212355 837 acceptor_pool.cc:254] collecting diagnostics on the listening RPC socket unix:/tmp/dist-test-taskbyjd48/test-tmp/rpc-test-a802bec07a054f0ab07d3726e7457c8a.sock every 8 connection(s)
I20260929 11:24:37.213294 379 rpc-test.cc:1846] Connecting to unix:/tmp/dist-test-taskbyjd48/test-tmp/rpc-test-a802bec07a054f0ab07d3726e7457c8a.sock
I20260929 11:24:40.536391 379 rpc-test.cc:1859] Sending 1024MB via ssl-enabled unix socket: real 3.299s user 3.250s sys 2.357s
I20260929 11:24:43.628424 379 rpc-test.cc:1859] Sending 1024MB via ssl-enabled unix socket: real 3.092s user 3.085s sys 2.137s
I20260929 11:24:46.965489 379 rpc-test.cc:1859] Sending 1024MB via ssl-enabled unix socket: real 3.337s user 3.179s sys 2.408s
I20260929 11:24:50.358109 379 rpc-test.cc:1859] Sending 1024MB via ssl-enabled unix socket: real 3.392s user 3.195s sys 2.484s
I20260929 11:24:53.947316 379 rpc-test.cc:1859] Sending 1024MB via ssl-enabled unix socket: real 3.589s user 3.481s sys 2.547s
W20260929 11:24:53.948700 833 connection.cc:196] Error closing socket: Network error: TlsSocket::Close: Broken pipe
[ OK ] Parameters/TestRpc.TestPerformanceBySocketType/SSL_UnixSocket (16773 ms)
[----------] 20 tests from Parameters/TestRpc (52914 ms total)
[----------] 1 test from Parameters/TestRpcSocketTxRxQueue
[ RUN ] Parameters/TestRpcSocketTxRxQueue.AcceptorRxQueueSizeMetric/0
I20260929 11:24:53.962961 861 acceptor_pool.cc:254] collecting diagnostics on the listening RPC socket 0.0.0.0:39385 every 1 connection(s)
I20260929 11:24:53.963244 862 acceptor_pool.cc:254] collecting diagnostics on the listening RPC socket 0.0.0.0:39385 every 1 connection(s)
W20260929 11:24:53.965353 857 negotiation.cc:337] Failed RPC negotiation. Trace:
0929 11:24:53.964639 (+ 0us) reactor.cc:625] Submitting negotiation task for server connection from 127.0.0.1:42148 (local address 127.0.0.1:39385)
0929 11:24:53.964934 (+ 295us) server_negotiation.cc:206] Beginning negotiation
0929 11:24:53.964940 (+ 6us) server_negotiation.cc:399] Waiting for connection header
0929 11:24:53.965170 (+ 230us) negotiation.cc:327] Negotiation complete: Network error: Server connection negotiation failed: server connection from 127.0.0.1:42148: BlockingRecv error: recv got EOF from 127.0.0.1:42148 (error 108)
Metrics: {"server-negotiator.queue_time_us":118}
[ OK ] Parameters/TestRpcSocketTxRxQueue.AcceptorRxQueueSizeMetric/0 (12 ms)
[----------] 1 test from Parameters/TestRpcSocketTxRxQueue (12 ms total)
[----------] Global test environment tear-down
[==========] 21 tests from 2 test suites ran. (52926 ms total)
[ PASSED ] 20 tests.
[ FAILED ] 1 test, listed below:
[ FAILED ] Parameters/TestRpc.TestCallWithChainCertAndChainCA/SSL_UnixSocket, where GetParam() = (true, true)
1 FAILED TEST