Diagnosed failure
Parameters/TestRpc.TestCallWithChainCertAndChainCA/SSL_TCP: /data0/somelongdirectorytoavoidrpathissues/src/kudu/src/kudu/rpc/rpc-test.cc:270: Failure
Failed
Bad status: Runtime error: could not verify certificate chain (error with cert: subject=CN = localhost, ST = sadfjas, C = AS, emailAddress = sdflkdsajf, O = lskdfjlsad, OU = sldfkja, issuer=C = AS, ST = ASDfkjdhf, L = lskdjf, O = saldfja, OU = skdjf, CN = localhost, emailAddress = sadjflkadsj): : certificate has expired
Google Test trace:
/data0/somelongdirectorytoavoidrpathissues/src/kudu/src/kudu/rpc/rpc-test.cc:267: Connecting to 0.0.0.0:43911
I20260927 06:54:23.850634 379 test_util.cc:175] -----------------------------------------------
I20260927 06:54:23.850732 379 test_util.cc:176] Had fatal failures, leaving test files at /tmp/dist-test-taskKHbXHa/test-tmp/rpc-test.5.Parameters_TestRpc.TestCallWithChainCertAndChainCA_SSL_TCP.1790492063722881-379-0
Full log
Note: This is test shard 6 of 8.
[==========] Running 21 tests from 2 test suites.
[----------] Global test environment set-up.
[----------] 20 tests from Parameters/TestRpc
[ RUN ] Parameters/TestRpc.TestMessengerCreateDestroy/SSL_TCP
WARNING: Logging before InitGoogleLogging() is written to STDERR
I20260927 06:54:23.762089 379 rpc-test.cc:169] started messenger TestCreateDestroy
[ OK ] Parameters/TestRpc.TestMessengerCreateDestroy/SSL_TCP (22 ms)
[ RUN ] Parameters/TestRpc.TestNegotiationDeadlock/SSL_TCP
I20260927 06:54:23.797260 399 acceptor_pool.cc:254] collecting diagnostics on the listening RPC socket 0.0.0.0:33131 every 8 connection(s)
I20260927 06:54:23.797485 400 acceptor_pool.cc:254] collecting diagnostics on the listening RPC socket 0.0.0.0:33131 every 8 connection(s)
[ OK ] Parameters/TestRpc.TestNegotiationDeadlock/SSL_TCP (53 ms)
[ RUN ] Parameters/TestRpc.TestCallWithChainCertAndChainCA/SSL_TCP
I20260927 06:54:23.838977 415 acceptor_pool.cc:254] collecting diagnostics on the listening RPC socket 0.0.0.0:43911 every 8 connection(s)
I20260927 06:54:23.839330 416 acceptor_pool.cc:254] collecting diagnostics on the listening RPC socket 0.0.0.0:43911 every 8 connection(s)
/data0/somelongdirectorytoavoidrpathissues/src/kudu/src/kudu/rpc/rpc-test.cc:270: Failure
Failed
Bad status: Runtime error: could not verify certificate chain (error with cert: subject=CN = localhost, ST = sadfjas, C = AS, emailAddress = sdflkdsajf, O = lskdfjlsad, OU = sldfkja, issuer=C = AS, ST = ASDfkjdhf, L = lskdjf, O = saldfja, OU = skdjf, CN = localhost, emailAddress = sadjflkadsj): : certificate has expired
Google Test trace:
/data0/somelongdirectorytoavoidrpathissues/src/kudu/src/kudu/rpc/rpc-test.cc:267: Connecting to 0.0.0.0:43911
I20260927 06:54:23.850634 379 test_util.cc:175] -----------------------------------------------
I20260927 06:54:23.850732 379 test_util.cc:176] Had fatal failures, leaving test files at /tmp/dist-test-taskKHbXHa/test-tmp/rpc-test.5.Parameters_TestRpc.TestCallWithChainCertAndChainCA_SSL_TCP.1790492063722881-379-0
[ FAILED ] Parameters/TestRpc.TestCallWithChainCertAndChainCA/SSL_TCP, where GetParam() = (true, false) (31 ms)
[ RUN ] Parameters/TestRpc.TestCallWithPasswordProtectedKey/SSL_TCP
I20260927 06:54:23.862649 440 acceptor_pool.cc:254] collecting diagnostics on the listening RPC socket 0.0.0.0:35521 every 8 connection(s)
I20260927 06:54:23.862875 441 acceptor_pool.cc:254] collecting diagnostics on the listening RPC socket 0.0.0.0:35521 every 8 connection(s)
[ OK ] Parameters/TestRpc.TestCallWithPasswordProtectedKey/SSL_TCP (47 ms)
[ RUN ] Parameters/TestRpc.TestCallToBadServer/SSL_TCP
I20260927 06:54:23.919664 379 rpc-test.cc:394] Status: Network error: Client connection negotiation failed: client connection to 0.0.0.0:0: connect: Connection refused (error 111)
I20260927 06:54:23.920418 379 rpc-test.cc:394] Status: Network error: Client connection negotiation failed: client connection to 0.0.0.0:0: connect: Connection refused (error 111)
I20260927 06:54:23.921005 379 rpc-test.cc:394] Status: Network error: Client connection negotiation failed: client connection to 0.0.0.0:0: connect: Connection refused (error 111)
I20260927 06:54:23.921520 379 rpc-test.cc:394] Status: Network error: Client connection negotiation failed: client connection to 0.0.0.0:0: connect: Connection refused (error 111)
I20260927 06:54:23.922021 379 rpc-test.cc:394] Status: Network error: Client connection negotiation failed: client connection to 0.0.0.0:0: connect: Connection refused (error 111)
[ OK ] Parameters/TestRpc.TestCallToBadServer/SSL_TCP (25 ms)
[ RUN ] Parameters/TestRpc.TestWrongService/SSL_TCP
I20260927 06:54:23.932825 475 acceptor_pool.cc:254] collecting diagnostics on the listening RPC socket 0.0.0.0:41111 every 8 connection(s)
I20260927 06:54:23.933117 476 acceptor_pool.cc:254] collecting diagnostics on the listening RPC socket 0.0.0.0:41111 every 8 connection(s)
I20260927 06:54:23.949744 474 messenger.cc:345] service WrongServiceName not registered on TestServer
[ OK ] Parameters/TestRpc.TestWrongService/SSL_TCP (31 ms)
[ RUN ] Parameters/TestRpc.TestConnectionKeepalive/SSL_TCP
I20260927 06:54:23.964540 498 acceptor_pool.cc:254] collecting diagnostics on the listening RPC socket 0.0.0.0:43421 every 8 connection(s)
I20260927 06:54:23.964799 499 acceptor_pool.cc:254] collecting diagnostics on the listening RPC socket 0.0.0.0:43421 every 8 connection(s)
I20260927 06:54:23.965736 379 rpc-test.cc:488] Connecting to 0.0.0.0:43421
[ OK ] Parameters/TestRpc.TestConnectionKeepalive/SSL_TCP (1043 ms)
[ RUN ] Parameters/TestRpc.TestClientConnectionMetrics/SSL_TCP
I20260927 06:54:25.013622 523 acceptor_pool.cc:254] collecting diagnostics on the listening RPC socket 0.0.0.0:40651 every 8 connection(s)
I20260927 06:54:25.013839 524 acceptor_pool.cc:254] collecting diagnostics on the listening RPC socket 0.0.0.0:40651 every 8 connection(s)
I20260927 06:54:25.014803 379 rpc-test.cc:569] Connecting to 0.0.0.0:40651
[ OK ] Parameters/TestRpc.TestClientConnectionMetrics/SSL_TCP (20600 ms)
[ RUN ] Parameters/TestRpc.TestCredentialsPolicy/SSL_TCP
I20260927 06:54:45.620886 546 acceptor_pool.cc:254] collecting diagnostics on the listening RPC socket 0.0.0.0:43851 every 8 connection(s)
I20260927 06:54:45.621126 547 acceptor_pool.cc:254] collecting diagnostics on the listening RPC socket 0.0.0.0:43851 every 8 connection(s)
I20260927 06:54:45.622082 379 rpc-test.cc:700] Connecting to 0.0.0.0:43851
[ OK ] Parameters/TestRpc.TestCredentialsPolicy/SSL_TCP (54 ms)
[ RUN ] Parameters/TestRpc.TestCallLongerThanKeepalive/SSL_TCP
I20260927 06:54:45.666067 571 acceptor_pool.cc:254] collecting diagnostics on the listening RPC socket 0.0.0.0:33783 every 8 connection(s)
I20260927 06:54:45.666280 572 acceptor_pool.cc:254] collecting diagnostics on the listening RPC socket 0.0.0.0:33783 every 8 connection(s)
I20260927 06:54:45.701828 575 rpc-test-base.h:222] got call: sleep_micros: 3000000 deferred: true
I20260927 06:54:48.703832 575 rpcz_store.cc:275] Call kudu.rpc.GenericCalculatorService.Sleep from 127.0.0.1:45474 (request call id 0) took 3002 ms. Trace:
I20260927 06:54:48.704041 575 rpcz_store.cc:276] 0927 06:54:45.701711 (+ 0us) service_pool.cc:170] Inserting onto call queue
0927 06:54:45.701780 (+ 69us) service_pool.cc:227] Handling call
0927 06:54:48.703768 (+3001988us) inbound_call.cc:173] Queueing success response
Metrics: {}
[ OK ] Parameters/TestRpc.TestCallLongerThanKeepalive/SSL_TCP (3057 ms)
[ RUN ] Parameters/TestRpc.TestRpcSidecar/SSL_TCP
I20260927 06:54:48.727695 596 acceptor_pool.cc:254] collecting diagnostics on the listening RPC socket 0.0.0.0:35723 every 8 connection(s)
I20260927 06:54:48.727903 597 acceptor_pool.cc:254] collecting diagnostics on the listening RPC socket 0.0.0.0:35723 every 8 connection(s)
[ OK ] Parameters/TestRpc.TestRpcSidecar/SSL_TCP (119 ms)
[ RUN ] Parameters/TestRpc.TestRpcSidecarLimits/SSL_TCP
I20260927 06:54:51.284272 621 acceptor_pool.cc:254] collecting diagnostics on the listening RPC socket 0.0.0.0:41513 every 8 connection(s)
I20260927 06:54:51.284534 622 acceptor_pool.cc:254] collecting diagnostics on the listening RPC socket 0.0.0.0:41513 every 8 connection(s)
W20260927 06:54:51.322171 379 serialization.cc:72] Serialized kudu.rpc_test.PushStringsRequestPB (2147483654 bytes) is larger than the maximum configured RPC message size (52428800 bytes). Sending anyway, but peer may reject the data.
W20260927 06:54:51.329583 618 connection.cc:535] server connection from 127.0.0.1:43406 recv error: Network error: RPC frame had a length of 2147483714, but we only support messages up to 52428800 bytes long.
W20260927 06:54:51.329737 618 connection.cc:158] shutting down server connection from 127.0.0.1:43406 with pending inbound data: 4/2147483714 bytes received; last active 0 ns ago: status Network error: RPC frame had a length of 2147483714, but we only support messages up to 52428800 bytes long.
W20260927 06:54:51.330319 634 connection.cc:196] Error closing socket: Network error: TlsSocket::Close: Connection reset by peer
I20260927 06:54:51.343818 646 acceptor_pool.cc:254] collecting diagnostics on the listening RPC socket 0.0.0.0:33105 every 8 connection(s)
I20260927 06:54:51.344058 647 acceptor_pool.cc:254] collecting diagnostics on the listening RPC socket 0.0.0.0:33105 every 8 connection(s)
W20260927 06:54:57.032437 644 connection.cc:577] server connection from 127.0.0.1:55342: received bad data: 'Corruption: Invalid packet: message had a length of 2147483710, but we only support messages up to 2147483647 bytes
'
[ OK ] Parameters/TestRpc.TestRpcSidecarLimits/SSL_TCP (8709 ms)
[ RUN ] Parameters/TestRpc.TestCallTimeoutDoesntAffectNegotiation/SSL_TCP
I20260927 06:54:57.560518 671 acceptor_pool.cc:254] collecting diagnostics on the listening RPC socket 0.0.0.0:43345 every 8 connection(s)
I20260927 06:54:57.560829 672 acceptor_pool.cc:254] collecting diagnostics on the listening RPC socket 0.0.0.0:43345 every 8 connection(s)
W20260927 06:54:57.599792 667 negotiation.cc:266] Injecting 500ms delay in negotiation
I20260927 06:54:57.650347 379 rpc-test-base.h:595] status: Timed out: connection negotiation to 0.0.0.0:43345 for RPC Sleep timed out after 0.050s (ON_OUTBOUND_QUEUE), seconds elapsed: 0.0511959
[ OK ] Parameters/TestRpc.TestCallTimeoutDoesntAffectNegotiation/SSL_TCP (569 ms)
[ RUN ] Parameters/TestRpc.TestRpcHandlerLatencyMetric/SSL_TCP
I20260927 06:54:58.141933 696 acceptor_pool.cc:254] collecting diagnostics on the listening RPC socket 0.0.0.0:35143 every 8 connection(s)
I20260927 06:54:58.142161 697 acceptor_pool.cc:254] collecting diagnostics on the listening RPC socket 0.0.0.0:35143 every 8 connection(s)
I20260927 06:54:58.189383 379 rpc-test.cc:1236] Sleep() min lat: 20695
I20260927 06:54:58.189489 379 rpc-test.cc:1237] Sleep() mean lat: 20695
I20260927 06:54:58.189539 379 rpc-test.cc:1238] Sleep() max lat: 20695
I20260927 06:54:58.189565 379 rpc-test.cc:1239] Sleep() #calls: 1
[ OK ] Parameters/TestRpc.TestRpcHandlerLatencyMetric/SSL_TCP (83 ms)
[ RUN ] Parameters/TestRpc.TimedOutOnResponseMetricServiceQueue/SSL_TCP
I20260927 06:54:58.210650 722 acceptor_pool.cc:254] collecting diagnostics on the listening RPC socket 0.0.0.0:39509 every 8 connection(s)
I20260927 06:54:58.210865 723 acceptor_pool.cc:254] collecting diagnostics on the listening RPC socket 0.0.0.0:39509 every 8 connection(s)
W20260927 06:54:58.278312 724 rpcz_store.cc:267] Call kudu.rpc_test.CalculatorService.Sleep from 127.0.0.1:60214 (request call id 2) took 20 ms (client timeout 20 ms). Trace:
W20260927 06:54:58.278509 724 rpcz_store.cc:269] 0927 06:54:58.257844 (+ 0us) service_pool.cc:170] Inserting onto call queue
0927 06:54:58.278241 (+ 20397us) service_pool.cc:214] Skipping call since client already timed out
0927 06:54:58.278289 (+ 48us) inbound_call.cc:173] Queueing failure response
Metrics: {}
[ OK ] Parameters/TestRpc.TimedOutOnResponseMetricServiceQueue/SSL_TCP (88 ms)
[ RUN ] Parameters/TestRpc.RpcPendingConnectionsMetric/SSL_TCP
I20260927 06:54:58.287748 745 acceptor_pool.cc:254] collecting diagnostics on the listening RPC socket 0.0.0.0:38221 every 8 connection(s)
I20260927 06:54:58.287945 746 acceptor_pool.cc:254] collecting diagnostics on the listening RPC socket 0.0.0.0:38221 every 8 connection(s)
W20260927 06:54:58.298450 741 negotiation.cc:337] Failed RPC negotiation. Trace:
0927 06:54:58.297442 (+ 0us) reactor.cc:625] Submitting negotiation task for server connection from 127.0.0.1:41500 (local address 127.0.0.1:38221)
0927 06:54:58.297683 (+ 241us) server_negotiation.cc:206] Beginning negotiation
0927 06:54:58.297690 (+ 7us) server_negotiation.cc:399] Waiting for connection header
0927 06:54:58.297917 (+ 227us) negotiation.cc:327] Negotiation complete: Network error: Server connection negotiation failed: server connection from 127.0.0.1:41500: BlockingRecv error: recv got EOF from 127.0.0.1:41500 (error 108)
Metrics: {"server-negotiator.queue_time_us":72}
[ OK ] Parameters/TestRpc.RpcPendingConnectionsMetric/SSL_TCP (27 ms)
[ RUN ] Parameters/TestRpc.TestRpcContextClientDeadline/SSL_TCP
I20260927 06:54:58.320050 761 acceptor_pool.cc:254] collecting diagnostics on the listening RPC socket 0.0.0.0:35441 every 8 connection(s)
I20260927 06:54:58.320221 762 acceptor_pool.cc:254] collecting diagnostics on the listening RPC socket 0.0.0.0:35441 every 8 connection(s)
[ OK ] Parameters/TestRpc.TestRpcContextClientDeadline/SSL_TCP (63 ms)
[ RUN ] Parameters/TestRpc.TestApplicationFeatureFlagUnsupportedServer/SSL_TCP
I20260927 06:54:58.390688 786 acceptor_pool.cc:254] collecting diagnostics on the listening RPC socket 0.0.0.0:42327 every 8 connection(s)
I20260927 06:54:58.390883 787 acceptor_pool.cc:254] collecting diagnostics on the listening RPC socket 0.0.0.0:42327 every 8 connection(s)
[ OK ] Parameters/TestRpc.TestApplicationFeatureFlagUnsupportedServer/SSL_TCP (47 ms)
[ RUN ] Parameters/TestRpc.TestCancellationAsync/SSL_TCP
I20260927 06:54:58.440037 811 acceptor_pool.cc:254] collecting diagnostics on the listening RPC socket 0.0.0.0:33777 every 8 connection(s)
I20260927 06:54:58.440259 812 acceptor_pool.cc:254] collecting diagnostics on the listening RPC socket 0.0.0.0:33777 every 8 connection(s)
I20260927 06:54:58.441051 379 rpc-test.cc:1716] Connecting to 0.0.0.0:33777
I20260927 06:54:58.462569 379 test_util.cc:268] Using random seed: 1837138761
I20260927 06:54:58.498253 815 rpc-test-base.h:240] got call: sleep_micros: 500 pattern: 4294967295 num_repetitions: 2097152 sidecar_idx: 0
I20260927 06:54:58.519065 814 rpc-test-base.h:240] got call: sleep_micros: 500 pattern: 4294967295 num_repetitions: 2097152 sidecar_idx: 0
I20260927 06:54:58.545097 813 rpc-test-base.h:240] got call: sleep_micros: 500 pattern: 4294967295 num_repetitions: 2097152 sidecar_idx: 0
I20260927 06:54:58.572506 815 rpc-test-base.h:240] got call: sleep_micros: 500 pattern: 4294967295 num_repetitions: 2097152 sidecar_idx: 0
I20260927 06:54:58.599488 814 rpc-test-base.h:240] got call: sleep_micros: 500 pattern: 4294967295 num_repetitions: 2097152 sidecar_idx: 0
I20260927 06:54:58.635779 815 rpc-test-base.h:240] got call: sleep_micros: 500 pattern: 4294967295 num_repetitions: 2097152 sidecar_idx: 0
I20260927 06:54:58.669065 814 rpc-test-base.h:240] got call: sleep_micros: 500 pattern: 4294967295 num_repetitions: 2097152 sidecar_idx: 0
W20260927 06:54:58.691552 810 connection.cc:698] server connection from 127.0.0.1:40366 send error: Network error: failed to write to TLS socket: Broken pipe
W20260927 06:54:58.691725 810 connection.cc:441] server connection from 127.0.0.1:40366 torn down before Call kudu.rpc.GenericCalculatorService.SleepWithSidecar from 127.0.0.1:40366 (request call id 9) could send its response
W20260927 06:54:58.692059 810 connection.cc:196] Error closing socket: Network error: TlsSocket::Close: Success
W20260927 06:54:58.710517 810 connection.cc:441] server connection from 127.0.0.1:40366 torn down before Call kudu.rpc.GenericCalculatorService.SleepWithSidecar from 127.0.0.1:40366 (request call id 8) could send its response
[ OK ] Parameters/TestRpc.TestCancellationAsync/SSL_TCP (291 ms)
[ RUN ] Parameters/TestRpc.TestPerformanceBySocketType/SSL_TCP
I20260927 06:54:58.741863 836 acceptor_pool.cc:254] collecting diagnostics on the listening RPC socket 0.0.0.0:38853 every 8 connection(s)
I20260927 06:54:58.742105 837 acceptor_pool.cc:254] collecting diagnostics on the listening RPC socket 0.0.0.0:38853 every 8 connection(s)
I20260927 06:54:58.743049 379 rpc-test.cc:1846] Connecting to 0.0.0.0:38853
I20260927 06:55:01.875777 379 rpc-test.cc:1859] Sending 1024MB via ssl-enabled tcp socket: real 3.121s user 2.818s sys 2.248s
I20260927 06:55:04.966116 379 rpc-test.cc:1859] Sending 1024MB via ssl-enabled tcp socket: real 3.090s user 2.887s sys 2.115s
I20260927 06:55:08.026847 379 rpc-test.cc:1859] Sending 1024MB via ssl-enabled tcp socket: real 3.061s user 2.677s sys 2.254s
I20260927 06:55:11.064567 379 rpc-test.cc:1859] Sending 1024MB via ssl-enabled tcp socket: real 3.038s user 2.588s sys 2.311s
I20260927 06:55:14.067889 379 rpc-test.cc:1859] Sending 1024MB via ssl-enabled tcp socket: real 3.003s user 2.739s sys 2.123s
[ OK ] Parameters/TestRpc.TestPerformanceBySocketType/SSL_TCP (15361 ms)
[----------] 20 tests from Parameters/TestRpc (50332 ms total)
[----------] 1 test from Parameters/TestRpcSocketTxRxQueue
[ RUN ] Parameters/TestRpcSocketTxRxQueue.OverCapacity/0
W20260927 06:55:14.373955 871 negotiation.cc:337] Failed RPC negotiation. Trace:
0927 06:55:14.088515 (+ 0us) reactor.cc:625] Submitting negotiation task for client connection to 0.0.0.0:39707 (local address 127.0.0.1:56348)
0927 06:55:14.088670 (+ 155us) negotiation.cc:107] Waiting for socket to connect
0927 06:55:14.088685 (+ 15us) client_negotiation.cc:174] Beginning negotiation
0927 06:55:14.088775 (+ 90us) client_negotiation.cc:252] Sending NEGOTIATE NegotiatePB request
0927 06:55:14.373170 (+284395us) negotiation.cc:327] Negotiation complete: Network error: Client connection negotiation failed: client connection to 0.0.0.0:39707: BlockingRecv error: recv error from unknown peer: Transport endpoint is not connected (error 107)
Metrics: {"client-negotiator.queue_time_us":50}
W20260927 06:55:14.373951 862 negotiation.cc:337] Failed RPC negotiation. Trace:
0927 06:55:14.086138 (+ 0us) reactor.cc:625] Submitting negotiation task for client connection to 0.0.0.0:39707 (local address 127.0.0.1:56340)
0927 06:55:14.086294 (+ 156us) negotiation.cc:107] Waiting for socket to connect
0927 06:55:14.086311 (+ 17us) client_negotiation.cc:174] Beginning negotiation
0927 06:55:14.086414 (+ 103us) client_negotiation.cc:252] Sending NEGOTIATE NegotiatePB request
0927 06:55:14.373170 (+286756us) negotiation.cc:327] Negotiation complete: Network error: Client connection negotiation failed: client connection to 0.0.0.0:39707: BlockingRecv error: recv error from unknown peer: Transport endpoint is not connected (error 107)
Metrics: {"client-negotiator.queue_time_us":40}
W20260927 06:55:14.374753 898 negotiation.cc:337] Failed RPC negotiation. Trace:
0927 06:55:14.096161 (+ 0us) reactor.cc:625] Submitting negotiation task for client connection to 0.0.0.0:39707 (local address 127.0.0.1:56376)
0927 06:55:14.096378 (+ 217us) negotiation.cc:107] Waiting for socket to connect
0927 06:55:14.096391 (+ 13us) client_negotiation.cc:174] Beginning negotiation
0927 06:55:14.096475 (+ 84us) client_negotiation.cc:252] Sending NEGOTIATE NegotiatePB request
0927 06:55:14.373793 (+277318us) negotiation.cc:327] Negotiation complete: Network error: Client connection negotiation failed: client connection to 0.0.0.0:39707: BlockingRecv error: recv error from unknown peer: Transport endpoint is not connected (error 107)
Metrics: {"client-negotiator.queue_time_us":69}
W20260927 06:55:14.374831 853 negotiation.cc:337] Failed RPC negotiation. Trace:
0927 06:55:14.083297 (+ 0us) reactor.cc:625] Submitting negotiation task for client connection to 0.0.0.0:39707 (local address 127.0.0.1:56330)
0927 06:55:14.083473 (+ 176us) negotiation.cc:107] Waiting for socket to connect
0927 06:55:14.083490 (+ 17us) client_negotiation.cc:174] Beginning negotiation
0927 06:55:14.083603 (+ 113us) client_negotiation.cc:252] Sending NEGOTIATE NegotiatePB request
0927 06:55:14.373804 (+290201us) negotiation.cc:327] Negotiation complete: Network error: Client connection negotiation failed: client connection to 0.0.0.0:39707: BlockingRecv error: recv error from unknown peer: Transport endpoint is not connected (error 107)
Metrics: {"client-negotiator.queue_time_us":43}
W20260927 06:55:14.374944 880 negotiation.cc:337] Failed RPC negotiation. Trace:
0927 06:55:14.090901 (+ 0us) reactor.cc:625] Submitting negotiation task for client connection to 0.0.0.0:39707 (local address 127.0.0.1:56360)
0927 06:55:14.091064 (+ 163us) negotiation.cc:107] Waiting for socket to connect
0927 06:55:14.091081 (+ 17us) client_negotiation.cc:174] Beginning negotiation
0927 06:55:14.091171 (+ 90us) client_negotiation.cc:252] Sending NEGOTIATE NegotiatePB request
0927 06:55:14.373170 (+281999us) negotiation.cc:327] Negotiation complete: Network error: Client connection negotiation failed: client connection to 0.0.0.0:39707: BlockingRecv error: recv error from unknown peer: Transport endpoint is not connected (error 107)
Metrics: {"client-negotiator.queue_time_us":40}
W20260927 06:55:14.375079 889 negotiation.cc:337] Failed RPC negotiation. Trace:
0927 06:55:14.093405 (+ 0us) reactor.cc:625] Submitting negotiation task for client connection to 0.0.0.0:39707 (local address 127.0.0.1:56374)
0927 06:55:14.093544 (+ 139us) negotiation.cc:107] Waiting for socket to connect
0927 06:55:14.093556 (+ 12us) client_negotiation.cc:174] Beginning negotiation
0927 06:55:14.093648 (+ 92us) client_negotiation.cc:252] Sending NEGOTIATE NegotiatePB request
0927 06:55:14.374475 (+280827us) negotiation.cc:327] Negotiation complete: Network error: Client connection negotiation failed: client connection to 0.0.0.0:39707: BlockingRecv error: recv error from unknown peer: Transport endpoint is not connected (error 107)
Metrics: {"client-negotiator.queue_time_us":39}
[ OK ] Parameters/TestRpcSocketTxRxQueue.OverCapacity/0 (1078 ms)
[----------] 1 test from Parameters/TestRpcSocketTxRxQueue (1078 ms total)
[----------] Global test environment tear-down
[==========] 21 tests from 2 test suites ran. (51411 ms total)
[ PASSED ] 20 tests.
[ FAILED ] 1 test, listed below:
[ FAILED ] Parameters/TestRpc.TestCallWithChainCertAndChainCA/SSL_TCP, where GetParam() = (true, false)
1 FAILED TEST